directory-notifications mailing list archives

Site index · List index
Message view « Date » · « Thread »
Top « Date » · « Thread »
From Apache Jenkins Server <jenk...@builds.apache.org>
Subject Build failed in Jenkins: dir-apacheds-jdk16-ubuntu-deploy » ApacheDS Server Integration #937
Date Sat, 16 Mar 2013 13:49:08 GMT
See <https://builds.apache.org/job/dir-apacheds-jdk16-ubuntu-deploy/org.apache.directory.server$apacheds-server-integ/937/>

------------------------------------------
[...truncated 250 lines...]
(consumer2 completed) 
(consumer3 completed) 
(consumer1 completed) 
(consumer2 completed) 
(consumer3 completed) 
(consumer1 completed) 
(consumer2 completed) 
(consumer3 completed) 
(consumer1 completed) 
(consumer2 completed) 
(consumer3 completed) 
(consumer1 completed) 
(consumer2 completed) 
(consumer3 completed) 
(consumer1 completed) 
(consumer2 completed) 
(consumer3 completed) 
(consumer1 completed) 
(consumer2 completed) 
(consumer3 completed) 
(consumer1 completed) 
(consumer2 completed) 
(consumer3 completed) 
(consumer1 completed) 
(consumer2 completed) 
(consumer3 completed) 
(consumer1 completed) 
(consumer2 completed) 
(consumer3 completed) 
(consumer1 completed) 
(consumer2 completed) 
(consumer3 completed) 
(consumer1 completed) 
(consumer2 completed) 
(consumer3 completed) 
(consumer4 completed) 
(consumer1 completed) 
(consumer2 completed) 
(consumer3 completed) 
(consumer4 completed) 
(consumer1 completed) 
(consumer2 completed) 
(consumer3 completed) 
(consumer4 completed) 
(consumer1 completed) 
(consumer2 completed) 
(consumer3 completed) 
(consumer4 completed) 
(consumer1 completed) 
(consumer2 completed) 
(consumer3 completed) 
(consumer4 completed) 
(consumer1 completed) 
(consumer2 completed) 
(consumer3 completed) 
(consumer4 completed) 
(consumer1 completed) 
(consumer2 completed) 
(consumer3 completed) 
(consumer4 completed) 
(consumer1 completed) 
(consumer2 completed) 
(consumer3 completed) 
(consumer4 completed) 
(consumer1 completed) 
(consumer2 completed) 
(consumer3 completed) 
(consumer4 completed) 
(consumer1 completed) 
(consumer2 completed) 
(consumer3 completed) 
(consumer4 completed) 
(consumer1 completed) 
(consumer2 completed) 
(consumer3 completed) 
(consumer4 completed) 
(consumer1 completed) 
(consumer2 completed) 
(consumer3 completed) 
(consumer4 completed) 
(consumer1 completed) 
(consumer2 completed) 
(consumer3 completed) 
(consumer4 completed) 
(consumer1 completed) 
(consumer2 completed) 
(consumer3 completed) 
(consumer4 completed) 
(consumer1 completed) 
(consumer2 completed) 
(consumer3 completed) 
(consumer4 completed) 
(consumer1 completed) 
(consumer2 completed) 
(consumer3 completed) 
(consumer4 completed) 
(consumer1 completed) 
(consumer2 completed) 
(consumer3 completed) 
(consumer4 completed) 
(consumer1 completed) 
(consumer2 completed) 
(consumer3 completed) 
(consumer4 completed) 
(consumer1 completed) 
(consumer2 completed) 
(consumer3 completed) 
(consumer4 completed) 
(consumer1 completed) 
(consumer2 completed) 
(consumer3 completed) 
(consumer4 completed) 
(consumer1 completed) 
(consumer2 completed) 
(consumer3 completed) 
(consumer4 completed) 
(consumer1 completed) 
(consumer2 completed) 
(consumer3 completed) 
(consumer4 completed) 
(consumer1 completed) 
(consumer2 completed) 
(consumer3 completed) 
(consumer4 completed) 
(consumer1 completed) 
(consumer2 completed) 
(consumer3 completed) 
(consumer4 completed) 
(consumer1 completed) 
(consumer2 completed) 
(consumer3 completed) 
(consumer4 completed) 
(consumer1 completed) 
(consumer2 completed) 
(consumer3 completed) 
(consumer4 completed) 
(consumer1 completed) 
(consumer2 completed) 
(consumer3 completed) 
(consumer4 completed) 
(consumer1 completed) 
(consumer2 completed) 
(consumer3 completed) 
(consumer4 completed) 
(consumer1 completed) 
(consumer2 completed) 
(consumer3 completed) 
(consumer4 completed) 
(consumer1 completed) 
(consumer2 completed) 
(consumer3 completed) 
(consumer4 completed) 
(consumer1 completed) 
(consumer2 completed) 
(consumer3 completed) 
(consumer4 completed) 
(consumer1 completed) 
(consumer2 completed) 
(consumer3 completed) 
(consumer4 completed) 
(consumer1 completed) 
(consumer2 completed) 
(consumer3 completed) 
(consumer4 completed) 
(consumer1 completed) 
(consumer2 completed) 
(consumer3 completed) 
(consumer4 completed) 
(consumer1 completed) 
(consumer2 completed) 
(consumer3 completed) 
(consumer4 completed) 
(consumer1 completed) 
(consumer2 completed) 
(consumer3 completed) 
(consumer4 completed) 
(consumer1 completed) 
(consumer2 completed) 
(consumer3 completed) 
(consumer4 completed) 
(consumer1 completed) 
(consumer2 completed) 
(consumer3 completed) 
(consumer4 completed) 

---> Running testInitialRefreshLoad

NbAdded every 100ms : 
0, 21, 21, 21, 21, 21, 21, 21, 21, 21, 21, 21, 21, 21, 21, 21, 21, 21, 21, 21, 21, 21, 21,
21, 21, 21, 21, 21, 21, 21, 21, 21, 21, 21, 21, 21, 21, 21, 21, 21, 21, 21, 21, 21, 21, 21,
21, 21, 21, 21org.apache.directory.api.ldap.model.exception.LdapOperationErrorException: ERR_538
RecordManager has been closed
	at org.apache.directory.server.core.partition.impl.btree.AbstractBTreePartition.modify(AbstractBTreePartition.java:1173)
	at org.apache.directory.server.core.shared.partition.DefaultPartitionNexus.sync(DefaultPartitionNexus.java:335)
	at org.apache.directory.server.core.DefaultDirectoryService.shutdown(DefaultDirectoryService.java:1306)
	at org.apache.directory.server.replication.ClientInitialRefreshIT.tearDown(ClientInitialRefreshIT.java:122)
	at sun.reflect.NativeMethodAccessorImpl.invoke0(Native Method)
	at sun.reflect.NativeMethodAccessorImpl.invoke(NativeMethodAccessorImpl.java:39)
	at sun.reflect.DelegatingMethodAccessorImpl.invoke(DelegatingMethodAccessorImpl.java:25)
	at java.lang.reflect.Method.invoke(Method.java:597)
	at org.junit.runners.model.FrameworkMethod$1.runReflectiveCall(FrameworkMethod.java:47)
	at org.junit.internal.runners.model.ReflectiveCallable.run(ReflectiveCallable.java:12)
	at org.junit.runners.model.FrameworkMethod.invokeExplosively(FrameworkMethod.java:44)
	at org.junit.internal.runners.statements.RunAfters.evaluate(RunAfters.java:33)
	at org.junit.runners.ParentRunner.run(ParentRunner.java:309)
	at org.apache.maven.surefire.junit4.JUnit4Provider.execute(JUnit4Provider.java:252)
	at org.apache.maven.surefire.junit4.JUnit4Provider.executeTestSet(JUnit4Provider.java:141)
	at org.apache.maven.surefire.junit4.JUnit4Provider.invoke(JUnit4Provider.java:112)
	at sun.reflect.NativeMethodAccessorImpl.invoke0(Native Method)
	at sun.reflect.NativeMethodAccessorImpl.invoke(NativeMethodAccessorImpl.java:39)
	at sun.reflect.DelegatingMethodAccessorImpl.invoke(DelegatingMethodAccessorImpl.java:25)
	at java.lang.reflect.Method.invoke(Method.java:597)
	at org.apache.maven.surefire.util.ReflectionUtils.invokeMethodWithArray(ReflectionUtils.java:189)
	at org.apache.maven.surefire.booter.ProviderFactory$ProviderProxy.invoke(ProviderFactory.java:165)
	at org.apache.maven.surefire.booter.ProviderFactory.invokeProvider(ProviderFactory.java:85)
	at org.apache.maven.surefire.booter.ForkedBooter.runSuitesInProcess(ForkedBooter.java:113)
	at org.apache.maven.surefire.booter.ForkedBooter.main(ForkedBooter.java:75)
Caused by: org.apache.directory.api.ldap.model.exception.LdapException: ERR_538 RecordManager
has been closed
	at org.apache.directory.server.core.partition.impl.btree.AbstractBTreePartition.getEntryId(AbstractBTreePartition.java:2204)
	at org.apache.directory.server.core.partition.impl.btree.AbstractBTreePartition.modify(AbstractBTreePartition.java:1183)
	at org.apache.directory.server.core.partition.impl.btree.AbstractBTreePartition.modify(AbstractBTreePartition.java:1163)
	... 24 more
Caused by: java.lang.IllegalStateException: ERR_538 RecordManager has been closed
	at jdbm.recman.CacheRecordManager.checkIfClosed(CacheRecordManager.java:399)
	at jdbm.recman.CacheRecordManager.fetch(CacheRecordManager.java:257)
	at jdbm.btree.BTree.getRoot(BTree.java:552)
	at jdbm.btree.BTree.find(BTree.java:405)
	at org.apache.directory.server.core.partition.impl.btree.jdbm.JdbmTable.get(JdbmTable.java:325)
	at org.apache.directory.server.core.partition.impl.btree.jdbm.JdbmIndex.forwardLookup(JdbmIndex.java:353)
	at org.apache.directory.server.core.partition.impl.btree.jdbm.JdbmIndex.forwardLookup(JdbmIndex.java:59)
	at org.apache.directory.server.core.partition.impl.btree.AbstractBTreePartition.getEntryId(AbstractBTreePartition.java:2186)
	... 26 more
Tests run: 5, Failures: 3, Errors: 1, Skipped: 0, Time elapsed: 40.063 sec <<< FAILURE!
Running org.apache.directory.server.ssl.StartTlsConfidentialityIT
Tests run: 1, Failures: 0, Errors: 0, Skipped: 0, Time elapsed: 11.316 sec
Running org.apache.directory.server.ssl.StartTlsIT
Tests run: 1, Failures: 0, Errors: 0, Skipped: 0, Time elapsed: 8.455 sec
Running org.apache.directory.server.ssl.LdapsIT

Results :

Failed tests:   testInitialRefreshStopAndGo(org.apache.directory.server.replication.ClientInitialRefreshIT)
  testInitialRefresh4Consumers(org.apache.directory.server.replication.ClientInitialRefreshIT)
  testInitialRefreshLoad(org.apache.directory.server.replication.ClientInitialRefreshIT)

Tests in error: 
  org.apache.directory.server.replication.ClientServerReplicationIT: ERR_265 Grouping many
exceptions on root nexus sync()
  org.apache.directory.server.replication.ClientInitialRefreshIT: ERR_265 Grouping many exceptions
on root nexus sync()

Tests run: 398, Failures: 3, Errors: 2, Skipped: 12

[JENKINS] Recording test results

Mime
View raw message