directory-notifications mailing list archives

Site index · List index
Message view « Date » · « Thread »
Top « Date » · « Thread »
From Apache Jenkins Server <jenk...@builds.apache.org>
Subject Build failed in Jenkins: dir-apacheds-jdk16-win #334
Date Tue, 26 Feb 2013 05:22:02 GMT
See <https://builds.apache.org/job/dir-apacheds-jdk16-win/334/>

------------------------------------------
[...truncated 3163 lines...]
Running org.apache.directory.server.kerberos.PasswordPolicyServiceIT
Tests run: 1, Failures: 0, Errors: 0, Skipped: 1, Time elapsed: 0.001 sec
Running org.apache.directory.server.operations.add.AddAliasIT
Tests run: 3, Failures: 0, Errors: 0, Skipped: 0, Time elapsed: 11.763 sec
Running org.apache.directory.server.operations.add.AddingEntriesWithSpecialCharactersInRDNIT
Tests run: 9, Failures: 0, Errors: 0, Skipped: 0, Time elapsed: 19.672 sec
Running org.apache.directory.server.operations.add.AddIT
Tests run: 31, Failures: 0, Errors: 0, Skipped: 0, Time elapsed: 38.422 sec
Running org.apache.directory.server.operations.bind.BindIT
Tests run: 5, Failures: 0, Errors: 0, Skipped: 0, Time elapsed: 15.757 sec
Running org.apache.directory.server.operations.bind.DelegatedAuthIT
Tests run: 2, Failures: 0, Errors: 0, Skipped: 0, Time elapsed: 24.286 sec
Running org.apache.directory.server.operations.bind.MiscBindIT
Tests run: 6, Failures: 0, Errors: 0, Skipped: 0, Time elapsed: 15.165 sec
Running org.apache.directory.server.operations.bind.SaslBindIT
Tests run: 17, Failures: 0, Errors: 0, Skipped: 5, Time elapsed: 25.433 sec
Running org.apache.directory.server.operations.bind.SimpleBindIT
Tests run: 10, Failures: 0, Errors: 0, Skipped: 0, Time elapsed: 16.991 sec
Running org.apache.directory.server.operations.compare.CompareIT
Tests run: 7, Failures: 0, Errors: 0, Skipped: 0, Time elapsed: 14.328 sec
Running org.apache.directory.server.operations.compare.MatchingRuleCompareIT
Tests run: 2, Failures: 0, Errors: 0, Skipped: 0, Time elapsed: 9.715 sec
Running org.apache.directory.server.operations.delete.DeleteAliasIT
Tests run: 2, Failures: 0, Errors: 0, Skipped: 0, Time elapsed: 8.693 sec
Running org.apache.directory.server.operations.delete.DeleteIT
Tests run: 8, Failures: 0, Errors: 0, Skipped: 0, Time elapsed: 15.416 sec
Running org.apache.directory.server.operations.extended.ExtendedIT
Tests run: 1, Failures: 0, Errors: 0, Skipped: 0, Time elapsed: 7.556 sec
Running org.apache.directory.server.operations.extended.StoredProcedureIT
Tests run: 2, Failures: 0, Errors: 0, Skipped: 2, Time elapsed: 6.331 sec
Running org.apache.directory.server.operations.ldapsdk.AddIT
Tests run: 30, Failures: 0, Errors: 0, Skipped: 0, Time elapsed: 63.515 sec
Running org.apache.directory.server.operations.ldapsdk.BindIT
Tests run: 5, Failures: 0, Errors: 0, Skipped: 0, Time elapsed: 17.493 sec
Running org.apache.directory.server.operations.ldapsdk.CompareIT
Tests run: 7, Failures: 0, Errors: 0, Skipped: 0, Time elapsed: 16.371 sec
Running org.apache.directory.server.operations.ldapsdk.DeleteIT
Tests run: 8, Failures: 0, Errors: 0, Skipped: 0, Time elapsed: 21.561 sec
Running org.apache.directory.server.operations.ldapsdk.IllegalModificationIT
Tests run: 2, Failures: 0, Errors: 0, Skipped: 0, Time elapsed: 8.173 sec
Running org.apache.directory.server.operations.ldapsdk.ModifyDnReferralIT
Tests run: 7, Failures: 0, Errors: 0, Skipped: 0, Time elapsed: 16.451 sec
Running org.apache.directory.server.operations.ldapsdk.ModifyReferralIT
Tests run: 4, Failures: 0, Errors: 0, Skipped: 0, Time elapsed: 12.506 sec
Running org.apache.directory.server.operations.lookup.LookupIT
Tests run: 3, Failures: 0, Errors: 0, Skipped: 0, Time elapsed: 11.914 sec
Running org.apache.directory.server.operations.modify.IllegalModificationIT
Tests run: 2, Failures: 0, Errors: 0, Skipped: 0, Time elapsed: 11.135 sec
Running org.apache.directory.server.operations.modify.ModifyAddIT
Tests run: 16, Failures: 0, Errors: 0, Skipped: 0, Time elapsed: 26.966 sec
Running org.apache.directory.server.operations.modify.ModifyMultipleChangesIT
Tests run: 2, Failures: 0, Errors: 0, Skipped: 0, Time elapsed: 11.221 sec
Running org.apache.directory.server.operations.modify.ModifyReferralIT
Tests run: 4, Failures: 0, Errors: 0, Skipped: 0, Time elapsed: 12.788 sec
Running org.apache.directory.server.operations.modify.ModifyRemoveIT
Tests run: 16, Failures: 0, Errors: 0, Skipped: 0, Time elapsed: 28.457 sec
Running org.apache.directory.server.operations.modify.ModifyReplaceIT
Tests run: 7, Failures: 0, Errors: 0, Skipped: 0, Time elapsed: 17.859 sec
Running org.apache.directory.server.operations.modifydn.ModifyDnReferralIT
Tests run: 7, Failures: 0, Errors: 0, Skipped: 0, Time elapsed: 18.765 sec
Running org.apache.directory.server.operations.modifydn.ModifyRdnIT
Tests run: 19, Failures: 0, Errors: 0, Skipped: 2, Time elapsed: 39.017 sec
Running org.apache.directory.server.operations.modifydn.MoveIT
Tests run: 4, Failures: 0, Errors: 0, Skipped: 0, Time elapsed: 8.133 sec
Running org.apache.directory.server.operations.search.IndexedNegationSearchIT
Tests run: 3, Failures: 0, Errors: 0, Skipped: 0, Time elapsed: 16.716 sec
Running org.apache.directory.server.operations.search.NegationSearchIT
Tests run: 2, Failures: 0, Errors: 0, Skipped: 0, Time elapsed: 6.485 sec
Running org.apache.directory.server.operations.search.PagedSearchIT
Tests run: 37, Failures: 0, Errors: 0, Skipped: 0, Time elapsed: 53.138 sec
Running org.apache.directory.server.operations.search.PersistentSearchIT
Tests run: 9, Failures: 0, Errors: 0, Skipped: 0, Time elapsed: 30.348 sec
Running org.apache.directory.server.operations.search.ReferralSearchIT
Tests run: 7, Failures: 0, Errors: 0, Skipped: 0, Time elapsed: 9.697 sec
Running org.apache.directory.server.operations.search.ReferralSearchMoveAndRenameIT
Tests run: 1, Failures: 0, Errors: 0, Skipped: 0, Time elapsed: 0.941 sec
Running org.apache.directory.server.operations.search.ReferralSearchNoRevertIT
Tests run: 1, Failures: 0, Errors: 0, Skipped: 0, Time elapsed: 15.294 sec
Running org.apache.directory.server.operations.search.SchemaSearchIT
Tests run: 5, Failures: 0, Errors: 0, Skipped: 0, Time elapsed: 8.247 sec
Running org.apache.directory.server.operations.search.SearchIT

Results :

Tests run: 329, Failures: 0, Errors: 0, Skipped: 12

[WARNING] Could not delete temp direcotry F:\hudson\hudson-slave\workspace\dir-apacheds-jdk16-win\trunk\server-integ\target\surefire
because File F:\hudson\hudson-slave\workspace\dir-apacheds-jdk16-win\trunk\server-integ\target\surefire\surefirebooter7506343472754448365.jar
unable to be deleted.
[JENKINS] Recording test results
[INFO] ------------------------------------------------------------------------
[INFO] Reactor Summary:
[INFO] 
[INFO] ApacheDS .......................................... SUCCESS [5.257s]
[INFO] ApacheDS I18n ..................................... SUCCESS [4.992s]
[INFO] ApacheDS Core Constants ........................... SUCCESS [1.316s]
[INFO] ApacheDS Core API ................................. SUCCESS [26.935s]
[INFO] ApacheDS Core Shared .............................. SUCCESS [3.157s]
[INFO] ApacheDS Interceptors ............................. SUCCESS [0.108s]
[INFO] ApacheDS AdministrativePoint Interceptor .......... SUCCESS [2.256s]
[INFO] ApacheDS Authentication Interceptor ............... SUCCESS [4.758s]
[INFO] ApacheDS Authorization Interceptor ................ SUCCESS [5.742s]
[INFO] ApacheDS ChangeLog Interceptor .................... SUCCESS [3.197s]
[INFO] ApacheDS Collective Attribute Interceptor ......... SUCCESS [1.469s]
[INFO] ApacheDS Event Interceptor ........................ SUCCESS [1.808s]
[INFO] ApacheDS Exception Interceptor .................... SUCCESS [1.239s]
[INFO] ApacheDS Journal Interceptor ...................... SUCCESS [1.464s]
[INFO] ApacheDS Normalization Interceptor ................ SUCCESS [3.109s]
[INFO] ApacheDS Operational Attribute Interceptor ........ SUCCESS [1.323s]
[INFO] ApacheDS Referral Interceptor ..................... SUCCESS [1.304s]
[INFO] ApacheDS Schema Interceptor ....................... SUCCESS [8.951s]
[INFO] ApacheDS Subtree Interceptor ...................... SUCCESS [10.963s]
[INFO] ApacheDS Triggers Interceptor ..................... SUCCESS [2.015s]
[INFO] ApacheDS Core ..................................... SUCCESS [5.665s]
[INFO] ApacheDS Core AVL ................................. SUCCESS [21.459s]
[INFO] ApacheDS Generalized (X) DBM Partition ............ SUCCESS [42.912s]
[INFO] ApacheDS LDIF Partition ........................... SUCCESS [20.695s]
[INFO] ApacheDS JDBM Partition ........................... SUCCESS [41.505s]
[INFO] ApacheDS Core Annotations ......................... SUCCESS [48.559s]
[INFO] ApacheDS Core JNDI ................................ SUCCESS [2.602s]
[INFO] ApacheDS Protocol Kerberos Codec .................. SUCCESS [28.035s]
[INFO] ApacheDS Interceptors for Kerberos ................ SUCCESS [1.836s]
[INFO] ApacheDS Protocol Dhcp ............................ SUCCESS [2.794s]
[INFO] ApacheDS Protocol Shared .......................... SUCCESS [2.266s]
[INFO] ApacheDS Protocol Dns ............................. SUCCESS [4.007s]
[INFO] ApacheDS Protocol Kerberos ........................ SUCCESS [5.811s]
[INFO] ApacheDS Protocol Ldap ............................ SUCCESS [1:23.264s]
[INFO] ApacheDS Protocol Ntp ............................. SUCCESS [4.871s]
[INFO] Apacheds Server Annotations ....................... SUCCESS [59.485s]
[INFO] ApacheDS Server Config ............................ SUCCESS [36.819s]
[INFO] ApacheDS Server JNDI .............................. SUCCESS [5.657s]
[INFO] ApacheDS Test Framework ........................... SUCCESS [2:15.198s]
[INFO] ApacheDS All ...................................... SUCCESS [12.533s]
[INFO] ApacheDS Logger Interceptor ....................... SUCCESS [2.013s]
[INFO] ApacheDS Password Hashing Interceptor ............. SUCCESS [2.224s]
[INFO] ApacheDS Core Integration ......................... SUCCESS [37:09.420s]
[INFO] ApacheDS Server Integration ....................... FAILURE [30:53.876s]
[INFO] ApacheDS DirectoryService-WebApp bridge ........... SKIPPED
[INFO] ApacheDS Jetty HTTP Server Integration ............ SKIPPED
[INFO] ApacheDS Service Builder .......................... SKIPPED
[INFO] ApacheDS Protocol Kerberos Test ................... SKIPPED
[INFO] Apache Directory LDAP Client API test ............. SKIPPED
[INFO] ApacheDS Service .................................. SKIPPED
[INFO] ApacheDS Wrapper .................................. SKIPPED
[INFO] ApacheDS Installers Maven Plugin .................. SKIPPED
[INFO] ApacheDS Installers ............................... SKIPPED
[INFO] ------------------------------------------------------------------------
[INFO] BUILD FAILURE
[INFO] ------------------------------------------------------------------------
[INFO] Total time: 1:19:11.328s
[INFO] Finished at: Tue Feb 26 05:21:13 GMT 2013
[INFO] Final Memory: 53M/230M
[INFO] ------------------------------------------------------------------------
[JENKINS] Archiving disabled
[JENKINS] Archiving disabled
[JENKINS] Archiving disabled
[JENKINS] Archiving disabled
[JENKINS] Archiving disabled
[JENKINS] Archiving disabled
[JENKINS] Archiving disabled
[JENKINS] Archiving disabled
[JENKINS] Archiving disabled
[JENKINS] Archiving disabled
[JENKINS] Archiving disabled
[JENKINS] Archiving disabled
[JENKINS] Archiving disabled
[JENKINS] Archiving disabled
[JENKINS] Archiving disabled
[JENKINS] Archiving disabled
[JENKINS] Archiving disabled
[JENKINS] Archiving disabled
[JENKINS] Archiving disabled
[JENKINS] Archiving disabled
[JENKINS] Archiving disabled
[JENKINS] Archiving disabled
[JENKINS] Archiving disabled
[JENKINS] Archiving disabled
[JENKINS] Archiving disabled
[JENKINS] Archiving disabled
[JENKINS] Archiving disabled
[JENKINS] Archiving disabled
[JENKINS] Archiving disabled
[JENKINS] Archiving disabled
[JENKINS] Archiving disabled
[JENKINS] Archiving disabled
[JENKINS] Archiving disabled
[JENKINS] Archiving disabled
[JENKINS] Archiving disabled
[JENKINS] Archiving disabled
[JENKINS] Archiving disabled
[JENKINS] Archiving disabled
[JENKINS] Archiving disabled
[JENKINS] Archiving disabled
[JENKINS] Archiving disabled
[JENKINS] Archiving disabled
[JENKINS] Archiving disabled
[JENKINS] Archiving disabled
[JENKINS] Archiving disabled
[JENKINS] Archiving disabled
[JENKINS] Archiving disabled
[JENKINS] Archiving disabled
[JENKINS] Archiving disabled
[JENKINS] Archiving disabled
[JENKINS] Archiving disabled
[JENKINS] Archiving disabled
[JENKINS] Archiving disabled
Waiting for Jenkins to finish collecting data
mavenExecutionResult exceptions not empty
message : Failed to execute goal org.apache.maven.plugins:maven-surefire-plugin:2.12.2:test
(default-test) on project apacheds-server-integ: Failure or timeout
cause : Failure or timeout
Stack trace : 
org.apache.maven.lifecycle.LifecycleExecutionException: Failed to execute goal org.apache.maven.plugins:maven-surefire-plugin:2.12.2:test
(default-test) on project apacheds-server-integ: Failure or timeout
	at org.apache.maven.lifecycle.internal.MojoExecutor.execute(MojoExecutor.java:217)
	at org.apache.maven.lifecycle.internal.MojoExecutor.execute(MojoExecutor.java:153)
	at org.apache.maven.lifecycle.internal.MojoExecutor.execute(MojoExecutor.java:145)
	at org.apache.maven.lifecycle.internal.LifecycleModuleBuilder.buildProject(LifecycleModuleBuilder.java:84)
	at org.apache.maven.lifecycle.internal.LifecycleModuleBuilder.buildProject(LifecycleModuleBuilder.java:59)
	at org.apache.maven.lifecycle.internal.LifecycleStarter.singleThreadedBuild(LifecycleStarter.java:183)
	at org.apache.maven.lifecycle.internal.LifecycleStarter.execute(LifecycleStarter.java:161)
	at org.apache.maven.DefaultMaven.doExecute(DefaultMaven.java:319)
	at org.apache.maven.DefaultMaven.execute(DefaultMaven.java:156)
	at org.jvnet.hudson.maven3.launcher.Maven3Launcher.main(Maven3Launcher.java:79)
	at sun.reflect.NativeMethodAccessorImpl.invoke0(Native Method)
	at sun.reflect.NativeMethodAccessorImpl.invoke(NativeMethodAccessorImpl.java:39)
	at sun.reflect.DelegatingMethodAccessorImpl.invoke(DelegatingMethodAccessorImpl.java:25)
	at java.lang.reflect.Method.invoke(Method.java:597)
	at org.codehaus.plexus.classworlds.launcher.Launcher.launchStandard(Launcher.java:329)
	at org.codehaus.plexus.classworlds.launcher.Launcher.launch(Launcher.java:239)
	at org.jvnet.hudson.maven3.agent.Maven3Main.launch(Maven3Main.java:158)
	at hudson.maven.Maven3Builder.call(Maven3Builder.java:100)
	at hudson.maven.Maven3Builder.call(Maven3Builder.java:66)
	at hudson.remoting.UserRequest.perform(UserRequest.java:118)
	at hudson.remoting.UserRequest.perform(UserRequest.java:48)
	at hudson.remoting.Request$2.run(Request.java:326)
	at hudson.remoting.InterceptingExecutorService$1.call(InterceptingExecutorService.java:72)
	at java.util.concurrent.FutureTask$Sync.innerRun(FutureTask.java:303)
	at java.util.concurrent.FutureTask.run(FutureTask.java:138)
	at java.util.concurrent.ThreadPoolExecutor$Worker.runTask(ThreadPoolExecutor.java:886)
	at java.util.concurrent.ThreadPoolExecutor$Worker.run(ThreadPoolExecutor.java:908)
	at java.lang.Thread.run(Thread.java:662)
Caused by: org.apache.maven.plugin.MojoExecutionException: Failure or timeout
	at org.apache.maven.plugin.surefire.SurefirePlugin.assertNoFailureOrTimeout(SurefirePlugin.java:177)
	at org.apache.maven.plugin.surefire.SurefirePlugin.handleSummary(SurefirePlugin.java:158)
	at org.apache.maven.plugin.surefire.AbstractSurefireMojo.executeAfterPreconditionsChecked(AbstractSurefireMojo.java:626)
	at org.apache.maven.plugin.surefire.AbstractSurefireMojo.execute(AbstractSurefireMojo.java:587)
	at org.apache.maven.plugin.DefaultBuildPluginManager.executeMojo(DefaultBuildPluginManager.java:107)
	at org.apache.maven.lifecycle.internal.MojoExecutor.execute(MojoExecutor.java:209)
	... 27 more
Sending e-mails to: notifications@directory.apache.org
channel stopped
Process leaked file descriptors. See http://wiki.jenkins-ci.org/display/JENKINS/Spawning+processes+from+build
for more information

Mime
View raw message