directory-notifications mailing list archives

Site index · List index
Message view « Date » · « Thread »
Top « Date » · « Thread »
From Apache Jenkins Server <jenk...@builds.apache.org>
Subject Build failed in Jenkins: dir-apacheds-jdk16-ubuntu-deploy » ApacheDS Server Integration #907
Date Thu, 14 Feb 2013 05:41:37 GMT
See <https://builds.apache.org/job/dir-apacheds-jdk16-ubuntu-deploy/org.apache.directory.server$apacheds-server-integ/907/>

------------------------------------------
[...truncated 33 lines...]
[INFO] Copying 0 resource
[INFO] Copying 3 resources
mojoSucceeded org.apache.maven.plugins:maven-resources-plugin:2.5(default-resources)
mojoStarted org.apache.maven.plugins:maven-compiler-plugin:2.5.1(default-compile)
[INFO] 
[INFO] --- maven-compiler-plugin:2.5.1:compile (default-compile) @ apacheds-server-integ ---
[INFO] Compiling 1 source file to <https://builds.apache.org/job/dir-apacheds-jdk16-ubuntu-deploy/org.apache.directory.server$apacheds-server-integ/ws/target/classes>
mojoSucceeded org.apache.maven.plugins:maven-compiler-plugin:2.5.1(default-compile)
mojoStarted org.apache.maven.plugins:maven-dependency-plugin:2.5(copy)[INFO] Configured Artifact:
org.apache.directory.api:api-ldap-extras-codec:?:jar
[INFO] Copying api-ldap-extras-codec-1.0.0-M16-SNAPSHOT.jar to <https://builds.apache.org/job/dir-apacheds-jdk16-ubuntu-deploy/org.apache.directory.server$apacheds-server-integ/ws/target/pluginDirectory/api-ldap-extras-codec-1.0.0-M16-20130214.033712-23.jar>

[INFO] 
[INFO] --- maven-dependency-plugin:2.5:copy (copy) @ apacheds-server-integ ---
mojoSucceeded org.apache.maven.plugins:maven-dependency-plugin:2.5(copy)
[debug] execute contextualize
mojoStarted org.apache.maven.plugins:maven-resources-plugin:2.5(default-testResources)[INFO]
Using 'UTF-8' encoding to copy filtered resources.

[INFO] 
[INFO] --- maven-resources-plugin:2.5:testResources (default-testResources) @ apacheds-server-integ
---
[INFO] Copying 7 resources
[INFO] Copying 3 resources
mojoSucceeded org.apache.maven.plugins:maven-resources-plugin:2.5(default-testResources)
mojoStarted org.apache.maven.plugins:maven-compiler-plugin:2.5.1(default-testCompile)
[INFO] 
[INFO] --- maven-compiler-plugin:2.5.1:testCompile (default-testCompile) @ apacheds-server-integ
---
[INFO] Compiling 70 source files to <https://builds.apache.org/job/dir-apacheds-jdk16-ubuntu-deploy/org.apache.directory.server$apacheds-server-integ/ws/target/test-classes>
mojoSucceeded org.apache.maven.plugins:maven-compiler-plugin:2.5.1(default-testCompile)
mojoStarted org.apache.maven.plugins:maven-surefire-plugin:2.12.2(default-test)[INFO] Surefire
report directory: <https://builds.apache.org/job/dir-apacheds-jdk16-ubuntu-deploy/org.apache.directory.server$apacheds-server-integ/ws/target/surefire-reports>

-------------------------------------------------------
 T E S T S
-------------------------------------------------------

[INFO] 
[INFO] --- maven-surefire-plugin:2.12.2:test (default-test) @ apacheds-server-integ ---
Running org.apache.directory.dsml.engine.Dsmlv2EngineIT
Tests run: 2, Failures: 0, Errors: 0, Skipped: 0, Time elapsed: 9.747 sec
Running org.apache.directory.server.schema.SchemaIT
Tests run: 3, Failures: 0, Errors: 0, Skipped: 0, Time elapsed: 32.076 sec
Running org.apache.directory.server.operations.add.AddAliasIT
Tests run: 3, Failures: 0, Errors: 0, Skipped: 0, Time elapsed: 17.129 sec
Running org.apache.directory.server.operations.add.AddIT
Tests run: 31, Failures: 0, Errors: 0, Skipped: 0, Time elapsed: 55.165 sec
Running org.apache.directory.server.operations.add.AddingEntriesWithSpecialCharactersInRDNIT
Tests run: 9, Failures: 0, Errors: 0, Skipped: 0, Time elapsed: 21.532 sec
Running org.apache.directory.server.operations.delete.DeleteIT
Tests run: 8, Failures: 0, Errors: 0, Skipped: 0, Time elapsed: 17.367 sec
Running org.apache.directory.server.operations.delete.DeleteAliasIT
Tests run: 2, Failures: 0, Errors: 0, Skipped: 0, Time elapsed: 10.839 sec
Running org.apache.directory.server.operations.compare.CompareIT
Tests run: 7, Failures: 0, Errors: 0, Skipped: 0, Time elapsed: 15.108 sec
Running org.apache.directory.server.operations.compare.MatchingRuleCompareIT
Tests run: 2, Failures: 0, Errors: 0, Skipped: 0, Time elapsed: 11.427 sec
Running org.apache.directory.server.operations.extended.StoredProcedureIT
Tests run: 2, Failures: 0, Errors: 0, Skipped: 2, Time elapsed: 6.678 sec
Running org.apache.directory.server.operations.extended.ExtendedIT
Tests run: 1, Failures: 0, Errors: 0, Skipped: 0, Time elapsed: 7.55 sec
Running org.apache.directory.server.operations.modify.IllegalModificationIT
Tests run: 2, Failures: 0, Errors: 0, Skipped: 0, Time elapsed: 8.991 sec
Running org.apache.directory.server.operations.modify.ModifyReferralIT
Tests run: 4, Failures: 0, Errors: 0, Skipped: 0, Time elapsed: 12.878 sec
Running org.apache.directory.server.operations.modify.ModifyRemoveIT
Tests run: 16, Failures: 0, Errors: 0, Skipped: 0, Time elapsed: 27.88 sec
Running org.apache.directory.server.operations.modify.ModifyAddIT
Tests run: 16, Failures: 0, Errors: 0, Skipped: 0, Time elapsed: 26.074 sec
Running org.apache.directory.server.operations.modify.ModifyReplaceIT
Tests run: 7, Failures: 0, Errors: 0, Skipped: 0, Time elapsed: 15.042 sec
Running org.apache.directory.server.operations.modify.ModifyMultipleChangesIT
Tests run: 2, Failures: 0, Errors: 0, Skipped: 0, Time elapsed: 12.313 sec
Running org.apache.directory.server.operations.lookup.LookupIT
Tests run: 3, Failures: 0, Errors: 0, Skipped: 0, Time elapsed: 9.993 sec
Running org.apache.directory.server.operations.bind.BindIT
Tests run: 5, Failures: 0, Errors: 0, Skipped: 0, Time elapsed: 15.334 sec
Running org.apache.directory.server.operations.bind.SaslBindIT
Tests run: 17, Failures: 0, Errors: 0, Skipped: 5, Time elapsed: 25.035 sec
Running org.apache.directory.server.operations.bind.SimpleBindIT
Tests run: 9, Failures: 0, Errors: 0, Skipped: 0, Time elapsed: 18.473 sec
Running org.apache.directory.server.operations.bind.MiscBindIT
Tests run: 6, Failures: 0, Errors: 0, Skipped: 0, Time elapsed: 17.39 sec
Running org.apache.directory.server.operations.bind.DelegatedAuthIT
Tests run: 2, Failures: 0, Errors: 0, Skipped: 0, Time elapsed: 24.234 sec
Running org.apache.directory.server.operations.ldapsdk.IllegalModificationIT
Tests run: 2, Failures: 0, Errors: 0, Skipped: 0, Time elapsed: 7.028 sec
Running org.apache.directory.server.operations.ldapsdk.BindIT
Tests run: 5, Failures: 0, Errors: 0, Skipped: 0, Time elapsed: 15.792 sec
Running org.apache.directory.server.operations.ldapsdk.ModifyReferralIT
Tests run: 4, Failures: 0, Errors: 0, Skipped: 0, Time elapsed: 18.079 sec
Running org.apache.directory.server.operations.ldapsdk.CompareIT
Tests run: 7, Failures: 0, Errors: 0, Skipped: 0, Time elapsed: 15.464 sec
Running org.apache.directory.server.operations.ldapsdk.ModifyDnReferralIT
Tests run: 7, Failures: 0, Errors: 0, Skipped: 0, Time elapsed: 15.685 sec
Running org.apache.directory.server.operations.ldapsdk.DeleteIT
Tests run: 8, Failures: 0, Errors: 0, Skipped: 0, Time elapsed: 19.373 sec
Running org.apache.directory.server.operations.ldapsdk.AddIT
Tests run: 30, Failures: 0, Errors: 0, Skipped: 0, Time elapsed: 73.615 sec
Running org.apache.directory.server.operations.modifydn.MoveIT
Tests run: 4, Failures: 0, Errors: 0, Skipped: 0, Time elapsed: 13.734 sec
Running org.apache.directory.server.operations.modifydn.ModifyDnReferralIT
Tests run: 7, Failures: 0, Errors: 0, Skipped: 0, Time elapsed: 15.508 sec
Running org.apache.directory.server.operations.modifydn.ModifyRdnIT
Tests run: 19, Failures: 0, Errors: 0, Skipped: 2, Time elapsed: 25.611 sec
Running org.apache.directory.server.operations.search.SearchLimitsIT
Tests run: 15, Failures: 0, Errors: 0, Skipped: 0, Time elapsed: 28.922 sec
Running org.apache.directory.server.operations.search.ReferralSearchMoveAndRenameIT
Tests run: 1, Failures: 0, Errors: 0, Skipped: 0, Time elapsed: 11.902 sec
Running org.apache.directory.server.operations.search.ReferralSearchNoRevertIT
Tests run: 1, Failures: 0, Errors: 0, Skipped: 0, Time elapsed: 13.809 sec
Running org.apache.directory.server.operations.search.NegationSearchIT
Tests run: 2, Failures: 0, Errors: 0, Skipped: 0, Time elapsed: 11.024 sec
Running org.apache.directory.server.operations.search.SchemaSearchIT
Tests run: 5, Failures: 0, Errors: 0, Skipped: 0, Time elapsed: 12.61 sec
Running org.apache.directory.server.operations.search.PersistentSearchIT
Tests run: 9, Failures: 0, Errors: 0, Skipped: 0, Time elapsed: 21.155 sec
Running org.apache.directory.server.operations.search.IndexedNegationSearchIT
Tests run: 3, Failures: 0, Errors: 0, Skipped: 0, Time elapsed: 13.393 sec
Running org.apache.directory.server.operations.search.SearchIT
Tests run: 42, Failures: 0, Errors: 1, Skipped: 1, Time elapsed: 807.745 sec <<<
FAILURE!
Running org.apache.directory.server.operations.search.PagedSearchIT
Tests run: 37, Failures: 0, Errors: 0, Skipped: 0, Time elapsed: 48.93 sec
Running org.apache.directory.server.operations.search.ReferralSearchIT
Tests run: 7, Failures: 0, Errors: 0, Skipped: 0, Time elapsed: 24.119 sec
Running org.apache.directory.server.replication.StaleEventLogDetectionIT

---> Running testDeleteStaleEventLog

NbAdded every 100ms : 
0, 11
<-- Done
Tests run: 1, Failures: 0, Errors: 0, Skipped: 0, Time elapsed: 39.006 sec
Running org.apache.directory.server.replication.ClientServerReplicationIT
org.apache.directory.api.ldap.model.exception.LdapConfigurationException: ERR_171 Failed to
bind an LDAP service (17,000) to the service registry.
	at org.apache.directory.server.ldap.LdapServer.startNetwork(LdapServer.java:683)
	at org.apache.directory.server.ldap.LdapServer.start(LdapServer.java:515)
	at org.apache.directory.server.factory.ServerAnnotationProcessor.createLdapServer(ServerAnnotationProcessor.java:305)
	at org.apache.directory.server.factory.ServerAnnotationProcessor.getLdapServer(ServerAnnotationProcessor.java:235)
	at org.apache.directory.server.replication.ClientServerReplicationIT.startConsumer(ClientServerReplicationIT.java:609)
	at org.apache.directory.server.replication.ClientServerReplicationIT.setUp(ClientServerReplicationIT.java:97)
	at sun.reflect.NativeMethodAccessorImpl.invoke0(Native Method)
	at sun.reflect.NativeMethodAccessorImpl.invoke(NativeMethodAccessorImpl.java:39)
	at sun.reflect.DelegatingMethodAccessorImpl.invoke(DelegatingMethodAccessorImpl.java:25)
	at java.lang.reflect.Method.invoke(Method.java:597)
	at org.junit.runners.model.FrameworkMethod$1.runReflectiveCall(FrameworkMethod.java:47)
	at org.junit.internal.runners.model.ReflectiveCallable.run(ReflectiveCallable.java:12)
	at org.junit.runners.model.FrameworkMethod.invokeExplosively(FrameworkMethod.java:44)
	at org.junit.internal.runners.statements.RunBefores.evaluate(RunBefores.java:24)
	at org.junit.internal.runners.statements.RunAfters.evaluate(RunAfters.java:27)
	at org.junit.runners.ParentRunner.run(ParentRunner.java:309)
	at org.apache.maven.surefire.junit4.JUnit4Provider.execute(JUnit4Provider.java:252)
	at org.apache.maven.surefire.junit4.JUnit4Provider.executeTestSet(JUnit4Provider.java:141)
	at org.apache.maven.surefire.junit4.JUnit4Provider.invoke(JUnit4Provider.java:112)
	at sun.reflect.NativeMethodAccessorImpl.invoke0(Native Method)
	at sun.reflect.NativeMethodAccessorImpl.invoke(NativeMethodAccessorImpl.java:39)
	at sun.reflect.DelegatingMethodAccessorImpl.invoke(DelegatingMethodAccessorImpl.java:25)
	at java.lang.reflect.Method.invoke(Method.java:597)
	at org.apache.maven.surefire.util.ReflectionUtils.invokeMethodWithArray(ReflectionUtils.java:189)
	at org.apache.maven.surefire.booter.ProviderFactory$ProviderProxy.invoke(ProviderFactory.java:165)
	at org.apache.maven.surefire.booter.ProviderFactory.invokeProvider(ProviderFactory.java:85)
	at org.apache.maven.surefire.booter.ForkedBooter.runSuitesInProcess(ForkedBooter.java:113)
	at org.apache.maven.surefire.booter.ForkedBooter.main(ForkedBooter.java:75)
Caused by: java.net.BindException: Address already in use
	at sun.nio.ch.Net.bind(Native Method)
	at sun.nio.ch.ServerSocketChannelImpl.bind(ServerSocketChannelImpl.java:126)
	at sun.nio.ch.ServerSocketAdaptor.bind(ServerSocketAdaptor.java:59)
	at org.apache.mina.transport.socket.nio.NioSocketAcceptor.open(NioSocketAcceptor.java:198)
	at org.apache.mina.transport.socket.nio.NioSocketAcceptor.open(NioSocketAcceptor.java:51)
	at org.apache.mina.core.polling.AbstractPollingIoAcceptor.registerHandles(AbstractPollingIoAcceptor.java:547)
	at org.apache.mina.core.polling.AbstractPollingIoAcceptor.access$400(AbstractPollingIoAcceptor.java:68)
	at org.apache.mina.core.polling.AbstractPollingIoAcceptor$Acceptor.run(AbstractPollingIoAcceptor.java:422)
	at org.apache.mina.util.NamePreservingRunnable.run(NamePreservingRunnable.java:64)
	at java.util.concurrent.ThreadPoolExecutor$Worker.runTask(ThreadPoolExecutor.java:886)
	at java.util.concurrent.ThreadPoolExecutor$Worker.run(ThreadPoolExecutor.java:908)
	at java.lang.Thread.run(Thread.java:662)
------------------------------------- Stop consumer
------------------------------------- Start consumer
-----------> Dumping the server <-----------
-----------> Looking for 2.5.4.3=user4,0.9.2342.19200300.100.1.25=example,0.9.2342.19200300.100.1.25=com
<-----------
Entry 2.5.4.3=user2,0.9.2342.19200300.100.1.25=example,0.9.2342.19200300.100.1.25=com exists,
entrtyUuid = entryUUID: 411f5bb9-263c-4b68-a85f-c621d028cea8

Entry 0.9.2342.19200300.100.1.25=example,0.9.2342.19200300.100.1.25=com exists, entrtyUuid
= entryUUID: 2436be3e-cb0d-4d47-b133-189192bd85e4

Entry 2.5.4.3=user1renamedmovedandrenamed,0.9.2342.19200300.100.1.25=example,0.9.2342.19200300.100.1.25=com
exists, entrtyUuid = entryUUID: f6d3ad26-7244-4106-b389-6cc6bfc80d41

-----------> Dump done <-----------
>--------------------------------------- Adding Entry
    dn[n]: cn=user5,dc=example,dc=com
    objectclass: person
    cn: user5
    sn: user5

>--------------------------------------- Added 
-----------> Dumping the server <-----------
-----------> Looking for 2.5.4.3=user5,0.9.2342.19200300.100.1.25=example,0.9.2342.19200300.100.1.25=com
<-----------
Entry 2.5.4.3=user2,0.9.2342.19200300.100.1.25=example,0.9.2342.19200300.100.1.25=com exists,
entrtyUuid = entryUUID: 411f5bb9-263c-4b68-a85f-c621d028cea8

Entry 0.9.2342.19200300.100.1.25=example,0.9.2342.19200300.100.1.25=com exists, entrtyUuid
= entryUUID: 2436be3e-cb0d-4d47-b133-189192bd85e4

Entry 2.5.4.3=user1renamedmovedandrenamed,0.9.2342.19200300.100.1.25=example,0.9.2342.19200300.100.1.25=com
exists, entrtyUuid = entryUUID: f6d3ad26-7244-4106-b389-6cc6bfc80d41

-----------> Dump done <-----------
Tests run: 5, Failures: 2, Errors: 1, Skipped: 1, Time elapsed: 76.442 sec <<< FAILURE!
Running org.apache.directory.server.replication.ClientInitialRefreshIT

---> Running testInitialRefreshLoadAndAdd

NbAdded every 100ms : 
0, 11
NbAdded every 100ms : 
0, 1
<-- Done

---> Running testInitialRefreshStopAndGo

Completed so far : 
(consumer1 completed) 

NbAdded every 100ms : 
0, 0, 0, 10
<-- Done

--->Running testInitialRefresh4Consumers

Completed so far : 
(consumer1 completed) 
(consumer3 completed) 
(consumer4 completed) 
(consumer2 completed) 

<-- Done

---> Running testInitialRefreshLoad

NbAdded every 100ms : 
0, 0, 0, 0, 0, 0, 0, 0, 0, 0, 0, 0, 11
<-- Done

Results :

Failed tests:   testDelete(org.apache.directory.server.replication.ClientServerReplicationIT)
  testModify(org.apache.directory.server.replication.ClientServerReplicationIT)

Tests in error: 
  org.apache.directory.server.operations.search.SearchIT: /tmp/server-work-default3d9c16ea-bd80-4b4b-aa1a-0aae8d17a74e/log/revision
(No such file or directory)
  testRebootConsumer(org.apache.directory.server.replication.ClientServerReplicationIT): ERR_171
Failed to bind an LDAP service (17,000) to the service registry.

Tests run: 380, Failures: 2, Errors: 2, Skipped: 11

mojoFailed org.apache.maven.plugins:maven-surefire-plugin:2.12.2(default-test)
[JENKINS] Recording test results
projectFailed org.apache.directory.server:apacheds-server-integ:2.0.0-M11-SNAPSHOT

Mime
View raw message