directory-notifications mailing list archives

Site index · List index
Message view « Date » · « Thread »
Top « Date » · « Thread »
From Apache Jenkins Server <jenk...@builds.apache.org>
Subject Build failed in Jenkins: dir-apacheds-jdk16-win #303
Date Fri, 25 Jan 2013 05:22:57 GMT
See <https://builds.apache.org/job/dir-apacheds-jdk16-win/303/>

------------------------------------------
[...truncated 4505 lines...]
Running org.apache.directory.server.operations.search.SearchLimitsIT
Tests run: 15, Failures: 0, Errors: 0, Skipped: 0, Time elapsed: 31.954 sec
Running org.apache.directory.server.replication.ClientInitialRefreshIT

---> Running testInitialRefreshLoadAndAdd

NbAdded every 100ms : 
0, 0, 0, 0, 0, 0, 0, 0, 11
NbAdded every 100ms : 
0, 1
<-- Done

---> Running testInitialRefreshStopAndGo

Completed so far : 
(consumer1 completed) 

NbAdded every 100ms : 
0, 10
<-- Done

--->Running testInitialRefresh4Consumers

Completed so far : 
(consumer1 completed) 
(consumer2 completed) 
(consumer3 completed) 
(consumer4 completed) 

<-- Done

---> Running testInitialRefreshLoad

NbAdded every 100ms : 
0, 0, 11
<-- Done
Tests run: 4, Failures: 0, Errors: 0, Skipped: 0, Time elapsed: 25.993 sec
Running org.apache.directory.server.replication.ClientServerReplicationIT
------------------------------------- Stop consumer
------------------------------------- Start consumer
------------------------------------- Stop consumer
------------------------------------- Start consumer
------------------------------------- Stop consumer
------------------------------------- Start consumer
------------------------------------- Stop consumer
------------------------------------- Start consumer
------------------------------------- Stop consumer
------------------------------------- Start consumer
------------------------------------- Stop consumer
------------------------------------- Start consumer
------------------------------------- Stop consumer
------------------------------------- Start consumer
------------------------------------- Stop consumer
------------------------------------- Start consumer
------------------------------------- Stop consumer
------------------------------------- Start consumer
------------------------------------- Stop consumer
------------------------------------- Start consumer
>--------------------------------------- Adding Entry
    dn[n]: cn=user14,dc=example,dc=com
    objectclass: person
    cn: user14
    sn: user14

>--------------------------------------- Added 
>--------------------------------------- Modifying MessageType : MODIFY_REQUEST
Message ID : -1
    Modify Request
        Object : 'cn=user14,dc=example,dc=com'
            Modification[0]
                Operation :  add
                Modification
userPassword: secret
org.apache.directory.api.ldap.model.message.ModifyRequestImpl@f159ba84
>--------------------------------------- Modified 
Tests run: 5, Failures: 0, Errors: 0, Skipped: 1, Time elapsed: 70.706 sec
Running org.apache.directory.server.replication.StaleEventLogDetectionIT

Results :

Tests run: 393, Failures: 0, Errors: 0, Skipped: 14

[WARNING] Could not delete temp direcotry F:\hudson\hudson-slave\workspace\dir-apacheds-jdk16-win\trunk\server-integ\target\surefire
because File F:\hudson\hudson-slave\workspace\dir-apacheds-jdk16-win\trunk\server-integ\target\surefire\surefirebooter8015835699159575743.jar
unable to be deleted.
mojoFailed org.apache.maven.plugins:maven-surefire-plugin:2.12.2(default-test)
[JENKINS] Recording test results
projectFailed org.apache.directory.server:apacheds-server-integ:2.0.0-M11-SNAPSHOT
sessionEnded
[INFO] ------------------------------------------------------------------------
[INFO] Reactor Summary:
[INFO] 
[INFO] ApacheDS .......................................... SUCCESS [8.598s]
[INFO] ApacheDS I18n ..................................... SUCCESS [8.121s]
[INFO] ApacheDS Core Constants ........................... SUCCESS [2.365s]
[INFO] ApacheDS Core API ................................. SUCCESS [30.515s]
[INFO] ApacheDS Core Shared .............................. SUCCESS [3.903s]
[INFO] ApacheDS Interceptors ............................. SUCCESS [0.193s]
[INFO] ApacheDS AdministrativePoint Interceptor .......... SUCCESS [1.679s]
[INFO] ApacheDS Authentication Interceptor ............... SUCCESS [5.447s]
[INFO] ApacheDS Authorization Interceptor ................ SUCCESS [6.185s]
[INFO] ApacheDS ChangeLog Interceptor .................... SUCCESS [3.486s]
[INFO] ApacheDS Collective Attribute Interceptor ......... SUCCESS [1.353s]
[INFO] ApacheDS Event Interceptor ........................ SUCCESS [2.342s]
[INFO] ApacheDS Exception Interceptor .................... SUCCESS [1.305s]
[INFO] ApacheDS Journal Interceptor ...................... SUCCESS [1.211s]
[INFO] ApacheDS Normalization Interceptor ................ SUCCESS [3.569s]
[INFO] ApacheDS Operational Attribute Interceptor ........ SUCCESS [1.424s]
[INFO] ApacheDS Referral Interceptor ..................... SUCCESS [1.614s]
[INFO] ApacheDS Schema Interceptor ....................... SUCCESS [7.544s]
[INFO] ApacheDS Subtree Interceptor ...................... SUCCESS [16.456s]
[INFO] ApacheDS Triggers Interceptor ..................... SUCCESS [3.071s]
[INFO] ApacheDS Core ..................................... SUCCESS [5.830s]
[INFO] ApacheDS Core AVL ................................. SUCCESS [10.562s]
[INFO] ApacheDS Generalized (X) DBM Partition ............ SUCCESS [23.090s]
[INFO] ApacheDS LDIF Partition ........................... SUCCESS [19.282s]
[INFO] ApacheDS JDBM Partition ........................... SUCCESS [1:22.090s]
[INFO] ApacheDS Core Annotations ......................... SUCCESS [1:00.057s]
[INFO] ApacheDS Core JNDI ................................ SUCCESS [2.288s]
[INFO] ApacheDS Protocol Shared .......................... SUCCESS [1.766s]
[INFO] ApacheDS Protocol Kerberos Codec .................. SUCCESS [19.214s]
[INFO] ApacheDS Interceptors for Kerberos ................ SUCCESS [1.825s]
[INFO] ApacheDS Protocol Dhcp ............................ SUCCESS [3.319s]
[INFO] ApacheDS Protocol Dns ............................. SUCCESS [17.269s]
[INFO] ApacheDS Protocol Kerberos ........................ SUCCESS [17.494s]
[INFO] ApacheDS Protocol Ldap ............................ SUCCESS [2:03.976s]
[INFO] ApacheDS Protocol Ntp ............................. SUCCESS [4.172s]
[INFO] Apacheds Server Annotations ....................... SUCCESS [1:04.318s]
[INFO] ApacheDS Server Config ............................ SUCCESS [45.659s]
[INFO] ApacheDS Server JNDI .............................. SUCCESS [7.356s]
[INFO] ApacheDS Test Framework ........................... SUCCESS [1:57.177s]
[INFO] ApacheDS All ...................................... SUCCESS [14.631s]
[INFO] ApacheDS Logger Interceptor ....................... SUCCESS [2.805s]
[INFO] ApacheDS Password Hashing Interceptor ............. SUCCESS [3.621s]
[INFO] ApacheDS Core Integration ......................... SUCCESS [35:51.160s]
[INFO] ApacheDS Server Integration ....................... FAILURE [31:13.224s]
[INFO] ApacheDS DirectoryService-WebApp bridge ........... SKIPPED
[INFO] ApacheDS Jetty HTTP Server Integration ............ SKIPPED
[INFO] ApacheDS Service Builder .......................... SKIPPED
[INFO] ApacheDS Protocol Kerberos Test ................... SKIPPED
[INFO] Apache Directory LDAP Client API test ............. SKIPPED
[INFO] ApacheDS Service .................................. SKIPPED
[INFO] ApacheDS Wrapper .................................. SKIPPED
[INFO] ApacheDS Installers Maven Plugin .................. SKIPPED
[INFO] ApacheDS Installers ............................... SKIPPED
[INFO] ------------------------------------------------------------------------
[INFO] BUILD FAILURE
[INFO] ------------------------------------------------------------------------
[INFO] Total time: 1:19:51.053s
[INFO] Finished at: Fri Jan 25 05:21:57 GMT 2013
[INFO] Final Memory: 57M/241M
[INFO] ------------------------------------------------------------------------
Projects to build: [MavenProject: org.apache.directory.server:apacheds-parent:2.0.0-M11-SNAPSHOT
@ <https://builds.apache.org/job/dir-apacheds-jdk16-win/ws/trunk\pom.xml,> MavenProject:
org.apache.directory.server:apacheds-i18n:2.0.0-M11-SNAPSHOT @ F:\hudson\hudson-slave\workspace\dir-apacheds-jdk16-win\trunk\i18n\pom.xml,
MavenProject: org.apache.directory.server:apacheds-core-constants:2.0.0-M11-SNAPSHOT @ F:\hudson\hudson-slave\workspace\dir-apacheds-jdk16-win\trunk\core-constants\pom.xml,
MavenProject: org.apache.directory.server:apacheds-core-api:2.0.0-M11-SNAPSHOT @ F:\hudson\hudson-slave\workspace\dir-apacheds-jdk16-win\trunk\core-api\pom.xml,
MavenProject: org.apache.directory.server:apacheds-core-shared:2.0.0-M11-SNAPSHOT @ F:\hudson\hudson-slave\workspace\dir-apacheds-jdk16-win\trunk\core-shared\pom.xml,
MavenProject: org.apache.directory.server:apacheds-interceptors:2.0.0-M11-SNAPSHOT @ F:\hudson\hudson-slave\workspace\dir-apacheds-jdk16-win\trunk\interceptors\pom.xml,
MavenProject: org.apache.directory.server:apacheds-interceptors-admin:2.0.0-M11-SNAPSHOT @
F:\hudson\hudson-slave\workspace\dir-apacheds-jdk16-win\trunk\interceptors\admin\pom.xml,
MavenProject: org.apache.directory.server:apacheds-interceptors-authn:2.0.0-M11-SNAPSHOT @
F:\hudson\hudson-slave\workspace\dir-apacheds-jdk16-win\trunk\interceptors\authn\pom.xml,
MavenProject: org.apache.directory.server:apacheds-interceptors-authz:2.0.0-M11-SNAPSHOT @
F:\hudson\hudson-slave\workspace\dir-apacheds-jdk16-win\trunk\interceptors\authz\pom.xml,
MavenProject: org.apache.directory.server:apacheds-interceptors-changelog:2.0.0-M11-SNAPSHOT
@ F:\hudson\hudson-slave\workspace\dir-apacheds-jdk16-win\trunk\interceptors\changelog\pom.xml,
MavenProject: org.apache.directory.server:apacheds-interceptors-collective:2.0.0-M11-SNAPSHOT
@ F:\hudson\hudson-slave\workspace\dir-apacheds-jdk16-win\trunk\interceptors\collective\pom.xml,
MavenProject: org.apache.directory.server:apacheds-interceptors-event:2.0.0-M11-SNAPSHOT @
F:\hudson\hudson-slave\workspace\dir-apacheds-jdk16-win\trunk\interceptors\event\pom.xml,
MavenProject: org.apache.directory.server:apacheds-interceptors-exception:2.0.0-M11-SNAPSHOT
@ F:\hudson\hudson-slave\workspace\dir-apacheds-jdk16-win\trunk\interceptors\exception\pom.xml,
MavenProject: org.apache.directory.server:apacheds-interceptors-journal:2.0.0-M11-SNAPSHOT
@ F:\hudson\hudson-slave\workspace\dir-apacheds-jdk16-win\trunk\interceptors\journal\pom.xml,
MavenProject: org.apache.directory.server:apacheds-interceptors-normalization:2.0.0-M11-SNAPSHOT
@ F:\hudson\hudson-slave\workspace\dir-apacheds-jdk16-win\trunk\interceptors\normalization\pom.xml,
MavenProject: org.apache.directory.server:apacheds-interceptors-operational:2.0.0-M11-SNAPSHOT
@ F:\hudson\hudson-slave\workspace\dir-apacheds-jdk16-win\trunk\interceptors\operational\pom.xml,
MavenProject: org.apache.directory.server:apacheds-interceptors-referral:2.0.0-M11-SNAPSHOT
@ F:\hudson\hudson-slave\workspace\dir-apacheds-jdk16-win\trunk\interceptors\referral\pom.xml,
MavenProject: org.apache.directory.server:apacheds-interceptors-schema:2.0.0-M11-SNAPSHOT
@ F:\hudson\hudson-slave\workspace\dir-apacheds-jdk16-win\trunk\interceptors\schema\pom.xml,
MavenProject: org.apache.directory.server:apacheds-interceptors-subtree:2.0.0-M11-SNAPSHOT
@ F:\hudson\hudson-slave\workspace\dir-apacheds-jdk16-win\trunk\interceptors\subtree\pom.xml,
MavenProject: org.apache.directory.server:apacheds-interceptors-trigger:2.0.0-M11-SNAPSHOT
@ F:\hudson\hudson-slave\workspace\dir-apacheds-jdk16-win\trunk\interceptors\trigger\pom.xml,
MavenProject: org.apache.directory.server:apacheds-core:2.0.0-M11-SNAPSHOT @ F:\hudson\hudson-slave\workspace\dir-apacheds-jdk16-win\trunk\core\pom.xml,
MavenProject: org.apache.directory.server:apacheds-core-avl:2.0.0-M11-SNAPSHOT @ F:\hudson\hudson-slave\workspace\dir-apacheds-jdk16-win\trunk\core-avl\pom.xml,
MavenProject: org.apache.directory.server:apacheds-xdbm-partition:2.0.0-M11-SNAPSHOT @ F:\hudson\hudson-slave\workspace\dir-apacheds-jdk16-win\trunk\xdbm-partition\pom.xml,
MavenProject: org.apache.directory.server:apacheds-ldif-partition:2.0.0-M11-SNAPSHOT @ F:\hudson\hudson-slave\workspace\dir-apacheds-jdk16-win\trunk\ldif-partition\pom.xml,
MavenProject: org.apache.directory.server:apacheds-jdbm-partition:2.0.0-M11-SNAPSHOT @ F:\hudson\hudson-slave\workspace\dir-apacheds-jdk16-win\trunk\jdbm-partition\pom.xml,
MavenProject: org.apache.directory.server:apacheds-core-annotations:2.0.0-M11-SNAPSHOT @ F:\hudson\hudson-slave\workspace\dir-apacheds-jdk16-win\trunk\core-annotations\pom.xml,
MavenProject: org.apache.directory.server:apacheds-core-jndi:2.0.0-M11-SNAPSHOT @ F:\hudson\hudson-slave\workspace\dir-apacheds-jdk16-win\trunk\core-jndi\pom.xml,
MavenProject: org.apache.directory.server:apacheds-protocol-shared:2.0.0-M11-SNAPSHOT @ F:\hudson\hudson-slave\workspace\dir-apacheds-jdk16-win\trunk\protocol-shared\pom.xml,
MavenProject: org.apache.directory.server:apacheds-kerberos-codec:2.0.0-M11-SNAPSHOT @ F:\hudson\hudson-slave\workspace\dir-apacheds-jdk16-win\trunk\kerberos-codec\pom.xml,
MavenProject: org.apache.directory.server:apacheds-interceptor-kerberos:2.0.0-M11-SNAPSHOT
@ F:\hudson\hudson-slave\workspace\dir-apacheds-jdk16-win\trunk\interceptor-kerberos\pom.xml,
MavenProject: org.apache.directory.server:apacheds-protocol-dhcp:2.0.0-M11-SNAPSHOT @ F:\hudson\hudson-slave\workspace\dir-apacheds-jdk16-win\trunk\protocol-dhcp\pom.xml,
MavenProject: org.apache.directory.server:apacheds-protocol-dns:2.0.0-M11-SNAPSHOT @ F:\hudson\hudson-slave\workspace\dir-apacheds-jdk16-win\trunk\protocol-dns\pom.xml,
MavenProject: org.apache.directory.server:apacheds-protocol-kerberos:2.0.0-M11-SNAPSHOT @
F:\hudson\hudson-slave\workspace\dir-apacheds-jdk16-win\trunk\protocol-kerberos\pom.xml, MavenProject:
org.apache.directory.server:apacheds-protocol-ldap:2.0.0-M11-SNAPSHOT @ F:\hudson\hudson-slave\workspace\dir-apacheds-jdk16-win\trunk\protocol-ldap\pom.xml,
MavenProject: org.apache.directory.server:apacheds-protocol-ntp:2.0.0-M11-SNAPSHOT @ F:\hudson\hudson-slave\workspace\dir-apacheds-jdk16-win\trunk\protocol-ntp\pom.xml,
MavenProject: org.apache.directory.server:apacheds-server-annotations:2.0.0-M11-SNAPSHOT @
F:\hudson\hudson-slave\workspace\dir-apacheds-jdk16-win\trunk\server-annotations\pom.xml,
MavenProject: org.apache.directory.server:apacheds-server-config:2.0.0-M11-SNAPSHOT @ F:\hudson\hudson-slave\workspace\dir-apacheds-jdk16-win\trunk\server-config\pom.xml,
MavenProject: org.apache.directory.server:apacheds-server-jndi:2.0.0-M11-SNAPSHOT @ F:\hudson\hudson-slave\workspace\dir-apacheds-jdk16-win\trunk\server-jndi\pom.xml,
MavenProject: org.apache.directory.server:apacheds-test-framework:2.0.0-M11-SNAPSHOT @ F:\hudson\hudson-slave\workspace\dir-apacheds-jdk16-win\trunk\test-framework\pom.xml,
MavenProject: org.apache.directory.server:apacheds-all:2.0.0-M11-SNAPSHOT @ F:\hudson\hudson-slave\workspace\dir-apacheds-jdk16-win\trunk\all\dependency-reduced-pom.xml,
MavenProject: org.apache.directory.server:apacheds-interceptors-logger:2.0.0-M11-SNAPSHOT
@ F:\hudson\hudson-slave\workspace\dir-apacheds-jdk16-win\trunk\interceptors\logger\pom.xml,
MavenProject: org.apache.directory.server:apacheds-interceptors-hash:2.0.0-M11-SNAPSHOT @
F:\hudson\hudson-slave\workspace\dir-apacheds-jdk16-win\trunk\interceptors\hash\pom.xml, MavenProject:
org.apache.directory.server:apacheds-core-integ:2.0.0-M11-SNAPSHOT @ F:\hudson\hudson-slave\workspace\dir-apacheds-jdk16-win\trunk\core-integ\pom.xml,
MavenProject: org.apache.directory.server:apacheds-server-integ:2.0.0-M11-SNAPSHOT @ F:\hudson\hudson-slave\workspace\dir-apacheds-jdk16-win\trunk\server-integ\pom.xml,
MavenProject: org.apache.directory.server:apacheds-http-directory-bridge:2.0.0-M11-SNAPSHOT
@ F:\hudson\hudson-slave\workspace\dir-apacheds-jdk16-win\trunk\http-directory-bridge\pom.xml,
MavenProject: org.apache.directory.server:apacheds-http-integration:2.0.0-M11-SNAPSHOT @ F:\hudson\hudson-slave\workspace\dir-apacheds-jdk16-win\trunk\http-integration\pom.xml,
MavenProject: org.apache.directory.server:apacheds-service-builder:2.0.0-M11-SNAPSHOT @ F:\hudson\hudson-slave\workspace\dir-apacheds-jdk16-win\trunk\service-builder\pom.xml,
MavenProject: org.apache.directory.server:apacheds-kerberos-test:2.0.0-M11-SNAPSHOT @ F:\hudson\hudson-slave\workspace\dir-apacheds-jdk16-win\trunk\kerberos-test\pom.xml,
MavenProject: org.apache.directory.server:ldap-client-test:2.0.0-M11-SNAPSHOT @ F:\hudson\hudson-slave\workspace\dir-apacheds-jdk16-win\trunk\ldap-client-test\pom.xml,
MavenProject: org.apache.directory.server:apacheds-service:2.0.0-M11-SNAPSHOT @ F:\hudson\hudson-slave\workspace\dir-apacheds-jdk16-win\trunk\service\pom.xml,
MavenProject: org.apache.directory.server:apacheds-wrapper:2.0.0-M11-SNAPSHOT @ F:\hudson\hudson-slave\workspace\dir-apacheds-jdk16-win\trunk\wrapper\pom.xml,
MavenProject: org.apache.directory.server:apacheds-installers-maven-plugin:2.0.0-M11-SNAPSHOT
@ F:\hudson\hudson-slave\workspace\dir-apacheds-jdk16-win\trunk\installers-maven-plugin\pom.xml,
MavenProject: org.apache.directory.server:apacheds-installers:2.0.0-M11-SNAPSHOT @ F:\hudson\hudson-slave\workspace\dir-apacheds-jdk16-win\trunk\installers\pom.xml]
[JENKINS] Archiving disabled
[JENKINS] Archiving disabled
[JENKINS] Archiving disabled
[JENKINS] Archiving disabled
[JENKINS] Archiving disabled
[JENKINS] Archiving disabled
[JENKINS] Archiving disabled
[JENKINS] Archiving disabled
[JENKINS] Archiving disabled
[JENKINS] Archiving disabled
[JENKINS] Archiving disabled
[JENKINS] Archiving disabled
[JENKINS] Archiving disabled
[JENKINS] Archiving disabled
[JENKINS] Archiving disabled
[JENKINS] Archiving disabled
[JENKINS] Archiving disabled
[JENKINS] Archiving disabled
[JENKINS] Archiving disabled
[JENKINS] Archiving disabled
[JENKINS] Archiving disabled
[JENKINS] Archiving disabled
[JENKINS] Archiving disabled
[JENKINS] Archiving disabled
[JENKINS] Archiving disabled
[JENKINS] Archiving disabled
[JENKINS] Archiving disabled
[JENKINS] Archiving disabled
[JENKINS] Archiving disabled
[JENKINS] Archiving disabled
[JENKINS] Archiving disabled
[JENKINS] Archiving disabled
[JENKINS] Archiving disabled
[JENKINS] Archiving disabled
[JENKINS] Archiving disabled
[JENKINS] Archiving disabled
[JENKINS] Archiving disabled
[JENKINS] Archiving disabled
[JENKINS] Archiving disabled
[JENKINS] Archiving disabled
[JENKINS] Archiving disabled
[JENKINS] Archiving disabled
[JENKINS] Archiving disabled
[JENKINS] Archiving disabled
[JENKINS] Archiving disabled
[JENKINS] Archiving disabled
[JENKINS] Archiving disabled
[JENKINS] Archiving disabled
[JENKINS] Archiving disabled
[JENKINS] Archiving disabled
[JENKINS] Archiving disabled
[JENKINS] Archiving disabled
[JENKINS] Archiving disabled
Waiting for Jenkins to finish collecting data
mavenExecutionResult exceptions not empty
message : Failed to execute goal org.apache.maven.plugins:maven-surefire-plugin:2.12.2:test
(default-test) on project apacheds-server-integ: Failure or timeout
cause : Failure or timeout
Stack trace : 
org.apache.maven.lifecycle.LifecycleExecutionException: Failed to execute goal org.apache.maven.plugins:maven-surefire-plugin:2.12.2:test
(default-test) on project apacheds-server-integ: Failure or timeout
	at org.apache.maven.lifecycle.internal.MojoExecutor.execute(MojoExecutor.java:217)
	at org.apache.maven.lifecycle.internal.MojoExecutor.execute(MojoExecutor.java:153)
	at org.apache.maven.lifecycle.internal.MojoExecutor.execute(MojoExecutor.java:145)
	at org.apache.maven.lifecycle.internal.LifecycleModuleBuilder.buildProject(LifecycleModuleBuilder.java:84)
	at org.apache.maven.lifecycle.internal.LifecycleModuleBuilder.buildProject(LifecycleModuleBuilder.java:59)
	at org.apache.maven.lifecycle.internal.LifecycleStarter.singleThreadedBuild(LifecycleStarter.java:183)
	at org.apache.maven.lifecycle.internal.LifecycleStarter.execute(LifecycleStarter.java:161)
	at org.apache.maven.DefaultMaven.doExecute(DefaultMaven.java:319)
	at org.apache.maven.DefaultMaven.execute(DefaultMaven.java:156)
	at org.jvnet.hudson.maven3.launcher.Maven3Launcher.main(Maven3Launcher.java:79)
	at sun.reflect.NativeMethodAccessorImpl.invoke0(Native Method)
	at sun.reflect.NativeMethodAccessorImpl.invoke(NativeMethodAccessorImpl.java:39)
	at sun.reflect.DelegatingMethodAccessorImpl.invoke(DelegatingMethodAccessorImpl.java:25)
	at java.lang.reflect.Method.invoke(Method.java:597)
	at org.codehaus.plexus.classworlds.launcher.Launcher.launchStandard(Launcher.java:329)
	at org.codehaus.plexus.classworlds.launcher.Launcher.launch(Launcher.java:239)
	at org.jvnet.hudson.maven3.agent.Maven3Main.launch(Maven3Main.java:158)
	at hudson.maven.Maven3Builder.call(Maven3Builder.java:100)
	at hudson.maven.Maven3Builder.call(Maven3Builder.java:66)
	at hudson.remoting.UserRequest.perform(UserRequest.java:118)
	at hudson.remoting.UserRequest.perform(UserRequest.java:48)
	at hudson.remoting.Request$2.run(Request.java:326)
	at hudson.remoting.InterceptingExecutorService$1.call(InterceptingExecutorService.java:72)
	at java.util.concurrent.FutureTask$Sync.innerRun(FutureTask.java:303)
	at java.util.concurrent.FutureTask.run(FutureTask.java:138)
	at java.util.concurrent.ThreadPoolExecutor$Worker.runTask(ThreadPoolExecutor.java:886)
	at java.util.concurrent.ThreadPoolExecutor$Worker.run(ThreadPoolExecutor.java:908)
	at java.lang.Thread.run(Thread.java:662)
Caused by: org.apache.maven.plugin.MojoExecutionException: Failure or timeout
	at org.apache.maven.plugin.surefire.SurefirePlugin.assertNoFailureOrTimeout(SurefirePlugin.java:177)
	at org.apache.maven.plugin.surefire.SurefirePlugin.handleSummary(SurefirePlugin.java:158)
	at org.apache.maven.plugin.surefire.AbstractSurefireMojo.executeAfterPreconditionsChecked(AbstractSurefireMojo.java:626)
	at org.apache.maven.plugin.surefire.AbstractSurefireMojo.execute(AbstractSurefireMojo.java:587)
	at org.apache.maven.plugin.DefaultBuildPluginManager.executeMojo(DefaultBuildPluginManager.java:107)
	at org.apache.maven.lifecycle.internal.MojoExecutor.execute(MojoExecutor.java:209)
	... 27 more
Sending e-mails to: notifications@directory.apache.org
channel stopped
Process leaked file descriptors. See http://wiki.jenkins-ci.org/display/JENKINS/Spawning+processes+from+build
for more information

Mime
View raw message