directory-notifications mailing list archives

Site index · List index
Message view « Date » · « Thread »
Top « Date » · « Thread »
From Apache Jenkins Server <jenk...@builds.apache.org>
Subject Build failed in Jenkins: dir-apacheds-jdk16-win #309
Date Thu, 31 Jan 2013 04:51:44 GMT
See <https://builds.apache.org/job/dir-apacheds-jdk16-win/309/>

------------------------------------------
[...truncated 5486 lines...]
[INFO] 
[INFO] --- maven-resources-plugin:2.5:testResources (default-testResources) @ apacheds-service
---
[INFO] Copying 3 resources
[INFO] Copying 3 resources
mojoSucceeded org.apache.maven.plugins:maven-resources-plugin:2.5(default-testResources)
mojoStarted org.apache.maven.plugins:maven-compiler-plugin:2.5.1(default-testCompile)
[INFO] 
[INFO] --- maven-compiler-plugin:2.5.1:testCompile (default-testCompile) @ apacheds-service
---
[INFO] Compiling 1 source file to F:\hudson\hudson-slave\workspace\dir-apacheds-jdk16-win\trunk\service\target\test-classes
mojoSucceeded org.apache.maven.plugins:maven-compiler-plugin:2.5.1(default-testCompile)
mojoStarted org.apache.maven.plugins:maven-surefire-plugin:2.12.2(default-test)
[INFO] 
[INFO] --- maven-surefire-plugin:2.12.2:test (default-test) @ apacheds-service ---
[INFO] Surefire report directory: F:\hudson\hudson-slave\workspace\dir-apacheds-jdk16-win\trunk\service\target\surefire-reports

-------------------------------------------------------
 T E S T S
-------------------------------------------------------
Running org.apache.directory.server.UberJarMainTest
net.sf.ehcache.CacheException: java.io.FileNotFoundException: C:\Users\hudson\AppData\Local\Temp\ApacheDS-201303145133\cache\changePwdReplayCache.data
(There is not enough space on the disk)
	at net.sf.ehcache.store.compound.factories.DiskStorageFactory.<init>(DiskStorageFactory.java:102)
	at net.sf.ehcache.store.compound.factories.DiskOverflowStorageFactory.<init>(DiskOverflowStorageFactory.java:71)
	at net.sf.ehcache.store.compound.impl.OverflowToDiskStore.create(OverflowToDiskStore.java:63)
	at net.sf.ehcache.Cache.initialise(Cache.java:1113)
	at net.sf.ehcache.CacheManager.addCacheNoCheck(CacheManager.java:1082)
	at net.sf.ehcache.CacheManager.addConfiguredCaches(CacheManager.java:657)
	at net.sf.ehcache.CacheManager.init(CacheManager.java:375)
	at net.sf.ehcache.CacheManager.<init>(CacheManager.java:228)
	at org.apache.directory.server.core.api.CacheService.initialize(CacheService.java:110)
	at org.apache.directory.server.ApacheDsService.start(ApacheDsService.java:166)
	at org.apache.directory.server.UberjarMain.start(UberjarMain.java:76)
	at org.apache.directory.server.UberJarMainTest.serviceInstanceTest(UberJarMainTest.java:98)
	at sun.reflect.NativeMethodAccessorImpl.invoke0(Native Method)
	at sun.reflect.NativeMethodAccessorImpl.invoke(NativeMethodAccessorImpl.java:39)
	at sun.reflect.DelegatingMethodAccessorImpl.invoke(DelegatingMethodAccessorImpl.java:25)
	at java.lang.reflect.Method.invoke(Method.java:597)
	at org.junit.runners.model.FrameworkMethod$1.runReflectiveCall(FrameworkMethod.java:47)
	at org.junit.internal.runners.model.ReflectiveCallable.run(ReflectiveCallable.java:12)
	at org.junit.runners.model.FrameworkMethod.invokeExplosively(FrameworkMethod.java:44)
	at org.junit.internal.runners.statements.InvokeMethod.evaluate(InvokeMethod.java:17)
	at org.junit.internal.runners.statements.RunBefores.evaluate(RunBefores.java:26)
	at org.junit.internal.runners.statements.RunAfters.evaluate(RunAfters.java:27)
	at org.junit.runners.ParentRunner.runLeaf(ParentRunner.java:271)
	at org.junit.runners.BlockJUnit4ClassRunner.runChild(BlockJUnit4ClassRunner.java:70)
	at org.junit.runners.BlockJUnit4ClassRunner.runChild(BlockJUnit4ClassRunner.java:50)
	at org.junit.runners.ParentRunner$3.run(ParentRunner.java:238)
	at org.junit.runners.ParentRunner$1.schedule(ParentRunner.java:63)
	at org.junit.runners.ParentRunner.runChildren(ParentRunner.java:236)
	at org.junit.runners.ParentRunner.access$000(ParentRunner.java:53)
	at org.junit.runners.ParentRunner$2.evaluate(ParentRunner.java:229)
	at org.junit.runners.ParentRunner.run(ParentRunner.java:309)
	at org.apache.maven.surefire.junit4.JUnit4Provider.execute(JUnit4Provider.java:252)
	at org.apache.maven.surefire.junit4.JUnit4Provider.executeTestSet(JUnit4Provider.java:141)
	at org.apache.maven.surefire.junit4.JUnit4Provider.invoke(JUnit4Provider.java:112)
	at sun.reflect.NativeMethodAccessorImpl.invoke0(Native Method)
	at sun.reflect.NativeMethodAccessorImpl.invoke(NativeMethodAccessorImpl.java:39)
	at sun.reflect.DelegatingMethodAccessorImpl.invoke(DelegatingMethodAccessorImpl.java:25)
	at java.lang.reflect.Method.invoke(Method.java:597)
	at org.apache.maven.surefire.util.ReflectionUtils.invokeMethodWithArray(ReflectionUtils.java:189)
	at org.apache.maven.surefire.booter.ProviderFactory$ProviderProxy.invoke(ProviderFactory.java:165)
	at org.apache.maven.surefire.booter.ProviderFactory.invokeProvider(ProviderFactory.java:85)
	at org.apache.maven.surefire.booter.ForkedBooter.runSuitesInProcess(ForkedBooter.java:113)
	at org.apache.maven.surefire.booter.ForkedBooter.main(ForkedBooter.java:75)
Caused by: java.io.FileNotFoundException: C:\Users\hudson\AppData\Local\Temp\ApacheDS-201303145133\cache\changePwdReplayCache.data
(There is not enough space on the disk)
	at java.io.RandomAccessFile.open(Native Method)
	at java.io.RandomAccessFile.<init>(RandomAccessFile.java:216)
	at net.sf.ehcache.store.compound.factories.DiskStorageFactory.allocateRandomAccessFiles(DiskStorageFactory.java:130)
	at net.sf.ehcache.store.compound.factories.DiskStorageFactory.<init>(DiskStorageFactory.java:100)
	... 42 more

Results :

Tests run: 0, Failures: 0, Errors: 0, Skipped: 0

mojoFailed org.apache.maven.plugins:maven-surefire-plugin:2.12.2(default-test)
[JENKINS] Recording test results
projectFailed org.apache.directory.server:apacheds-service:2.0.0-M11-SNAPSHOT
sessionEnded
[INFO] ------------------------------------------------------------------------
[INFO] Reactor Summary:
[INFO] 
[INFO] ApacheDS .......................................... SUCCESS [6.766s]
[INFO] ApacheDS I18n ..................................... SUCCESS [5.780s]
[INFO] ApacheDS Core Constants ........................... SUCCESS [1.552s]
[INFO] ApacheDS Core API ................................. SUCCESS [24.608s]
[INFO] ApacheDS Core Shared .............................. SUCCESS [2.948s]
[INFO] ApacheDS Interceptors ............................. SUCCESS [0.112s]
[INFO] ApacheDS AdministrativePoint Interceptor .......... SUCCESS [1.941s]
[INFO] ApacheDS Authentication Interceptor ............... SUCCESS [4.306s]
[INFO] ApacheDS Authorization Interceptor ................ SUCCESS [5.684s]
[INFO] ApacheDS ChangeLog Interceptor .................... SUCCESS [3.433s]
[INFO] ApacheDS Collective Attribute Interceptor ......... SUCCESS [1.476s]
[INFO] ApacheDS Event Interceptor ........................ SUCCESS [1.251s]
[INFO] ApacheDS Exception Interceptor .................... SUCCESS [1.186s]
[INFO] ApacheDS Journal Interceptor ...................... SUCCESS [1.407s]
[INFO] ApacheDS Normalization Interceptor ................ SUCCESS [3.087s]
[INFO] ApacheDS Operational Attribute Interceptor ........ SUCCESS [1.298s]
[INFO] ApacheDS Referral Interceptor ..................... SUCCESS [1.157s]
[INFO] ApacheDS Schema Interceptor ....................... SUCCESS [7.721s]
[INFO] ApacheDS Subtree Interceptor ...................... SUCCESS [11.364s]
[INFO] ApacheDS Triggers Interceptor ..................... SUCCESS [2.220s]
[INFO] ApacheDS Core ..................................... SUCCESS [5.513s]
[INFO] ApacheDS Core AVL ................................. SUCCESS [9.172s]
[INFO] ApacheDS Generalized (X) DBM Partition ............ SUCCESS [25.688s]
[INFO] ApacheDS LDIF Partition ........................... SUCCESS [22.684s]
[INFO] ApacheDS JDBM Partition ........................... SUCCESS [1:34.701s]
[INFO] ApacheDS Core Annotations ......................... SUCCESS [57.259s]
[INFO] ApacheDS Core JNDI ................................ SUCCESS [2.560s]
[INFO] ApacheDS Protocol Shared .......................... SUCCESS [7.916s]
[INFO] ApacheDS Protocol Kerberos Codec .................. SUCCESS [1:01.557s]
[INFO] ApacheDS Interceptors for Kerberos ................ SUCCESS [3.272s]
[INFO] ApacheDS Protocol Dhcp ............................ SUCCESS [3.276s]
[INFO] ApacheDS Protocol Dns ............................. SUCCESS [3.992s]
[INFO] ApacheDS Protocol Kerberos ........................ SUCCESS [5.896s]
[INFO] ApacheDS Protocol Ldap ............................ SUCCESS [2:09.247s]
[INFO] ApacheDS Protocol Ntp ............................. SUCCESS [3.968s]
[INFO] Apacheds Server Annotations ....................... SUCCESS [1:29.185s]
[INFO] ApacheDS Server Config ............................ SUCCESS [1:03.465s]
[INFO] ApacheDS Server JNDI .............................. SUCCESS [10.438s]
[INFO] ApacheDS Test Framework ........................... SUCCESS [2:03.117s]
[INFO] ApacheDS All ...................................... SUCCESS [7.082s]
[INFO] ApacheDS Logger Interceptor ....................... SUCCESS [4.257s]
[INFO] ApacheDS Password Hashing Interceptor ............. SUCCESS [2.825s]
[INFO] ApacheDS Core Integration ......................... SUCCESS [31:22.554s]
[INFO] ApacheDS Server Integration ....................... SUCCESS [3:55.428s]
[INFO] ApacheDS DirectoryService-WebApp bridge ........... SUCCESS [1.694s]
[INFO] ApacheDS Jetty HTTP Server Integration ............ SUCCESS [1.835s]
[INFO] ApacheDS Service Builder .......................... SUCCESS [2.574s]
[INFO] ApacheDS Protocol Kerberos Test ................... SUCCESS [4.570s]
[INFO] Apache Directory LDAP Client API test ............. SUCCESS [3.855s]
[INFO] ApacheDS Service .................................. FAILURE [2.576s]
[INFO] ApacheDS Wrapper .................................. SKIPPED
[INFO] ApacheDS Installers Maven Plugin .................. SKIPPED
[INFO] ApacheDS Installers ............................... SKIPPED
[INFO] ------------------------------------------------------------------------
[INFO] BUILD FAILURE
[INFO] ------------------------------------------------------------------------
[INFO] Total time: 49:25.952s
[INFO] Finished at: Thu Jan 31 04:51:34 GMT 2013
[INFO] Final Memory: 61M/246M
[INFO] ------------------------------------------------------------------------
Projects to build: [MavenProject: org.apache.directory.server:apacheds-parent:2.0.0-M11-SNAPSHOT
@ <https://builds.apache.org/job/dir-apacheds-jdk16-win/ws/trunk\pom.xml,> MavenProject:
org.apache.directory.server:apacheds-i18n:2.0.0-M11-SNAPSHOT @ F:\hudson\hudson-slave\workspace\dir-apacheds-jdk16-win\trunk\i18n\pom.xml,
MavenProject: org.apache.directory.server:apacheds-core-constants:2.0.0-M11-SNAPSHOT @ F:\hudson\hudson-slave\workspace\dir-apacheds-jdk16-win\trunk\core-constants\pom.xml,
MavenProject: org.apache.directory.server:apacheds-core-api:2.0.0-M11-SNAPSHOT @ F:\hudson\hudson-slave\workspace\dir-apacheds-jdk16-win\trunk\core-api\pom.xml,
MavenProject: org.apache.directory.server:apacheds-core-shared:2.0.0-M11-SNAPSHOT @ F:\hudson\hudson-slave\workspace\dir-apacheds-jdk16-win\trunk\core-shared\pom.xml,
MavenProject: org.apache.directory.server:apacheds-interceptors:2.0.0-M11-SNAPSHOT @ F:\hudson\hudson-slave\workspace\dir-apacheds-jdk16-win\trunk\interceptors\pom.xml,
MavenProject: org.apache.directory.server:apacheds-interceptors-admin:2.0.0-M11-SNAPSHOT @
F:\hudson\hudson-slave\workspace\dir-apacheds-jdk16-win\trunk\interceptors\admin\pom.xml,
MavenProject: org.apache.directory.server:apacheds-interceptors-authn:2.0.0-M11-SNAPSHOT @
F:\hudson\hudson-slave\workspace\dir-apacheds-jdk16-win\trunk\interceptors\authn\pom.xml,
MavenProject: org.apache.directory.server:apacheds-interceptors-authz:2.0.0-M11-SNAPSHOT @
F:\hudson\hudson-slave\workspace\dir-apacheds-jdk16-win\trunk\interceptors\authz\pom.xml,
MavenProject: org.apache.directory.server:apacheds-interceptors-changelog:2.0.0-M11-SNAPSHOT
@ F:\hudson\hudson-slave\workspace\dir-apacheds-jdk16-win\trunk\interceptors\changelog\pom.xml,
MavenProject: org.apache.directory.server:apacheds-interceptors-collective:2.0.0-M11-SNAPSHOT
@ F:\hudson\hudson-slave\workspace\dir-apacheds-jdk16-win\trunk\interceptors\collective\pom.xml,
MavenProject: org.apache.directory.server:apacheds-interceptors-event:2.0.0-M11-SNAPSHOT @
F:\hudson\hudson-slave\workspace\dir-apacheds-jdk16-win\trunk\interceptors\event\pom.xml,
MavenProject: org.apache.directory.server:apacheds-interceptors-exception:2.0.0-M11-SNAPSHOT
@ F:\hudson\hudson-slave\workspace\dir-apacheds-jdk16-win\trunk\interceptors\exception\pom.xml,
MavenProject: org.apache.directory.server:apacheds-interceptors-journal:2.0.0-M11-SNAPSHOT
@ F:\hudson\hudson-slave\workspace\dir-apacheds-jdk16-win\trunk\interceptors\journal\pom.xml,
MavenProject: org.apache.directory.server:apacheds-interceptors-normalization:2.0.0-M11-SNAPSHOT
@ F:\hudson\hudson-slave\workspace\dir-apacheds-jdk16-win\trunk\interceptors\normalization\pom.xml,
MavenProject: org.apache.directory.server:apacheds-interceptors-operational:2.0.0-M11-SNAPSHOT
@ F:\hudson\hudson-slave\workspace\dir-apacheds-jdk16-win\trunk\interceptors\operational\pom.xml,
MavenProject: org.apache.directory.server:apacheds-interceptors-referral:2.0.0-M11-SNAPSHOT
@ F:\hudson\hudson-slave\workspace\dir-apacheds-jdk16-win\trunk\interceptors\referral\pom.xml,
MavenProject: org.apache.directory.server:apacheds-interceptors-schema:2.0.0-M11-SNAPSHOT
@ F:\hudson\hudson-slave\workspace\dir-apacheds-jdk16-win\trunk\interceptors\schema\pom.xml,
MavenProject: org.apache.directory.server:apacheds-interceptors-subtree:2.0.0-M11-SNAPSHOT
@ F:\hudson\hudson-slave\workspace\dir-apacheds-jdk16-win\trunk\interceptors\subtree\pom.xml,
MavenProject: org.apache.directory.server:apacheds-interceptors-trigger:2.0.0-M11-SNAPSHOT
@ F:\hudson\hudson-slave\workspace\dir-apacheds-jdk16-win\trunk\interceptors\trigger\pom.xml,
MavenProject: org.apache.directory.server:apacheds-core:2.0.0-M11-SNAPSHOT @ F:\hudson\hudson-slave\workspace\dir-apacheds-jdk16-win\trunk\core\pom.xml,
MavenProject: org.apache.directory.server:apacheds-core-avl:2.0.0-M11-SNAPSHOT @ F:\hudson\hudson-slave\workspace\dir-apacheds-jdk16-win\trunk\core-avl\pom.xml,
MavenProject: org.apache.directory.server:apacheds-xdbm-partition:2.0.0-M11-SNAPSHOT @ F:\hudson\hudson-slave\workspace\dir-apacheds-jdk16-win\trunk\xdbm-partition\pom.xml,
MavenProject: org.apache.directory.server:apacheds-ldif-partition:2.0.0-M11-SNAPSHOT @ F:\hudson\hudson-slave\workspace\dir-apacheds-jdk16-win\trunk\ldif-partition\pom.xml,
MavenProject: org.apache.directory.server:apacheds-jdbm-partition:2.0.0-M11-SNAPSHOT @ F:\hudson\hudson-slave\workspace\dir-apacheds-jdk16-win\trunk\jdbm-partition\pom.xml,
MavenProject: org.apache.directory.server:apacheds-core-annotations:2.0.0-M11-SNAPSHOT @ F:\hudson\hudson-slave\workspace\dir-apacheds-jdk16-win\trunk\core-annotations\pom.xml,
MavenProject: org.apache.directory.server:apacheds-core-jndi:2.0.0-M11-SNAPSHOT @ F:\hudson\hudson-slave\workspace\dir-apacheds-jdk16-win\trunk\core-jndi\pom.xml,
MavenProject: org.apache.directory.server:apacheds-protocol-shared:2.0.0-M11-SNAPSHOT @ F:\hudson\hudson-slave\workspace\dir-apacheds-jdk16-win\trunk\protocol-shared\pom.xml,
MavenProject: org.apache.directory.server:apacheds-kerberos-codec:2.0.0-M11-SNAPSHOT @ F:\hudson\hudson-slave\workspace\dir-apacheds-jdk16-win\trunk\kerberos-codec\pom.xml,
MavenProject: org.apache.directory.server:apacheds-interceptor-kerberos:2.0.0-M11-SNAPSHOT
@ F:\hudson\hudson-slave\workspace\dir-apacheds-jdk16-win\trunk\interceptor-kerberos\pom.xml,
MavenProject: org.apache.directory.server:apacheds-protocol-dhcp:2.0.0-M11-SNAPSHOT @ F:\hudson\hudson-slave\workspace\dir-apacheds-jdk16-win\trunk\protocol-dhcp\pom.xml,
MavenProject: org.apache.directory.server:apacheds-protocol-dns:2.0.0-M11-SNAPSHOT @ F:\hudson\hudson-slave\workspace\dir-apacheds-jdk16-win\trunk\protocol-dns\pom.xml,
MavenProject: org.apache.directory.server:apacheds-protocol-kerberos:2.0.0-M11-SNAPSHOT @
F:\hudson\hudson-slave\workspace\dir-apacheds-jdk16-win\trunk\protocol-kerberos\pom.xml, MavenProject:
org.apache.directory.server:apacheds-protocol-ldap:2.0.0-M11-SNAPSHOT @ F:\hudson\hudson-slave\workspace\dir-apacheds-jdk16-win\trunk\protocol-ldap\pom.xml,
MavenProject: org.apache.directory.server:apacheds-protocol-ntp:2.0.0-M11-SNAPSHOT @ F:\hudson\hudson-slave\workspace\dir-apacheds-jdk16-win\trunk\protocol-ntp\pom.xml,
MavenProject: org.apache.directory.server:apacheds-server-annotations:2.0.0-M11-SNAPSHOT @
F:\hudson\hudson-slave\workspace\dir-apacheds-jdk16-win\trunk\server-annotations\pom.xml,
MavenProject: org.apache.directory.server:apacheds-server-config:2.0.0-M11-SNAPSHOT @ F:\hudson\hudson-slave\workspace\dir-apacheds-jdk16-win\trunk\server-config\pom.xml,
MavenProject: org.apache.directory.server:apacheds-server-jndi:2.0.0-M11-SNAPSHOT @ F:\hudson\hudson-slave\workspace\dir-apacheds-jdk16-win\trunk\server-jndi\pom.xml,
MavenProject: org.apache.directory.server:apacheds-test-framework:2.0.0-M11-SNAPSHOT @ F:\hudson\hudson-slave\workspace\dir-apacheds-jdk16-win\trunk\test-framework\pom.xml,
MavenProject: org.apache.directory.server:apacheds-all:2.0.0-M11-SNAPSHOT @ F:\hudson\hudson-slave\workspace\dir-apacheds-jdk16-win\trunk\all\dependency-reduced-pom.xml,
MavenProject: org.apache.directory.server:apacheds-interceptors-logger:2.0.0-M11-SNAPSHOT
@ F:\hudson\hudson-slave\workspace\dir-apacheds-jdk16-win\trunk\interceptors\logger\pom.xml,
MavenProject: org.apache.directory.server:apacheds-interceptors-hash:2.0.0-M11-SNAPSHOT @
F:\hudson\hudson-slave\workspace\dir-apacheds-jdk16-win\trunk\interceptors\hash\pom.xml, MavenProject:
org.apache.directory.server:apacheds-core-integ:2.0.0-M11-SNAPSHOT @ F:\hudson\hudson-slave\workspace\dir-apacheds-jdk16-win\trunk\core-integ\pom.xml,
MavenProject: org.apache.directory.server:apacheds-server-integ:2.0.0-M11-SNAPSHOT @ F:\hudson\hudson-slave\workspace\dir-apacheds-jdk16-win\trunk\server-integ\pom.xml,
MavenProject: org.apache.directory.server:apacheds-http-directory-bridge:2.0.0-M11-SNAPSHOT
@ F:\hudson\hudson-slave\workspace\dir-apacheds-jdk16-win\trunk\http-directory-bridge\pom.xml,
MavenProject: org.apache.directory.server:apacheds-http-integration:2.0.0-M11-SNAPSHOT @ F:\hudson\hudson-slave\workspace\dir-apacheds-jdk16-win\trunk\http-integration\pom.xml,
MavenProject: org.apache.directory.server:apacheds-service-builder:2.0.0-M11-SNAPSHOT @ F:\hudson\hudson-slave\workspace\dir-apacheds-jdk16-win\trunk\service-builder\pom.xml,
MavenProject: org.apache.directory.server:apacheds-kerberos-test:2.0.0-M11-SNAPSHOT @ F:\hudson\hudson-slave\workspace\dir-apacheds-jdk16-win\trunk\kerberos-test\pom.xml,
MavenProject: org.apache.directory.server:ldap-client-test:2.0.0-M11-SNAPSHOT @ F:\hudson\hudson-slave\workspace\dir-apacheds-jdk16-win\trunk\ldap-client-test\pom.xml,
MavenProject: org.apache.directory.server:apacheds-service:2.0.0-M11-SNAPSHOT @ F:\hudson\hudson-slave\workspace\dir-apacheds-jdk16-win\trunk\service\pom.xml,
MavenProject: org.apache.directory.server:apacheds-wrapper:2.0.0-M11-SNAPSHOT @ F:\hudson\hudson-slave\workspace\dir-apacheds-jdk16-win\trunk\wrapper\pom.xml,
MavenProject: org.apache.directory.server:apacheds-installers-maven-plugin:2.0.0-M11-SNAPSHOT
@ F:\hudson\hudson-slave\workspace\dir-apacheds-jdk16-win\trunk\installers-maven-plugin\pom.xml,
MavenProject: org.apache.directory.server:apacheds-installers:2.0.0-M11-SNAPSHOT @ F:\hudson\hudson-slave\workspace\dir-apacheds-jdk16-win\trunk\installers\pom.xml]
[JENKINS] Archiving disabled
[JENKINS] Archiving disabled
[JENKINS] Archiving disabled
[JENKINS] Archiving disabled
[JENKINS] Archiving disabled
[JENKINS] Archiving disabled
[JENKINS] Archiving disabled
[JENKINS] Archiving disabled
[JENKINS] Archiving disabled
[JENKINS] Archiving disabled
[JENKINS] Archiving disabled
[JENKINS] Archiving disabled
[JENKINS] Archiving disabled
[JENKINS] Archiving disabled
[JENKINS] Archiving disabled
[JENKINS] Archiving disabled
[JENKINS] Archiving disabled
[JENKINS] Archiving disabled
[JENKINS] Archiving disabled
[JENKINS] Archiving disabled
[JENKINS] Archiving disabled
[JENKINS] Archiving disabled
[JENKINS] Archiving disabled
[JENKINS] Archiving disabled
[JENKINS] Archiving disabled
[JENKINS] Archiving disabled
[JENKINS] Archiving disabled
[JENKINS] Archiving disabled
[JENKINS] Archiving disabled
[JENKINS] Archiving disabled
[JENKINS] Archiving disabled
[JENKINS] Archiving disabled
[JENKINS] Archiving disabled
[JENKINS] Archiving disabled
[JENKINS] Archiving disabled
[JENKINS] Archiving disabled
[JENKINS] Archiving disabled
[JENKINS] Archiving disabled
[JENKINS] Archiving disabled
[JENKINS] Archiving disabled
[JENKINS] Archiving disabled
[JENKINS] Archiving disabled
[JENKINS] Archiving disabled
[JENKINS] Archiving disabled
[JENKINS] Archiving disabled
[JENKINS] Archiving disabled
[JENKINS] Archiving disabled
[JENKINS] Archiving disabled
[JENKINS] Archiving disabled
[JENKINS] Archiving disabled
[JENKINS] Archiving disabled
[JENKINS] Archiving disabled
[JENKINS] Archiving disabled
Waiting for Jenkins to finish collecting data
mavenExecutionResult exceptions not empty
message : Failed to execute goal org.apache.maven.plugins:maven-surefire-plugin:2.12.2:test
(default-test) on project apacheds-service: Execution default-test of goal org.apache.maven.plugins:maven-surefire-plugin:2.12.2:test
failed: The forked VM terminated without saying properly goodbye. VM crash or System.exit
called ?
cause : Execution default-test of goal org.apache.maven.plugins:maven-surefire-plugin:2.12.2:test
failed: The forked VM terminated without saying properly goodbye. VM crash or System.exit
called ?
Stack trace : 
org.apache.maven.lifecycle.LifecycleExecutionException: Failed to execute goal org.apache.maven.plugins:maven-surefire-plugin:2.12.2:test
(default-test) on project apacheds-service: Execution default-test of goal org.apache.maven.plugins:maven-surefire-plugin:2.12.2:test
failed: The forked VM terminated without saying properly goodbye. VM crash or System.exit
called ?
	at org.apache.maven.lifecycle.internal.MojoExecutor.execute(MojoExecutor.java:225)
	at org.apache.maven.lifecycle.internal.MojoExecutor.execute(MojoExecutor.java:153)
	at org.apache.maven.lifecycle.internal.MojoExecutor.execute(MojoExecutor.java:145)
	at org.apache.maven.lifecycle.internal.LifecycleModuleBuilder.buildProject(LifecycleModuleBuilder.java:84)
	at org.apache.maven.lifecycle.internal.LifecycleModuleBuilder.buildProject(LifecycleModuleBuilder.java:59)
	at org.apache.maven.lifecycle.internal.LifecycleStarter.singleThreadedBuild(LifecycleStarter.java:183)
	at org.apache.maven.lifecycle.internal.LifecycleStarter.execute(LifecycleStarter.java:161)
	at org.apache.maven.DefaultMaven.doExecute(DefaultMaven.java:319)
	at org.apache.maven.DefaultMaven.execute(DefaultMaven.java:156)
	at org.jvnet.hudson.maven3.launcher.Maven3Launcher.main(Maven3Launcher.java:79)
	at sun.reflect.NativeMethodAccessorImpl.invoke0(Native Method)
	at sun.reflect.NativeMethodAccessorImpl.invoke(NativeMethodAccessorImpl.java:39)
	at sun.reflect.DelegatingMethodAccessorImpl.invoke(DelegatingMethodAccessorImpl.java:25)
	at java.lang.reflect.Method.invoke(Method.java:597)
	at org.codehaus.plexus.classworlds.launcher.Launcher.launchStandard(Launcher.java:329)
	at org.codehaus.plexus.classworlds.launcher.Launcher.launch(Launcher.java:239)
	at org.jvnet.hudson.maven3.agent.Maven3Main.launch(Maven3Main.java:158)
	at hudson.maven.Maven3Builder.call(Maven3Builder.java:100)
	at hudson.maven.Maven3Builder.call(Maven3Builder.java:66)
	at hudson.remoting.UserRequest.perform(UserRequest.java:118)
	at hudson.remoting.UserRequest.perform(UserRequest.java:48)
	at hudson.remoting.Request$2.run(Request.java:326)
	at hudson.remoting.InterceptingExecutorService$1.call(InterceptingExecutorService.java:72)
	at java.util.concurrent.FutureTask$Sync.innerRun(FutureTask.java:303)
	at java.util.concurrent.FutureTask.run(FutureTask.java:138)
	at java.util.concurrent.ThreadPoolExecutor$Worker.runTask(ThreadPoolExecutor.java:886)
	at java.util.concurrent.ThreadPoolExecutor$Worker.run(ThreadPoolExecutor.java:908)
	at java.lang.Thread.run(Thread.java:662)
Caused by: org.apache.maven.plugin.PluginExecutionException: Execution default-test of goal
org.apache.maven.plugins:maven-surefire-plugin:2.12.2:test failed: The forked VM terminated
without saying properly goodbye. VM crash or System.exit called ?
	at org.apache.maven.plugin.DefaultBuildPluginManager.executeMojo(DefaultBuildPluginManager.java:116)
	at org.apache.maven.lifecycle.internal.MojoExecutor.execute(MojoExecutor.java:209)
	... 27 more
Caused by: java.lang.RuntimeException: The forked VM terminated without saying properly goodbye.
VM crash or System.exit called ?
	at org.apache.maven.plugin.surefire.booterclient.output.ForkClient.close(ForkClient.java:245)
	at org.apache.maven.plugin.surefire.booterclient.ForkStarter.fork(ForkStarter.java:282)
	at org.apache.maven.plugin.surefire.booterclient.ForkStarter.run(ForkStarter.java:116)
	at org.apache.maven.plugin.surefire.AbstractSurefireMojo.executeProvider(AbstractSurefireMojo.java:695)
	at org.apache.maven.plugin.surefire.AbstractSurefireMojo.executeAllProviders(AbstractSurefireMojo.java:666)
	at org.apache.maven.plugin.surefire.AbstractSurefireMojo.executeAfterPreconditionsChecked(AbstractSurefireMojo.java:624)
	at org.apache.maven.plugin.surefire.AbstractSurefireMojo.execute(AbstractSurefireMojo.java:587)
	at org.apache.maven.plugin.DefaultBuildPluginManager.executeMojo(DefaultBuildPluginManager.java:107)
	... 28 more
Maven failed with error.
Sending e-mails to: notifications@directory.apache.org
Sending e-mails to: notifications@directory.apache.org
Sending e-mails to: notifications@directory.apache.org
Sending e-mails to: notifications@directory.apache.org
channel stopped

Mime
View raw message