directory-notifications mailing list archives

Site index · List index
Message view « Date » · « Thread »
Top « Date » · « Thread »
From Apache Jenkins Server <jenk...@builds.apache.org>
Subject Build failed in Jenkins: dir-apacheds-jdk16-win #265
Date Mon, 10 Dec 2012 04:05:24 GMT
See <https://builds.apache.org/job/dir-apacheds-jdk16-win/265/>

------------------------------------------
[...truncated 1972 lines...]
mojoStarted org.apache.geronimo.genesis.plugins:tools-maven-plugin:1.4(verify-legal-files)
[INFO] 
[INFO] --- tools-maven-plugin:1.4:verify-legal-files (verify-legal-files) @ apacheds-xdbm-partition
---
[INFO] Checking legal files in: apacheds-xdbm-partition-2.0.0-M9-SNAPSHOT.jar
[INFO] Checking legal files in: apacheds-xdbm-partition-2.0.0-M9-SNAPSHOT-tests.jar
mojoSucceeded org.apache.geronimo.genesis.plugins:tools-maven-plugin:1.4(verify-legal-files)
mojoStarted org.apache.maven.plugins:maven-install-plugin:2.3.1(default-install)
[INFO] 
[INFO] --- maven-install-plugin:2.3.1:install (default-install) @ apacheds-xdbm-partition
---[INFO] Installing F:\hudson\hudson-slave\workspace\dir-apacheds-jdk16-win\trunk\xdbm-partition\target\apacheds-xdbm-partition-2.0.0-M9-SNAPSHOT.jar
to f:\hudson\hudson-slave\maven-repositories\0\org\apache\directory\server\apacheds-xdbm-partition\2.0.0-M9-SNAPSHOT\apacheds-xdbm-partition-2.0.0-M9-SNAPSHOT.jar

[INFO] Installing F:\hudson\hudson-slave\workspace\dir-apacheds-jdk16-win\trunk\xdbm-partition\pom.xml
to f:\hudson\hudson-slave\maven-repositories\0\org\apache\directory\server\apacheds-xdbm-partition\2.0.0-M9-SNAPSHOT\apacheds-xdbm-partition-2.0.0-M9-SNAPSHOT.pom
[INFO] Installing F:\hudson\hudson-slave\workspace\dir-apacheds-jdk16-win\trunk\xdbm-partition\target\apacheds-xdbm-partition-2.0.0-M9-SNAPSHOT-tests.jar
to f:\hudson\hudson-slave\maven-repositories\0\org\apache\directory\server\apacheds-xdbm-partition\2.0.0-M9-SNAPSHOT\apacheds-xdbm-partition-2.0.0-M9-SNAPSHOT-tests.jar
mojoSucceeded org.apache.maven.plugins:maven-install-plugin:2.3.1(default-install)
mojoStarted org.apache.felix:maven-bundle-plugin:2.3.7(default-install)
[INFO] 
[INFO] --- maven-bundle-plugin:2.3.7:install (default-install) @ apacheds-xdbm-partition ---
[INFO] Installing org/apache/directory/server/apacheds-xdbm-partition/2.0.0-M9-SNAPSHOT/apacheds-xdbm-partition-2.0.0-M9-SNAPSHOT.jar
[INFO] Writing OBR metadata
mojoSucceeded org.apache.felix:maven-bundle-plugin:2.3.7(default-install)
projectSucceeded org.apache.directory.server:apacheds-xdbm-partition:2.0.0-M9-SNAPSHOT
projectStarted org.apache.directory.server:apacheds-ldif-partition:2.0.0-M9-SNAPSHOT
[INFO]                                                                         
[INFO] ------------------------------------------------------------------------
[INFO] Building ApacheDS LDIF Partition 2.0.0-M9-SNAPSHOT
[INFO] ------------------------------------------------------------------------
mojoStarted org.apache.maven.plugins:maven-clean-plugin:2.4.1(default-clean)
[INFO] 
[INFO] [INFO] Deleting F:\hudson\hudson-slave\workspace\dir-apacheds-jdk16-win\trunk\ldif-partition\target
--- maven-clean-plugin:2.4.1:clean (default-clean) @ apacheds-ldif-partition ---
mojoSucceeded org.apache.maven.plugins:maven-clean-plugin:2.4.1(default-clean)
mojoStarted org.apache.maven.plugins:maven-remote-resources-plugin:1.2.1(default)
[INFO] 
[INFO] --- maven-remote-resources-plugin:1.2.1:process (default) @ apacheds-ldif-partition
---
mojoSucceeded org.apache.maven.plugins:maven-remote-resources-plugin:1.2.1(default)
mojoStarted org.apache.maven.plugins:maven-resources-plugin:2.5(default-resources)[debug]
execute contextualize
[INFO] Using 'UTF-8' encoding to copy filtered resources.

[INFO] 
[INFO] --- maven-resources-plugin:2.5:resources (default-resources) @ apacheds-ldif-partition
---
[INFO] Copying 2 resources
[INFO] Copying 3 resources
mojoSucceeded org.apache.maven.plugins:maven-resources-plugin:2.5(default-resources)
mojoStarted org.apache.maven.plugins:maven-compiler-plugin:2.5.1(default-compile)
[INFO] 
[INFO] --- maven-compiler-plugin:2.5.1:compile (default-compile) @ apacheds-ldif-partition
---
[INFO] Compiling 3 source files to F:\hudson\hudson-slave\workspace\dir-apacheds-jdk16-win\trunk\ldif-partition\target\classes
mojoSucceeded org.apache.maven.plugins:maven-compiler-plugin:2.5.1(default-compile)
mojoStarted org.apache.maven.plugins:maven-resources-plugin:2.5(default-testResources)[debug]
execute contextualize

[INFO] 
[INFO] --- maven-resources-plugin:2.5:testResources (default-testResources) @ apacheds-ldif-partition
---
[INFO] Using 'UTF-8' encoding to copy filtered resources.
[INFO] Copying 1 resource
[INFO] Copying 3 resources
mojoSucceeded org.apache.maven.plugins:maven-resources-plugin:2.5(default-testResources)
mojoStarted org.apache.maven.plugins:maven-compiler-plugin:2.5.1(default-testCompile)
[INFO] 
[INFO] --- maven-compiler-plugin:2.5.1:testCompile (default-testCompile) @ apacheds-ldif-partition
---
[INFO] Compiling 2 source files to F:\hudson\hudson-slave\workspace\dir-apacheds-jdk16-win\trunk\ldif-partition\target\test-classes
[INFO] -------------------------------------------------------------
[ERROR] COMPILATION ERROR : 
[INFO] -------------------------------------------------------------
[ERROR] F:\hudson\hudson-slave\workspace\dir-apacheds-jdk16-win\trunk\ldif-partition\src\test\java\org\apache\directory\server\core\partition\ldif\SingleFileLdifPartitionTest.java:[236,13]
cannot find symbol
symbol  : method setReturningAttributes(java.lang.String[])
location: class org.apache.directory.server.core.api.interceptor.context.LookupOperationContext
[INFO] 1 error
[INFO] -------------------------------------------------------------
mojoFailed org.apache.maven.plugins:maven-compiler-plugin:2.5.1(default-testCompile)
projectFailed org.apache.directory.server:apacheds-ldif-partition:2.0.0-M9-SNAPSHOT
sessionEnded
[INFO] ------------------------------------------------------------------------
[INFO] Reactor Summary:
[INFO] 
[INFO] ApacheDS .......................................... SUCCESS [4.704s]
[INFO] ApacheDS I18n ..................................... SUCCESS [4.881s]
[INFO] ApacheDS Core Constants ........................... SUCCESS [1.225s]
[INFO] ApacheDS Core API ................................. SUCCESS [20.184s]
[INFO] ApacheDS Core Shared .............................. SUCCESS [2.745s]
[INFO] ApacheDS Interceptors ............................. SUCCESS [0.140s]
[INFO] ApacheDS AdministrativePoint Interceptor .......... SUCCESS [1.893s]
[INFO] ApacheDS Authentication Interceptor ............... SUCCESS [5.894s]
[INFO] ApacheDS Authorization Interceptor ................ SUCCESS [14.146s]
[INFO] ApacheDS ChangeLog Interceptor .................... SUCCESS [4.041s]
[INFO] ApacheDS Collective Attribute Interceptor ......... SUCCESS [1.953s]
[INFO] ApacheDS Event Interceptor ........................ SUCCESS [1.290s]
[INFO] ApacheDS Exception Interceptor .................... SUCCESS [1.043s]
[INFO] ApacheDS Journal Interceptor ...................... SUCCESS [1.223s]
[INFO] ApacheDS Normalization Interceptor ................ SUCCESS [3.018s]
[INFO] ApacheDS Operational Attribute Interceptor ........ SUCCESS [1.076s]
[INFO] ApacheDS Referral Interceptor ..................... SUCCESS [1.058s]
[INFO] ApacheDS Schema Interceptor ....................... SUCCESS [6.787s]
[INFO] ApacheDS Subtree Interceptor ...................... SUCCESS [28.901s]
[INFO] ApacheDS Triggers Interceptor ..................... SUCCESS [2.301s]
[INFO] ApacheDS Core ..................................... SUCCESS [6.408s]
[INFO] ApacheDS Core AVL ................................. SUCCESS [17.709s]
[INFO] ApacheDS Generalized (X) DBM Partition ............ SUCCESS [23.056s]
[INFO] ApacheDS LDIF Partition ........................... FAILURE [1.238s]
[INFO] ApacheDS JDBM Partition ........................... SKIPPED
[INFO] ApacheDS Core Annotations ......................... SKIPPED
[INFO] ApacheDS Core JNDI ................................ SKIPPED
[INFO] ApacheDS Protocol Shared .......................... SKIPPED
[INFO] ApacheDS Protocol Kerberos Codec .................. SKIPPED
[INFO] ApacheDS Interceptors for Kerberos ................ SKIPPED
[INFO] ApacheDS Protocol Dhcp ............................ SKIPPED
[INFO] ApacheDS Protocol Dns ............................. SKIPPED
[INFO] ApacheDS Protocol Kerberos ........................ SKIPPED
[INFO] ApacheDS Protocol Ldap ............................ SKIPPED
[INFO] ApacheDS Protocol Ntp ............................. SKIPPED
[INFO] Apacheds Server Annotations ....................... SKIPPED
[INFO] ApacheDS Server Config ............................ SKIPPED
[INFO] ApacheDS Server JNDI .............................. SKIPPED
[INFO] ApacheDS Server Replication Service ............... SKIPPED
[INFO] ApacheDS Test Framework ........................... SKIPPED
[INFO] ApacheDS Generalized (X) DBM Tools ................ SKIPPED
[INFO] ApacheDS All ...................................... SKIPPED
[INFO] ApacheDS Logger Interceptor ....................... SKIPPED
[INFO] ApacheDS Password Hashing Interceptor ............. SKIPPED
[INFO] ApacheDS Core Integration ......................... SKIPPED
[INFO] ApacheDS Server Integration ....................... SKIPPED
[INFO] ApacheDS DirectoryService-WebApp bridge ........... SKIPPED
[INFO] ApacheDS Jetty HTTP Server Integration ............ SKIPPED
[INFO] ApacheDS Service Builder .......................... SKIPPED
[INFO] ApacheDS Protocol Kerberos Test ................... SKIPPED
[INFO] Apache Directory LDAP Client API test ............. SKIPPED
[INFO] ApacheDS Service .................................. SKIPPED
[INFO] ApacheDS Wrapper .................................. SKIPPED
[INFO] ApacheDS Installers Maven Plugin .................. SKIPPED
[INFO] ApacheDS Installers ............................... SKIPPED
[INFO] ------------------------------------------------------------------------
[INFO] BUILD FAILURE
[INFO] ------------------------------------------------------------------------
[INFO] Total time: 2:40.388s
[INFO] Finished at: Mon Dec 10 04:05:09 GMT 2012
[INFO] Final Memory: 47M/221M
[INFO] ------------------------------------------------------------------------
Projects to build: [MavenProject: org.apache.directory.server:apacheds-parent:2.0.0-M9-SNAPSHOT
@ <https://builds.apache.org/job/dir-apacheds-jdk16-win/ws/trunk\pom.xml,> MavenProject:
org.apache.directory.server:apacheds-i18n:2.0.0-M9-SNAPSHOT @ F:\hudson\hudson-slave\workspace\dir-apacheds-jdk16-win\trunk\i18n\pom.xml,
MavenProject: org.apache.directory.server:apacheds-core-constants:2.0.0-M9-SNAPSHOT @ F:\hudson\hudson-slave\workspace\dir-apacheds-jdk16-win\trunk\core-constants\pom.xml,
MavenProject: org.apache.directory.server:apacheds-core-api:2.0.0-M9-SNAPSHOT @ F:\hudson\hudson-slave\workspace\dir-apacheds-jdk16-win\trunk\core-api\pom.xml,
MavenProject: org.apache.directory.server:apacheds-core-shared:2.0.0-M9-SNAPSHOT @ F:\hudson\hudson-slave\workspace\dir-apacheds-jdk16-win\trunk\core-shared\pom.xml,
MavenProject: org.apache.directory.server:apacheds-interceptors:2.0.0-M9-SNAPSHOT @ F:\hudson\hudson-slave\workspace\dir-apacheds-jdk16-win\trunk\interceptors\pom.xml,
MavenProject: org.apache.directory.server:apacheds-interceptors-admin:2.0.0-M9-SNAPSHOT @
F:\hudson\hudson-slave\workspace\dir-apacheds-jdk16-win\trunk\interceptors\admin\pom.xml,
MavenProject: org.apache.directory.server:apacheds-interceptors-authn:2.0.0-M9-SNAPSHOT @
F:\hudson\hudson-slave\workspace\dir-apacheds-jdk16-win\trunk\interceptors\authn\pom.xml,
MavenProject: org.apache.directory.server:apacheds-interceptors-authz:2.0.0-M9-SNAPSHOT @
F:\hudson\hudson-slave\workspace\dir-apacheds-jdk16-win\trunk\interceptors\authz\pom.xml,
MavenProject: org.apache.directory.server:apacheds-interceptors-changelog:2.0.0-M9-SNAPSHOT
@ F:\hudson\hudson-slave\workspace\dir-apacheds-jdk16-win\trunk\interceptors\changelog\pom.xml,
MavenProject: org.apache.directory.server:apacheds-interceptors-collective:2.0.0-M9-SNAPSHOT
@ F:\hudson\hudson-slave\workspace\dir-apacheds-jdk16-win\trunk\interceptors\collective\pom.xml,
MavenProject: org.apache.directory.server:apacheds-interceptors-event:2.0.0-M9-SNAPSHOT @
F:\hudson\hudson-slave\workspace\dir-apacheds-jdk16-win\trunk\interceptors\event\pom.xml,
MavenProject: org.apache.directory.server:apacheds-interceptors-exception:2.0.0-M9-SNAPSHOT
@ F:\hudson\hudson-slave\workspace\dir-apacheds-jdk16-win\trunk\interceptors\exception\pom.xml,
MavenProject: org.apache.directory.server:apacheds-interceptors-journal:2.0.0-M9-SNAPSHOT
@ F:\hudson\hudson-slave\workspace\dir-apacheds-jdk16-win\trunk\interceptors\journal\pom.xml,
MavenProject: org.apache.directory.server:apacheds-interceptors-normalization:2.0.0-M9-SNAPSHOT
@ F:\hudson\hudson-slave\workspace\dir-apacheds-jdk16-win\trunk\interceptors\normalization\pom.xml,
MavenProject: org.apache.directory.server:apacheds-interceptors-operational:2.0.0-M9-SNAPSHOT
@ F:\hudson\hudson-slave\workspace\dir-apacheds-jdk16-win\trunk\interceptors\operational\pom.xml,
MavenProject: org.apache.directory.server:apacheds-interceptors-referral:2.0.0-M9-SNAPSHOT
@ F:\hudson\hudson-slave\workspace\dir-apacheds-jdk16-win\trunk\interceptors\referral\pom.xml,
MavenProject: org.apache.directory.server:apacheds-interceptors-schema:2.0.0-M9-SNAPSHOT @
F:\hudson\hudson-slave\workspace\dir-apacheds-jdk16-win\trunk\interceptors\schema\pom.xml,
MavenProject: org.apache.directory.server:apacheds-interceptors-subtree:2.0.0-M9-SNAPSHOT
@ F:\hudson\hudson-slave\workspace\dir-apacheds-jdk16-win\trunk\interceptors\subtree\pom.xml,
MavenProject: org.apache.directory.server:apacheds-interceptors-trigger:2.0.0-M9-SNAPSHOT
@ F:\hudson\hudson-slave\workspace\dir-apacheds-jdk16-win\trunk\interceptors\trigger\pom.xml,
MavenProject: org.apache.directory.server:apacheds-core:2.0.0-M9-SNAPSHOT @ F:\hudson\hudson-slave\workspace\dir-apacheds-jdk16-win\trunk\core\pom.xml,
MavenProject: org.apache.directory.server:apacheds-core-avl:2.0.0-M9-SNAPSHOT @ F:\hudson\hudson-slave\workspace\dir-apacheds-jdk16-win\trunk\core-avl\pom.xml,
MavenProject: org.apache.directory.server:apacheds-xdbm-partition:2.0.0-M9-SNAPSHOT @ F:\hudson\hudson-slave\workspace\dir-apacheds-jdk16-win\trunk\xdbm-partition\pom.xml,
MavenProject: org.apache.directory.server:apacheds-ldif-partition:2.0.0-M9-SNAPSHOT @ F:\hudson\hudson-slave\workspace\dir-apacheds-jdk16-win\trunk\ldif-partition\pom.xml,
MavenProject: org.apache.directory.server:apacheds-jdbm-partition:2.0.0-M9-SNAPSHOT @ F:\hudson\hudson-slave\workspace\dir-apacheds-jdk16-win\trunk\jdbm-partition\pom.xml,
MavenProject: org.apache.directory.server:apacheds-core-annotations:2.0.0-M9-SNAPSHOT @ F:\hudson\hudson-slave\workspace\dir-apacheds-jdk16-win\trunk\core-annotations\pom.xml,
MavenProject: org.apache.directory.server:apacheds-core-jndi:2.0.0-M9-SNAPSHOT @ F:\hudson\hudson-slave\workspace\dir-apacheds-jdk16-win\trunk\core-jndi\pom.xml,
MavenProject: org.apache.directory.server:apacheds-protocol-shared:2.0.0-M9-SNAPSHOT @ F:\hudson\hudson-slave\workspace\dir-apacheds-jdk16-win\trunk\protocol-shared\pom.xml,
MavenProject: org.apache.directory.server:apacheds-kerberos-codec:2.0.0-M9-SNAPSHOT @ F:\hudson\hudson-slave\workspace\dir-apacheds-jdk16-win\trunk\kerberos-codec\pom.xml,
MavenProject: org.apache.directory.server:apacheds-interceptor-kerberos:2.0.0-M9-SNAPSHOT
@ F:\hudson\hudson-slave\workspace\dir-apacheds-jdk16-win\trunk\interceptor-kerberos\pom.xml,
MavenProject: org.apache.directory.server:apacheds-protocol-dhcp:2.0.0-M9-SNAPSHOT @ F:\hudson\hudson-slave\workspace\dir-apacheds-jdk16-win\trunk\protocol-dhcp\pom.xml,
MavenProject: org.apache.directory.server:apacheds-protocol-dns:2.0.0-M9-SNAPSHOT @ F:\hudson\hudson-slave\workspace\dir-apacheds-jdk16-win\trunk\protocol-dns\pom.xml,
MavenProject: org.apache.directory.server:apacheds-protocol-kerberos:2.0.0-M9-SNAPSHOT @ F:\hudson\hudson-slave\workspace\dir-apacheds-jdk16-win\trunk\protocol-kerberos\pom.xml,
MavenProject: org.apache.directory.server:apacheds-protocol-ldap:2.0.0-M9-SNAPSHOT @ F:\hudson\hudson-slave\workspace\dir-apacheds-jdk16-win\trunk\protocol-ldap\pom.xml,
MavenProject: org.apache.directory.server:apacheds-protocol-ntp:2.0.0-M9-SNAPSHOT @ F:\hudson\hudson-slave\workspace\dir-apacheds-jdk16-win\trunk\protocol-ntp\pom.xml,
MavenProject: org.apache.directory.server:apacheds-server-annotations:2.0.0-M9-SNAPSHOT @
F:\hudson\hudson-slave\workspace\dir-apacheds-jdk16-win\trunk\server-annotations\pom.xml,
MavenProject: org.apache.directory.server:apacheds-server-config:2.0.0-M9-SNAPSHOT @ F:\hudson\hudson-slave\workspace\dir-apacheds-jdk16-win\trunk\server-config\pom.xml,
MavenProject: org.apache.directory.server:apacheds-server-jndi:2.0.0-M9-SNAPSHOT @ F:\hudson\hudson-slave\workspace\dir-apacheds-jdk16-win\trunk\server-jndi\pom.xml,
MavenProject: org.apache.directory.server:apacheds-server-replication:2.0.0-M9-SNAPSHOT @
F:\hudson\hudson-slave\workspace\dir-apacheds-jdk16-win\trunk\server-replication\pom.xml,
MavenProject: org.apache.directory.server:apacheds-test-framework:2.0.0-M9-SNAPSHOT @ F:\hudson\hudson-slave\workspace\dir-apacheds-jdk16-win\trunk\test-framework\pom.xml,
MavenProject: org.apache.directory.server:apacheds-xdbm-tools:2.0.0-M9-SNAPSHOT @ F:\hudson\hudson-slave\workspace\dir-apacheds-jdk16-win\trunk\xdbm-tools\pom.xml,
MavenProject: org.apache.directory.server:apacheds-all:2.0.0-M9-SNAPSHOT @ F:\hudson\hudson-slave\workspace\dir-apacheds-jdk16-win\trunk\all\pom.xml,
MavenProject: org.apache.directory.server:apacheds-interceptors-logger:2.0.0-M9-SNAPSHOT @
F:\hudson\hudson-slave\workspace\dir-apacheds-jdk16-win\trunk\interceptors\logger\pom.xml,
MavenProject: org.apache.directory.server:apacheds-interceptors-hash:2.0.0-M9-SNAPSHOT @ F:\hudson\hudson-slave\workspace\dir-apacheds-jdk16-win\trunk\interceptors\hash\pom.xml,
MavenProject: org.apache.directory.server:apacheds-core-integ:2.0.0-M9-SNAPSHOT @ F:\hudson\hudson-slave\workspace\dir-apacheds-jdk16-win\trunk\core-integ\pom.xml,
MavenProject: org.apache.directory.server:apacheds-server-integ:2.0.0-M9-SNAPSHOT @ F:\hudson\hudson-slave\workspace\dir-apacheds-jdk16-win\trunk\server-integ\pom.xml,
MavenProject: org.apache.directory.server:apacheds-http-directory-bridge:2.0.0-M9-SNAPSHOT
@ F:\hudson\hudson-slave\workspace\dir-apacheds-jdk16-win\trunk\http-directory-bridge\pom.xml,
MavenProject: org.apache.directory.server:apacheds-http-integration:2.0.0-M9-SNAPSHOT @ F:\hudson\hudson-slave\workspace\dir-apacheds-jdk16-win\trunk\http-integration\pom.xml,
MavenProject: org.apache.directory.server:apacheds-service-builder:2.0.0-M9-SNAPSHOT @ F:\hudson\hudson-slave\workspace\dir-apacheds-jdk16-win\trunk\service-builder\pom.xml,
MavenProject: org.apache.directory.server:apacheds-kerberos-test:2.0.0-M9-SNAPSHOT @ F:\hudson\hudson-slave\workspace\dir-apacheds-jdk16-win\trunk\kerberos-test\pom.xml,
MavenProject: org.apache.directory.server:ldap-client-test:2.0.0-M9-SNAPSHOT @ F:\hudson\hudson-slave\workspace\dir-apacheds-jdk16-win\trunk\ldap-client-test\pom.xml,
MavenProject: org.apache.directory.server:apacheds-service:2.0.0-M9-SNAPSHOT @ F:\hudson\hudson-slave\workspace\dir-apacheds-jdk16-win\trunk\service\pom.xml,
MavenProject: org.apache.directory.server:apacheds-wrapper:2.0.0-M9-SNAPSHOT @ F:\hudson\hudson-slave\workspace\dir-apacheds-jdk16-win\trunk\wrapper\pom.xml,
MavenProject: org.apache.directory.server:apacheds-installers-maven-plugin:2.0.0-M9-SNAPSHOT
@ F:\hudson\hudson-slave\workspace\dir-apacheds-jdk16-win\trunk\installers-maven-plugin\pom.xml,
MavenProject: org.apache.directory.server:apacheds-installers:2.0.0-M9-SNAPSHOT @ F:\hudson\hudson-slave\workspace\dir-apacheds-jdk16-win\trunk\installers\pom.xml]
[JENKINS] Archiving disabled
[JENKINS] Archiving disabled
[JENKINS] Archiving disabled
[JENKINS] Archiving disabled
[JENKINS] Archiving disabled
[JENKINS] Archiving disabled
[JENKINS] Archiving disabled
[JENKINS] Archiving disabled
[JENKINS] Archiving disabled
[JENKINS] Archiving disabled
[JENKINS] Archiving disabled
[JENKINS] Archiving disabled
[JENKINS] Archiving disabled
[JENKINS] Archiving disabled
[JENKINS] Archiving disabled
[JENKINS] Archiving disabled
[JENKINS] Archiving disabled
[JENKINS] Archiving disabled
[JENKINS] Archiving disabled
[JENKINS] Archiving disabled
[JENKINS] Archiving disabled
[JENKINS] Archiving disabled
[JENKINS] Archiving disabled
[JENKINS] Archiving disabled
[JENKINS] Archiving disabled
[JENKINS] Archiving disabled
[JENKINS] Archiving disabled
[JENKINS] Archiving disabled
[JENKINS] Archiving disabled
[JENKINS] Archiving disabled
[JENKINS] Archiving disabled
[JENKINS] Archiving disabled
[JENKINS] Archiving disabled
[JENKINS] Archiving disabled
[JENKINS] Archiving disabled
[JENKINS] Archiving disabled
[JENKINS] Archiving disabled
[JENKINS] Archiving disabled
[JENKINS] Archiving disabled
[JENKINS] Archiving disabled
[JENKINS] Archiving disabled
[JENKINS] Archiving disabled
[JENKINS] Archiving disabled
[JENKINS] Archiving disabled
[JENKINS] Archiving disabled
[JENKINS] Archiving disabled
[JENKINS] Archiving disabled
[JENKINS] Archiving disabled
[JENKINS] Archiving disabled
[JENKINS] Archiving disabled
[JENKINS] Archiving disabled
[JENKINS] Archiving disabled
[JENKINS] Archiving disabled
[JENKINS] Archiving disabled
[JENKINS] Archiving disabled
Waiting for Jenkins to finish collecting data
mavenExecutionResult exceptions not empty
message : Failed to execute goal org.apache.maven.plugins:maven-compiler-plugin:2.5.1:testCompile
(default-testCompile) on project apacheds-ldif-partition: Compilation failure
F:\hudson\hudson-slave\workspace\dir-apacheds-jdk16-win\trunk\ldif-partition\src\test\java\org\apache\directory\server\core\partition\ldif\SingleFileLdifPartitionTest.java:[236,13]
cannot find symbol
symbol  : method setReturningAttributes(java.lang.String[])
location: class org.apache.directory.server.core.api.interceptor.context.LookupOperationContext

cause : Compilation failure
F:\hudson\hudson-slave\workspace\dir-apacheds-jdk16-win\trunk\ldif-partition\src\test\java\org\apache\directory\server\core\partition\ldif\SingleFileLdifPartitionTest.java:[236,13]
cannot find symbol
symbol  : method setReturningAttributes(java.lang.String[])
location: class org.apache.directory.server.core.api.interceptor.context.LookupOperationContext

Stack trace : 
org.apache.maven.lifecycle.LifecycleExecutionException: Failed to execute goal org.apache.maven.plugins:maven-compiler-plugin:2.5.1:testCompile
(default-testCompile) on project apacheds-ldif-partition: Compilation failure
F:\hudson\hudson-slave\workspace\dir-apacheds-jdk16-win\trunk\ldif-partition\src\test\java\org\apache\directory\server\core\partition\ldif\SingleFileLdifPartitionTest.java:[236,13]
cannot find symbol
symbol  : method setReturningAttributes(java.lang.String[])
location: class org.apache.directory.server.core.api.interceptor.context.LookupOperationContext

	at org.apache.maven.lifecycle.internal.MojoExecutor.execute(MojoExecutor.java:213)
	at org.apache.maven.lifecycle.internal.MojoExecutor.execute(MojoExecutor.java:153)
	at org.apache.maven.lifecycle.internal.MojoExecutor.execute(MojoExecutor.java:145)
	at org.apache.maven.lifecycle.internal.LifecycleModuleBuilder.buildProject(LifecycleModuleBuilder.java:84)
	at org.apache.maven.lifecycle.internal.LifecycleModuleBuilder.buildProject(LifecycleModuleBuilder.java:59)
	at org.apache.maven.lifecycle.internal.LifecycleStarter.singleThreadedBuild(LifecycleStarter.java:183)
	at org.apache.maven.lifecycle.internal.LifecycleStarter.execute(LifecycleStarter.java:161)
	at org.apache.maven.DefaultMaven.doExecute(DefaultMaven.java:319)
	at org.apache.maven.DefaultMaven.execute(DefaultMaven.java:156)
	at org.jvnet.hudson.maven3.launcher.Maven3Launcher.main(Maven3Launcher.java:79)
	at sun.reflect.NativeMethodAccessorImpl.invoke0(Native Method)
	at sun.reflect.NativeMethodAccessorImpl.invoke(NativeMethodAccessorImpl.java:39)
	at sun.reflect.DelegatingMethodAccessorImpl.invoke(DelegatingMethodAccessorImpl.java:25)
	at java.lang.reflect.Method.invoke(Method.java:597)
	at org.codehaus.plexus.classworlds.launcher.Launcher.launchStandard(Launcher.java:329)
	at org.codehaus.plexus.classworlds.launcher.Launcher.launch(Launcher.java:239)
	at org.jvnet.hudson.maven3.agent.Maven3Main.launch(Maven3Main.java:158)
	at hudson.maven.Maven3Builder.call(Maven3Builder.java:98)
	at hudson.maven.Maven3Builder.call(Maven3Builder.java:64)
	at hudson.remoting.UserRequest.perform(UserRequest.java:118)
	at hudson.remoting.UserRequest.perform(UserRequest.java:48)
	at hudson.remoting.Request$2.run(Request.java:326)
	at hudson.remoting.InterceptingExecutorService$1.call(InterceptingExecutorService.java:72)
	at java.util.concurrent.FutureTask$Sync.innerRun(FutureTask.java:303)
	at java.util.concurrent.FutureTask.run(FutureTask.java:138)
	at java.util.concurrent.ThreadPoolExecutor$Worker.runTask(ThreadPoolExecutor.java:886)
	at java.util.concurrent.ThreadPoolExecutor$Worker.run(ThreadPoolExecutor.java:908)
	at java.lang.Thread.run(Thread.java:662)
Caused by: org.apache.maven.plugin.CompilationFailureException: Compilation failure
F:\hudson\hudson-slave\workspace\dir-apacheds-jdk16-win\trunk\ldif-partition\src\test\java\org\apache\directory\server\core\partition\ldif\SingleFileLdifPartitionTest.java:[236,13]
cannot find symbol
symbol  : method setReturningAttributes(java.lang.String[])
location: class org.apache.directory.server.core.api.interceptor.context.LookupOperationContext

	at org.apache.maven.plugin.AbstractCompilerMojo.execute(AbstractCompilerMojo.java:729)
	at org.apache.maven.plugin.TestCompilerMojo.execute(TestCompilerMojo.java:161)
	at org.apache.maven.plugin.DefaultBuildPluginManager.executeMojo(DefaultBuildPluginManager.java:107)
	at org.apache.maven.lifecycle.internal.MojoExecutor.execute(MojoExecutor.java:209)
	... 27 more
Sending e-mails to: notifications@directory.apache.org
channel stopped

Mime
View raw message