directory-notifications mailing list archives

Site index · List index
Message view « Date » · « Thread »
Top « Date » · « Thread »
From Apache Jenkins Server <jenk...@builds.apache.org>
Subject Build failed in Jenkins: dir-apacheds-jdk16-win #259
Date Sat, 01 Dec 2012 08:19:11 GMT
See <https://builds.apache.org/job/dir-apacheds-jdk16-win/259/changes>

Changes:

[elecharny] o Added some more explicit logs for the consumer connection
o Simplified the reconnection code : we now call the start( now ) method instead of having
the (almost) same code in two places
o Logged some trace when the baseDN does not exist, instead of throwing an exception

[elecharny] Added a toString() method

[elecharny] Added a test for RootDSE

------------------------------------------
[...truncated 4479 lines...]
Tests run: 2, Failures: 0, Errors: 0, Skipped: 0, Time elapsed: 19.695 sec
Running org.apache.directory.server.operations.modify.ModifyAddIT
Tests run: 16, Failures: 0, Errors: 0, Skipped: 0, Time elapsed: 34.524 sec
Running org.apache.directory.server.operations.modify.ModifyMultipleChangesIT
Tests run: 2, Failures: 0, Errors: 0, Skipped: 0, Time elapsed: 16.797 sec
Running org.apache.directory.server.operations.modify.ModifyReferralIT
Tests run: 4, Failures: 0, Errors: 0, Skipped: 0, Time elapsed: 20.716 sec
Running org.apache.directory.server.operations.modify.ModifyRemoveIT
Tests run: 16, Failures: 0, Errors: 0, Skipped: 0, Time elapsed: 40.706 sec
Running org.apache.directory.server.operations.modify.ModifyReplaceIT
Tests run: 7, Failures: 0, Errors: 0, Skipped: 0, Time elapsed: 15.363 sec
Running org.apache.directory.server.operations.modifydn.ModifyDnReferralIT
Tests run: 7, Failures: 0, Errors: 0, Skipped: 0, Time elapsed: 24.978 sec
Running org.apache.directory.server.operations.modifydn.ModifyRdnIT
Tests run: 19, Failures: 0, Errors: 0, Skipped: 2, Time elapsed: 37.353 sec
Running org.apache.directory.server.operations.modifydn.MoveIT
Tests run: 4, Failures: 0, Errors: 0, Skipped: 0, Time elapsed: 9.017 sec
Running org.apache.directory.server.operations.search.IndexedNegationSearchIT
Tests run: 3, Failures: 0, Errors: 0, Skipped: 0, Time elapsed: 24.129 sec
Running org.apache.directory.server.operations.search.NegationSearchIT
Tests run: 2, Failures: 0, Errors: 0, Skipped: 0, Time elapsed: 22.552 sec
Running org.apache.directory.server.operations.search.PagedSearchIT
Tests run: 37, Failures: 0, Errors: 0, Skipped: 0, Time elapsed: 60.944 sec
Running org.apache.directory.server.operations.search.PersistentSearchIT
Tests run: 9, Failures: 0, Errors: 0, Skipped: 0, Time elapsed: 36.469 sec
Running org.apache.directory.server.operations.search.ReferralSearchIT
Tests run: 7, Failures: 0, Errors: 0, Skipped: 0, Time elapsed: 22.611 sec
Running org.apache.directory.server.operations.search.ReferralSearchMoveAndRenameIT
Tests run: 1, Failures: 0, Errors: 0, Skipped: 0, Time elapsed: 13.072 sec
Running org.apache.directory.server.operations.search.ReferralSearchNoRevertIT
Tests run: 1, Failures: 0, Errors: 0, Skipped: 0, Time elapsed: 26.163 sec
Running org.apache.directory.server.operations.search.SchemaSearchIT
Tests run: 5, Failures: 0, Errors: 0, Skipped: 0, Time elapsed: 23.568 sec
Running org.apache.directory.server.operations.search.SearchIT
Tests run: 41, Failures: 0, Errors: 0, Skipped: 1, Time elapsed: 346.657 sec
Running org.apache.directory.server.operations.search.SearchLimitsIT
Tests run: 15, Failures: 0, Errors: 0, Skipped: 0, Time elapsed: 39.567 sec
Running org.apache.directory.server.replication.ClientInitialRefreshIT

---> Running testInitialRefreshLoad

NbAdded every 100ms : 
0, 0, 0, 0, 0, 11
<-- Done

---> Running testInitialRefreshLoadAndAdd

NbAdded every 100ms : 
0, 0, 0, 0, 11
NbAdded every 100ms : 
0, 1
<-- Done

---> Running testInitialRefreshStopAndGo

Completed so far : 
(consumer1 completed) 

NbAdded every 100ms : 
0, 0, 10
<-- Done

--->Running testInitialRefresh4Consumers

Completed so far : 
(consumer1 completed) 
(consumer2 completed) 
(consumer4 completed) 
(consumer3 completed) 

<-- Done
Tests run: 4, Failures: 0, Errors: 0, Skipped: 0, Time elapsed: 30.622 sec
Running org.apache.directory.server.replication.ClientServerReplicationIT

Results :

Tests run: 388, Failures: 0, Errors: 0, Skipped: 13

[WARNING] Could not delete temp direcotry F:\hudson\hudson-slave\workspace\dir-apacheds-jdk16-win\trunk\server-integ\target\surefire
because File F:\hudson\hudson-slave\workspace\dir-apacheds-jdk16-win\trunk\server-integ\target\surefire\surefirebooter6514891413309860302.jar
unable to be deleted.
mojoFailed org.apache.maven.plugins:maven-surefire-plugin:2.12.2(default-test)
[JENKINS] Recording test results
projectFailed org.apache.directory.server:apacheds-server-integ:2.0.0-M9-SNAPSHOT
sessionEnded
[INFO] ------------------------------------------------------------------------
[INFO] Reactor Summary:
[INFO] 
[INFO] ApacheDS .......................................... SUCCESS [1:36.408s]
[INFO] ApacheDS I18n ..................................... SUCCESS [37.535s]
[INFO] ApacheDS Core Constants ........................... SUCCESS [7.789s]
[INFO] ApacheDS Core API ................................. SUCCESS [1:22.145s]
[INFO] ApacheDS Core Shared .............................. SUCCESS [10.780s]
[INFO] ApacheDS Interceptors ............................. SUCCESS [0.944s]
[INFO] ApacheDS AdministrativePoint Interceptor .......... SUCCESS [6.068s]
[INFO] ApacheDS Authentication Interceptor ............... SUCCESS [13.409s]
[INFO] ApacheDS Authorization Interceptor ................ SUCCESS [38.401s]
[INFO] ApacheDS ChangeLog Interceptor .................... SUCCESS [21.078s]
[INFO] ApacheDS Collective Attribute Interceptor ......... SUCCESS [4.694s]
[INFO] ApacheDS Event Interceptor ........................ SUCCESS [6.715s]
[INFO] ApacheDS Exception Interceptor .................... SUCCESS [4.979s]
[INFO] ApacheDS Journal Interceptor ...................... SUCCESS [4.283s]
[INFO] ApacheDS Normalization Interceptor ................ SUCCESS [9.113s]
[INFO] ApacheDS Operational Attribute Interceptor ........ SUCCESS [5.461s]
[INFO] ApacheDS Referral Interceptor ..................... SUCCESS [4.997s]
[INFO] ApacheDS Schema Interceptor ....................... SUCCESS [28.104s]
[INFO] ApacheDS Subtree Interceptor ...................... SUCCESS [39.298s]
[INFO] ApacheDS Triggers Interceptor ..................... SUCCESS [5.457s]
[INFO] ApacheDS Core ..................................... SUCCESS [25.525s]
[INFO] ApacheDS Core AVL ................................. SUCCESS [18.762s]
[INFO] ApacheDS Generalized (X) DBM Partition ............ SUCCESS [2:32.764s]
[INFO] ApacheDS LDIF Partition ........................... SUCCESS [1:20.459s]
[INFO] ApacheDS JDBM Partition ........................... SUCCESS [2:26.853s]
[INFO] ApacheDS Core Annotations ......................... SUCCESS [2:58.984s]
[INFO] ApacheDS Core JNDI ................................ SUCCESS [17.712s]
[INFO] ApacheDS Protocol Shared .......................... SUCCESS [8.686s]
[INFO] ApacheDS Protocol Kerberos Codec .................. SUCCESS [1:09.068s]
[INFO] ApacheDS Interceptors for Kerberos ................ SUCCESS [10.494s]
[INFO] ApacheDS Protocol Dhcp ............................ SUCCESS [35.692s]
[INFO] ApacheDS Protocol Dns ............................. SUCCESS [31.590s]
[INFO] ApacheDS Protocol Kerberos ........................ SUCCESS [24.217s]
[INFO] ApacheDS Protocol Ldap ............................ SUCCESS [2:37.770s]
[INFO] ApacheDS Protocol Ntp ............................. SUCCESS [10.135s]
[INFO] Apacheds Server Annotations ....................... SUCCESS [2:12.663s]
[INFO] ApacheDS Server Config ............................ SUCCESS [2:03.634s]
[INFO] ApacheDS Server JNDI .............................. SUCCESS [6.814s]
[INFO] ApacheDS Server Replication Service ............... SUCCESS [3.743s]
[INFO] ApacheDS Test Framework ........................... SUCCESS [3:17.275s]
[INFO] ApacheDS Generalized (X) DBM Tools ................ SUCCESS [6.448s]
[INFO] ApacheDS All ...................................... SUCCESS [23.675s]
[INFO] ApacheDS Logger Interceptor ....................... SUCCESS [5.476s]
[INFO] ApacheDS Password Hashing Interceptor ............. SUCCESS [9.113s]
[INFO] ApacheDS Core Integration ......................... SUCCESS [40:10.266s]
[INFO] ApacheDS Server Integration ....................... FAILURE [32:17.679s]
[INFO] ApacheDS DirectoryService-WebApp bridge ........... SKIPPED
[INFO] ApacheDS Jetty HTTP Server Integration ............ SKIPPED
[INFO] ApacheDS Service Builder .......................... SKIPPED
[INFO] ApacheDS Protocol Kerberos Test ................... SKIPPED
[INFO] Apache Directory LDAP Client API test ............. SKIPPED
[INFO] ApacheDS Service .................................. SKIPPED
[INFO] ApacheDS Wrapper .................................. SKIPPED
[INFO] ApacheDS Installers Maven Plugin .................. SKIPPED
[INFO] ApacheDS Installers ............................... SKIPPED
[INFO] ------------------------------------------------------------------------
[INFO] BUILD FAILURE
[INFO] ------------------------------------------------------------------------
[INFO] Total time: 1:44:53.795s
[INFO] Finished at: Sat Dec 01 08:16:51 GMT 2012
[INFO] Final Memory: 58M/242M
[INFO] ------------------------------------------------------------------------
Projects to build: [MavenProject: org.apache.directory.server:apacheds-parent:2.0.0-M9-SNAPSHOT
@ <https://builds.apache.org/job/dir-apacheds-jdk16-win/ws/trunk\pom.xml,> MavenProject:
org.apache.directory.server:apacheds-i18n:2.0.0-M9-SNAPSHOT @ F:\hudson\hudson-slave\workspace\dir-apacheds-jdk16-win\trunk\i18n\pom.xml,
MavenProject: org.apache.directory.server:apacheds-core-constants:2.0.0-M9-SNAPSHOT @ F:\hudson\hudson-slave\workspace\dir-apacheds-jdk16-win\trunk\core-constants\pom.xml,
MavenProject: org.apache.directory.server:apacheds-core-api:2.0.0-M9-SNAPSHOT @ F:\hudson\hudson-slave\workspace\dir-apacheds-jdk16-win\trunk\core-api\pom.xml,
MavenProject: org.apache.directory.server:apacheds-core-shared:2.0.0-M9-SNAPSHOT @ F:\hudson\hudson-slave\workspace\dir-apacheds-jdk16-win\trunk\core-shared\pom.xml,
MavenProject: org.apache.directory.server:apacheds-interceptors:2.0.0-M9-SNAPSHOT @ F:\hudson\hudson-slave\workspace\dir-apacheds-jdk16-win\trunk\interceptors\pom.xml,
MavenProject: org.apache.directory.server:apacheds-interceptors-admin:2.0.0-M9-SNAPSHOT @
F:\hudson\hudson-slave\workspace\dir-apacheds-jdk16-win\trunk\interceptors\admin\pom.xml,
MavenProject: org.apache.directory.server:apacheds-interceptors-authn:2.0.0-M9-SNAPSHOT @
F:\hudson\hudson-slave\workspace\dir-apacheds-jdk16-win\trunk\interceptors\authn\pom.xml,
MavenProject: org.apache.directory.server:apacheds-interceptors-authz:2.0.0-M9-SNAPSHOT @
F:\hudson\hudson-slave\workspace\dir-apacheds-jdk16-win\trunk\interceptors\authz\pom.xml,
MavenProject: org.apache.directory.server:apacheds-interceptors-changelog:2.0.0-M9-SNAPSHOT
@ F:\hudson\hudson-slave\workspace\dir-apacheds-jdk16-win\trunk\interceptors\changelog\pom.xml,
MavenProject: org.apache.directory.server:apacheds-interceptors-collective:2.0.0-M9-SNAPSHOT
@ F:\hudson\hudson-slave\workspace\dir-apacheds-jdk16-win\trunk\interceptors\collective\pom.xml,
MavenProject: org.apache.directory.server:apacheds-interceptors-event:2.0.0-M9-SNAPSHOT @
F:\hudson\hudson-slave\workspace\dir-apacheds-jdk16-win\trunk\interceptors\event\pom.xml,
MavenProject: org.apache.directory.server:apacheds-interceptors-exception:2.0.0-M9-SNAPSHOT
@ F:\hudson\hudson-slave\workspace\dir-apacheds-jdk16-win\trunk\interceptors\exception\pom.xml,
MavenProject: org.apache.directory.server:apacheds-interceptors-journal:2.0.0-M9-SNAPSHOT
@ F:\hudson\hudson-slave\workspace\dir-apacheds-jdk16-win\trunk\interceptors\journal\pom.xml,
MavenProject: org.apache.directory.server:apacheds-interceptors-normalization:2.0.0-M9-SNAPSHOT
@ F:\hudson\hudson-slave\workspace\dir-apacheds-jdk16-win\trunk\interceptors\normalization\pom.xml,
MavenProject: org.apache.directory.server:apacheds-interceptors-operational:2.0.0-M9-SNAPSHOT
@ F:\hudson\hudson-slave\workspace\dir-apacheds-jdk16-win\trunk\interceptors\operational\pom.xml,
MavenProject: org.apache.directory.server:apacheds-interceptors-referral:2.0.0-M9-SNAPSHOT
@ F:\hudson\hudson-slave\workspace\dir-apacheds-jdk16-win\trunk\interceptors\referral\pom.xml,
MavenProject: org.apache.directory.server:apacheds-interceptors-schema:2.0.0-M9-SNAPSHOT @
F:\hudson\hudson-slave\workspace\dir-apacheds-jdk16-win\trunk\interceptors\schema\pom.xml,
MavenProject: org.apache.directory.server:apacheds-interceptors-subtree:2.0.0-M9-SNAPSHOT
@ F:\hudson\hudson-slave\workspace\dir-apacheds-jdk16-win\trunk\interceptors\subtree\pom.xml,
MavenProject: org.apache.directory.server:apacheds-interceptors-trigger:2.0.0-M9-SNAPSHOT
@ F:\hudson\hudson-slave\workspace\dir-apacheds-jdk16-win\trunk\interceptors\trigger\pom.xml,
MavenProject: org.apache.directory.server:apacheds-core:2.0.0-M9-SNAPSHOT @ F:\hudson\hudson-slave\workspace\dir-apacheds-jdk16-win\trunk\core\pom.xml,
MavenProject: org.apache.directory.server:apacheds-core-avl:2.0.0-M9-SNAPSHOT @ F:\hudson\hudson-slave\workspace\dir-apacheds-jdk16-win\trunk\core-avl\pom.xml,
MavenProject: org.apache.directory.server:apacheds-xdbm-partition:2.0.0-M9-SNAPSHOT @ F:\hudson\hudson-slave\workspace\dir-apacheds-jdk16-win\trunk\xdbm-partition\pom.xml,
MavenProject: org.apache.directory.server:apacheds-ldif-partition:2.0.0-M9-SNAPSHOT @ F:\hudson\hudson-slave\workspace\dir-apacheds-jdk16-win\trunk\ldif-partition\pom.xml,
MavenProject: org.apache.directory.server:apacheds-jdbm-partition:2.0.0-M9-SNAPSHOT @ F:\hudson\hudson-slave\workspace\dir-apacheds-jdk16-win\trunk\jdbm-partition\pom.xml,
MavenProject: org.apache.directory.server:apacheds-core-annotations:2.0.0-M9-SNAPSHOT @ F:\hudson\hudson-slave\workspace\dir-apacheds-jdk16-win\trunk\core-annotations\pom.xml,
MavenProject: org.apache.directory.server:apacheds-core-jndi:2.0.0-M9-SNAPSHOT @ F:\hudson\hudson-slave\workspace\dir-apacheds-jdk16-win\trunk\core-jndi\pom.xml,
MavenProject: org.apache.directory.server:apacheds-protocol-shared:2.0.0-M9-SNAPSHOT @ F:\hudson\hudson-slave\workspace\dir-apacheds-jdk16-win\trunk\protocol-shared\pom.xml,
MavenProject: org.apache.directory.server:apacheds-kerberos-codec:2.0.0-M9-SNAPSHOT @ F:\hudson\hudson-slave\workspace\dir-apacheds-jdk16-win\trunk\kerberos-codec\pom.xml,
MavenProject: org.apache.directory.server:apacheds-interceptor-kerberos:2.0.0-M9-SNAPSHOT
@ F:\hudson\hudson-slave\workspace\dir-apacheds-jdk16-win\trunk\interceptor-kerberos\pom.xml,
MavenProject: org.apache.directory.server:apacheds-protocol-dhcp:2.0.0-M9-SNAPSHOT @ F:\hudson\hudson-slave\workspace\dir-apacheds-jdk16-win\trunk\protocol-dhcp\pom.xml,
MavenProject: org.apache.directory.server:apacheds-protocol-dns:2.0.0-M9-SNAPSHOT @ F:\hudson\hudson-slave\workspace\dir-apacheds-jdk16-win\trunk\protocol-dns\pom.xml,
MavenProject: org.apache.directory.server:apacheds-protocol-kerberos:2.0.0-M9-SNAPSHOT @ F:\hudson\hudson-slave\workspace\dir-apacheds-jdk16-win\trunk\protocol-kerberos\pom.xml,
MavenProject: org.apache.directory.server:apacheds-protocol-ldap:2.0.0-M9-SNAPSHOT @ F:\hudson\hudson-slave\workspace\dir-apacheds-jdk16-win\trunk\protocol-ldap\pom.xml,
MavenProject: org.apache.directory.server:apacheds-protocol-ntp:2.0.0-M9-SNAPSHOT @ F:\hudson\hudson-slave\workspace\dir-apacheds-jdk16-win\trunk\protocol-ntp\pom.xml,
MavenProject: org.apache.directory.server:apacheds-server-annotations:2.0.0-M9-SNAPSHOT @
F:\hudson\hudson-slave\workspace\dir-apacheds-jdk16-win\trunk\server-annotations\pom.xml,
MavenProject: org.apache.directory.server:apacheds-server-config:2.0.0-M9-SNAPSHOT @ F:\hudson\hudson-slave\workspace\dir-apacheds-jdk16-win\trunk\server-config\pom.xml,
MavenProject: org.apache.directory.server:apacheds-server-jndi:2.0.0-M9-SNAPSHOT @ F:\hudson\hudson-slave\workspace\dir-apacheds-jdk16-win\trunk\server-jndi\pom.xml,
MavenProject: org.apache.directory.server:apacheds-server-replication:2.0.0-M9-SNAPSHOT @
F:\hudson\hudson-slave\workspace\dir-apacheds-jdk16-win\trunk\server-replication\pom.xml,
MavenProject: org.apache.directory.server:apacheds-test-framework:2.0.0-M9-SNAPSHOT @ F:\hudson\hudson-slave\workspace\dir-apacheds-jdk16-win\trunk\test-framework\pom.xml,
MavenProject: org.apache.directory.server:apacheds-xdbm-tools:2.0.0-M9-SNAPSHOT @ F:\hudson\hudson-slave\workspace\dir-apacheds-jdk16-win\trunk\xdbm-tools\pom.xml,
MavenProject: org.apache.directory.server:apacheds-all:2.0.0-M9-SNAPSHOT @ F:\hudson\hudson-slave\workspace\dir-apacheds-jdk16-win\trunk\all\dependency-reduced-pom.xml,
MavenProject: org.apache.directory.server:apacheds-interceptors-logger:2.0.0-M9-SNAPSHOT @
F:\hudson\hudson-slave\workspace\dir-apacheds-jdk16-win\trunk\interceptors\logger\pom.xml,
MavenProject: org.apache.directory.server:apacheds-interceptors-hash:2.0.0-M9-SNAPSHOT @ F:\hudson\hudson-slave\workspace\dir-apacheds-jdk16-win\trunk\interceptors\hash\pom.xml,
MavenProject: org.apache.directory.server:apacheds-core-integ:2.0.0-M9-SNAPSHOT @ F:\hudson\hudson-slave\workspace\dir-apacheds-jdk16-win\trunk\core-integ\pom.xml,
MavenProject: org.apache.directory.server:apacheds-server-integ:2.0.0-M9-SNAPSHOT @ F:\hudson\hudson-slave\workspace\dir-apacheds-jdk16-win\trunk\server-integ\pom.xml,
MavenProject: org.apache.directory.server:apacheds-http-directory-bridge:2.0.0-M9-SNAPSHOT
@ F:\hudson\hudson-slave\workspace\dir-apacheds-jdk16-win\trunk\http-directory-bridge\pom.xml,
MavenProject: org.apache.directory.server:apacheds-http-integration:2.0.0-M9-SNAPSHOT @ F:\hudson\hudson-slave\workspace\dir-apacheds-jdk16-win\trunk\http-integration\pom.xml,
MavenProject: org.apache.directory.server:apacheds-service-builder:2.0.0-M9-SNAPSHOT @ F:\hudson\hudson-slave\workspace\dir-apacheds-jdk16-win\trunk\service-builder\pom.xml,
MavenProject: org.apache.directory.server:apacheds-kerberos-test:2.0.0-M9-SNAPSHOT @ F:\hudson\hudson-slave\workspace\dir-apacheds-jdk16-win\trunk\kerberos-test\pom.xml,
MavenProject: org.apache.directory.server:ldap-client-test:2.0.0-M9-SNAPSHOT @ F:\hudson\hudson-slave\workspace\dir-apacheds-jdk16-win\trunk\ldap-client-test\pom.xml,
MavenProject: org.apache.directory.server:apacheds-service:2.0.0-M9-SNAPSHOT @ F:\hudson\hudson-slave\workspace\dir-apacheds-jdk16-win\trunk\service\pom.xml,
MavenProject: org.apache.directory.server:apacheds-wrapper:2.0.0-M9-SNAPSHOT @ F:\hudson\hudson-slave\workspace\dir-apacheds-jdk16-win\trunk\wrapper\pom.xml,
MavenProject: org.apache.directory.server:apacheds-installers-maven-plugin:2.0.0-M9-SNAPSHOT
@ F:\hudson\hudson-slave\workspace\dir-apacheds-jdk16-win\trunk\installers-maven-plugin\pom.xml,
MavenProject: org.apache.directory.server:apacheds-installers:2.0.0-M9-SNAPSHOT @ F:\hudson\hudson-slave\workspace\dir-apacheds-jdk16-win\trunk\installers\pom.xml]
[JENKINS] Archiving disabled
[JENKINS] Archiving disabled
[JENKINS] Archiving disabled
[JENKINS] Archiving disabled
[JENKINS] Archiving disabled
[JENKINS] Archiving disabled
[JENKINS] Archiving disabled
[JENKINS] Archiving disabled
[JENKINS] Archiving disabled
[JENKINS] Archiving disabled
[JENKINS] Archiving disabled
[JENKINS] Archiving disabled
[JENKINS] Archiving disabled
[JENKINS] Archiving disabled
[JENKINS] Archiving disabled
[JENKINS] Archiving disabled
[JENKINS] Archiving disabled
[JENKINS] Archiving disabled
[JENKINS] Archiving disabled
[JENKINS] Archiving disabled
[JENKINS] Archiving disabled
[JENKINS] Archiving disabled
[JENKINS] Archiving disabled
[JENKINS] Archiving disabled
[JENKINS] Archiving disabled
[JENKINS] Archiving disabled
[JENKINS] Archiving disabled
[JENKINS] Archiving disabled
[JENKINS] Archiving disabled
[JENKINS] Archiving disabled
[JENKINS] Archiving disabled
[JENKINS] Archiving disabled
[JENKINS] Archiving disabled
[JENKINS] Archiving disabled
[JENKINS] Archiving disabled
[JENKINS] Archiving disabled
[JENKINS] Archiving disabled
[JENKINS] Archiving disabled
[JENKINS] Archiving disabled
[JENKINS] Archiving disabled
[JENKINS] Archiving disabled
[JENKINS] Archiving disabled
[JENKINS] Archiving disabled
[JENKINS] Archiving disabled
[JENKINS] Archiving disabled
[JENKINS] Archiving disabled
[JENKINS] Archiving disabled
[JENKINS] Archiving disabled
[JENKINS] Archiving disabled
[JENKINS] Archiving disabled
[JENKINS] Archiving disabled
[JENKINS] Archiving disabled
[JENKINS] Archiving disabled
[JENKINS] Archiving disabled
[JENKINS] Archiving disabled
Waiting for Jenkins to finish collecting data
mavenExecutionResult exceptions not empty
message : Failed to execute goal org.apache.maven.plugins:maven-surefire-plugin:2.12.2:test
(default-test) on project apacheds-server-integ: Failure or timeout
cause : Failure or timeout
Stack trace : 
org.apache.maven.lifecycle.LifecycleExecutionException: Failed to execute goal org.apache.maven.plugins:maven-surefire-plugin:2.12.2:test
(default-test) on project apacheds-server-integ: Failure or timeout
	at org.apache.maven.lifecycle.internal.MojoExecutor.execute(MojoExecutor.java:217)
	at org.apache.maven.lifecycle.internal.MojoExecutor.execute(MojoExecutor.java:153)
	at org.apache.maven.lifecycle.internal.MojoExecutor.execute(MojoExecutor.java:145)
	at org.apache.maven.lifecycle.internal.LifecycleModuleBuilder.buildProject(LifecycleModuleBuilder.java:84)
	at org.apache.maven.lifecycle.internal.LifecycleModuleBuilder.buildProject(LifecycleModuleBuilder.java:59)
	at org.apache.maven.lifecycle.internal.LifecycleStarter.singleThreadedBuild(LifecycleStarter.java:183)
	at org.apache.maven.lifecycle.internal.LifecycleStarter.execute(LifecycleStarter.java:161)
	at org.apache.maven.DefaultMaven.doExecute(DefaultMaven.java:319)
	at org.apache.maven.DefaultMaven.execute(DefaultMaven.java:156)
	at org.jvnet.hudson.maven3.launcher.Maven3Launcher.main(Maven3Launcher.java:79)
	at sun.reflect.NativeMethodAccessorImpl.invoke0(Native Method)
	at sun.reflect.NativeMethodAccessorImpl.invoke(NativeMethodAccessorImpl.java:39)
	at sun.reflect.DelegatingMethodAccessorImpl.invoke(DelegatingMethodAccessorImpl.java:25)
	at java.lang.reflect.Method.invoke(Method.java:597)
	at org.codehaus.plexus.classworlds.launcher.Launcher.launchStandard(Launcher.java:329)
	at org.codehaus.plexus.classworlds.launcher.Launcher.launch(Launcher.java:239)
	at org.jvnet.hudson.maven3.agent.Maven3Main.launch(Maven3Main.java:158)
	at hudson.maven.Maven3Builder.call(Maven3Builder.java:98)
	at hudson.maven.Maven3Builder.call(Maven3Builder.java:64)
	at hudson.remoting.UserRequest.perform(UserRequest.java:118)
	at hudson.remoting.UserRequest.perform(UserRequest.java:48)
	at hudson.remoting.Request$2.run(Request.java:326)
	at hudson.remoting.InterceptingExecutorService$1.call(InterceptingExecutorService.java:72)
	at java.util.concurrent.FutureTask$Sync.innerRun(FutureTask.java:303)
	at java.util.concurrent.FutureTask.run(FutureTask.java:138)
	at java.util.concurrent.ThreadPoolExecutor$Worker.runTask(ThreadPoolExecutor.java:886)
	at java.util.concurrent.ThreadPoolExecutor$Worker.run(ThreadPoolExecutor.java:908)
	at java.lang.Thread.run(Thread.java:662)
Caused by: org.apache.maven.plugin.MojoExecutionException: Failure or timeout
	at org.apache.maven.plugin.surefire.SurefirePlugin.assertNoFailureOrTimeout(SurefirePlugin.java:177)
	at org.apache.maven.plugin.surefire.SurefirePlugin.handleSummary(SurefirePlugin.java:158)
	at org.apache.maven.plugin.surefire.AbstractSurefireMojo.executeAfterPreconditionsChecked(AbstractSurefireMojo.java:626)
	at org.apache.maven.plugin.surefire.AbstractSurefireMojo.execute(AbstractSurefireMojo.java:587)
	at org.apache.maven.plugin.DefaultBuildPluginManager.executeMojo(DefaultBuildPluginManager.java:107)
	at org.apache.maven.lifecycle.internal.MojoExecutor.execute(MojoExecutor.java:209)
	... 27 more
Sending e-mails to: notifications@directory.apache.org
channel stopped
Process leaked file descriptors. See http://wiki.jenkins-ci.org/display/JENKINS/Spawning+processes+from+build
for more information

Mime
View raw message