directory-notifications mailing list archives

Site index · List index
Message view « Date » · « Thread »
Top « Date » · « Thread »
From Apache Jenkins Server <jenk...@builds.apache.org>
Subject Build failed in Jenkins: dir-studio-maven-plugin-jdk15-deploy-site #709
Date Thu, 09 Aug 2012 03:05:47 GMT
See <https://builds.apache.org/job/dir-studio-maven-plugin-jdk15-deploy-site/709/>

------------------------------------------
Started by timer
Building remotely on solaris1 in workspace <https://builds.apache.org/job/dir-studio-maven-plugin-jdk15-deploy-site/ws/>
Updating http://svn.apache.org/repos/asf/directory/buildtools/studio-plugin/trunk
At revision 1371028
no change for http://svn.apache.org/repos/asf/directory/buildtools/studio-plugin/trunk since
the previous build
Parsing POMs
[trunk] $ /home/hudson/tools/java/latest1.5/bin/java -cp /export/home/hudson/hudson-slave/maven3-agent.jar:/home/hudson/tools/maven/latest3/boot/plexus-classworlds-2.4.jar
org.jvnet.hudson.maven3.agent.Maven3Main /home/hudson/tools/maven/latest3 /zonestorage/hudson_solaris/home/hudson/hudson-slave/slave.jar
/export/home/hudson/hudson-slave/maven3-interceptor.jar 44145
<===[JENKINS REMOTING CAPACITY]===>channel started
   log4j:WARN No appenders could be found for logger (org.apache.commons.beanutils.converters.BooleanConverter).
log4j:WARN Please initialize the log4j system properly.
Executing Maven:  -B -f <https://builds.apache.org/job/dir-studio-maven-plugin-jdk15-deploy-site/ws/trunk/pom.xml>
-Dmaven.repo.local=/export/home/hudson/hudson-slave/maven-repositories/1 clean deploy site
[INFO] Scanning for projects...
Projects to build: [MavenProject: org.apache.directory.studio:studio-maven-plugin:1.0.6-SNAPSHOT
@ <https://builds.apache.org/job/dir-studio-maven-plugin-jdk15-deploy-site/ws/trunk/pom.xml]>
projectStarted org.apache.directory.studio:studio-maven-plugin:1.0.6-SNAPSHOT
[INFO]                                                                         
[INFO] ------------------------------------------------------------------------
[INFO] Building Apache Directory Studio Plugin 1.0.6-SNAPSHOT
[INFO] ------------------------------------------------------------------------
mojoStarted org.apache.maven.plugins:maven-clean-plugin:2.4.1(default-clean)
[INFO] 
[INFO] --- maven-clean-plugin:2.4.1:clean (default-clean) @ studio-maven-plugin ---[INFO]
Deleting <https://builds.apache.org/job/dir-studio-maven-plugin-jdk15-deploy-site/ws/trunk/target>

mojoSucceeded org.apache.maven.plugins:maven-clean-plugin:2.4.1(default-clean)
mojoStarted org.apache.maven.plugins:maven-plugin-plugin:2.9(default-descriptor)
[INFO] 
[INFO] --- maven-plugin-plugin:2.9:descriptor (default-descriptor) @ studio-maven-plugin ---
[INFO] Using 'UTF-8' encoding to read mojo metadata.
[INFO] Applying mojo extractor for language: java
[INFO] Mojo extractor for language: java found 6 mojo descriptors.
[INFO] Applying mojo extractor for language: bsh
[INFO] Mojo extractor for language: bsh found 0 mojo descriptors.
mojoSucceeded org.apache.maven.plugins:maven-plugin-plugin:2.9(default-descriptor)
mojoStarted org.apache.maven.plugins:maven-remote-resources-plugin:1.2.1(default)
[INFO] 
[INFO] --- maven-remote-resources-plugin:1.2.1:process (default) @ studio-maven-plugin ---
mojoSucceeded org.apache.maven.plugins:maven-remote-resources-plugin:1.2.1(default)
mojoStarted org.apache.maven.plugins:maven-resources-plugin:2.5(default-resources)
[INFO] 
[INFO] --- maven-resources-plugin:2.5:resources (default-resources) @ studio-maven-plugin
---
[debug] execute contextualize
[INFO] Using 'UTF-8' encoding to copy filtered resources.
[INFO] skip non existing resourceDirectory <https://builds.apache.org/job/dir-studio-maven-plugin-jdk15-deploy-site/ws/trunk/src/main/resources>
[INFO] Copying 3 resources
mojoSucceeded org.apache.maven.plugins:maven-resources-plugin:2.5(default-resources)
mojoStarted org.apache.maven.plugins:maven-compiler-plugin:2.3.2(default-compile)
[INFO] 
[INFO] --- maven-compiler-plugin:2.3.2:compile (default-compile) @ studio-maven-plugin ---
[INFO] Compiling 8 source files to <https://builds.apache.org/job/dir-studio-maven-plugin-jdk15-deploy-site/ws/trunk/target/classes>
mojoSucceeded org.apache.maven.plugins:maven-compiler-plugin:2.3.2(default-compile)
mojoStarted org.apache.maven.plugins:maven-resources-plugin:2.5(default-testResources)
[debug] execute contextualize
[INFO] 
[INFO] Using 'UTF-8' encoding to copy filtered resources.
[INFO] --- maven-resources-plugin:2.5:testResources (default-testResources) @ studio-maven-plugin
---
[INFO] Copying 16 resources
[INFO] Copying 3 resources
mojoSucceeded org.apache.maven.plugins:maven-resources-plugin:2.5(default-testResources)
mojoStarted org.apache.maven.plugins:maven-compiler-plugin:2.3.2(default-testCompile)
[INFO] 
[INFO] Compiling 6 source files to <https://builds.apache.org/job/dir-studio-maven-plugin-jdk15-deploy-site/ws/trunk/target/test-classes>
[INFO] --- maven-compiler-plugin:2.3.2:testCompile (default-testCompile) @ studio-maven-plugin
---
mojoSucceeded org.apache.maven.plugins:maven-compiler-plugin:2.3.2(default-testCompile)
mojoStarted org.apache.maven.plugins:maven-surefire-plugin:2.10(default-test)
[INFO] 
[INFO] --- maven-surefire-plugin:2.10:test (default-test) @ studio-maven-plugin ---
[INFO] Surefire report directory: <https://builds.apache.org/job/dir-studio-maven-plugin-jdk15-deploy-site/ws/trunk/target/surefire-reports>

-------------------------------------------------------
 T E S T S
-------------------------------------------------------

Results :

Tests run: 0, Failures: 0, Errors: 0, Skipped: 0
mojoSucceeded org.apache.maven.plugins:maven-surefire-plugin:2.10(default-test)

[JENKINS] Recording test results
mojoStarted org.apache.maven.plugins:maven-jar-plugin:2.3.2(default-jar)
[INFO] 
[INFO] --- maven-jar-plugin:2.3.2:jar (default-jar) @ studio-maven-plugin ---
[INFO] Building jar: <https://builds.apache.org/job/dir-studio-maven-plugin-jdk15-deploy-site/ws/trunk/target/studio-maven-plugin-1.0.6-SNAPSHOT.jar>
mojoSucceeded org.apache.maven.plugins:maven-jar-plugin:2.3.2(default-jar)
mojoStarted org.apache.maven.plugins:maven-plugin-plugin:2.9(default-addPluginArtifactMetadata)
[INFO] 
[INFO] --- maven-plugin-plugin:2.9:addPluginArtifactMetadata (default-addPluginArtifactMetadata)
@ studio-maven-plugin ---
mojoSucceeded org.apache.maven.plugins:maven-plugin-plugin:2.9(default-addPluginArtifactMetadata)
Aug 9, 2012 3:04:59 AM hudson.maven.ExecutedMojo <init>
WARNING: Failed to getClass for org.apache.maven.plugin.source.SourceJarMojo
mojoStarted org.apache.maven.plugins:maven-source-plugin:2.1.2(attach-sources)
[INFO] 
[INFO] --- maven-source-plugin:2.1.2:jar (attach-sources) @ studio-maven-plugin ---
[INFO] META-INF already added, skipping
[INFO] META-INF/NOTICE already added, skipping
[INFO] META-INF/LICENSE already added, skipping
[INFO] META-INF/DEPENDENCIES already added, skipping
[INFO] Building jar: <https://builds.apache.org/job/dir-studio-maven-plugin-jdk15-deploy-site/ws/trunk/target/studio-maven-plugin-1.0.6-SNAPSHOT-sources.jar>
[INFO] META-INF already added, skipping
[INFO] META-INF/NOTICE already added, skipping
[INFO] META-INF/LICENSE already added, skipping
[INFO] META-INF/DEPENDENCIES already added, skipping
mojoSucceeded org.apache.maven.plugins:maven-source-plugin:2.1.2(attach-sources)
mojoStarted org.apache.geronimo.genesis.plugins:tools-maven-plugin:1.4(verify-legal-files)
[INFO] 
[INFO] --- tools-maven-plugin:1.4:verify-legal-files (verify-legal-files) @ studio-maven-plugin
---
[INFO] Checking legal files in: studio-maven-plugin-1.0.6-SNAPSHOT.jar
[INFO] Checking legal files in: studio-maven-plugin-1.0.6-SNAPSHOT-sources.jar
mojoSucceeded org.apache.geronimo.genesis.plugins:tools-maven-plugin:1.4(verify-legal-files)
mojoStarted org.apache.maven.plugins:maven-install-plugin:2.3.1(default-install)
[INFO] 
[INFO] --- maven-install-plugin:2.3.1:install (default-install) @ studio-maven-plugin ---
[INFO] Installing <https://builds.apache.org/job/dir-studio-maven-plugin-jdk15-deploy-site/ws/trunk/target/studio-maven-plugin-1.0.6-SNAPSHOT.jar>
to /export/home/hudson/hudson-slave/maven-repositories/1/org/apache/directory/studio/studio-maven-plugin/1.0.6-SNAPSHOT/studio-maven-plugin-1.0.6-SNAPSHOT.jar
[INFO] Installing <https://builds.apache.org/job/dir-studio-maven-plugin-jdk15-deploy-site/ws/trunk/pom.xml>
to /export/home/hudson/hudson-slave/maven-repositories/1/org/apache/directory/studio/studio-maven-plugin/1.0.6-SNAPSHOT/studio-maven-plugin-1.0.6-SNAPSHOT.pom
[INFO] Installing <https://builds.apache.org/job/dir-studio-maven-plugin-jdk15-deploy-site/ws/trunk/target/studio-maven-plugin-1.0.6-SNAPSHOT-sources.jar>
to /export/home/hudson/hudson-slave/maven-repositories/1/org/apache/directory/studio/studio-maven-plugin/1.0.6-SNAPSHOT/studio-maven-plugin-1.0.6-SNAPSHOT-sources.jar
mojoSucceeded org.apache.maven.plugins:maven-install-plugin:2.3.1(default-install)
mojoStarted org.apache.maven.plugins:maven-deploy-plugin:2.7(default-deploy)
[INFO] 
Downloading: https://repository.apache.org/content/repositories/snapshots/org/apache/directory/studio/studio-maven-plugin/1.0.6-SNAPSHOT/maven-metadata.xml
[INFO] --- maven-deploy-plugin:2.7:deploy (default-deploy) @ studio-maven-plugin ---
Downloaded: https://repository.apache.org/content/repositories/snapshots/org/apache/directory/studio/studio-maven-plugin/1.0.6-SNAPSHOT/maven-metadata.xml
(1018 B at 0.4 KB/sec)
Uploading: https://repository.apache.org/content/repositories/snapshots/org/apache/directory/studio/studio-maven-plugin/1.0.6-SNAPSHOT/studio-maven-plugin-1.0.6-20120809.030515-200.jar
Uploaded: https://repository.apache.org/content/repositories/snapshots/org/apache/directory/studio/studio-maven-plugin/1.0.6-SNAPSHOT/studio-maven-plugin-1.0.6-20120809.030515-200.jar
(36 KB at 14.1 KB/sec)
Uploading: https://repository.apache.org/content/repositories/snapshots/org/apache/directory/studio/studio-maven-plugin/1.0.6-SNAPSHOT/studio-maven-plugin-1.0.6-20120809.030515-200.pom
Uploaded: https://repository.apache.org/content/repositories/snapshots/org/apache/directory/studio/studio-maven-plugin/1.0.6-SNAPSHOT/studio-maven-plugin-1.0.6-20120809.030515-200.pom
(10 KB at 16.6 KB/sec)
Downloading: https://repository.apache.org/content/repositories/snapshots/org/apache/directory/studio/studio-maven-plugin/maven-metadata.xml
Downloaded: https://repository.apache.org/content/repositories/snapshots/org/apache/directory/studio/studio-maven-plugin/maven-metadata.xml
(366 B at 0.4 KB/sec)
Downloading: https://repository.apache.org/content/repositories/snapshots/org/apache/directory/studio/maven-metadata.xml
Downloaded: https://repository.apache.org/content/repositories/snapshots/org/apache/directory/studio/maven-metadata.xml
(243 B at 0.2 KB/sec)
Uploading: https://repository.apache.org/content/repositories/snapshots/org/apache/directory/studio/studio-maven-plugin/1.0.6-SNAPSHOT/maven-metadata.xml
Uploaded: https://repository.apache.org/content/repositories/snapshots/org/apache/directory/studio/studio-maven-plugin/1.0.6-SNAPSHOT/maven-metadata.xml
(1018 B at 1.0 KB/sec)
Uploading: https://repository.apache.org/content/repositories/snapshots/org/apache/directory/studio/studio-maven-plugin/maven-metadata.xml
Uploaded: https://repository.apache.org/content/repositories/snapshots/org/apache/directory/studio/studio-maven-plugin/maven-metadata.xml
(366 B at 0.3 KB/sec)
Uploading: https://repository.apache.org/content/repositories/snapshots/org/apache/directory/studio/maven-metadata.xml
Uploaded: https://repository.apache.org/content/repositories/snapshots/org/apache/directory/studio/maven-metadata.xml
(243 B at 0.1 KB/sec)
Uploading: https://repository.apache.org/content/repositories/snapshots/org/apache/directory/studio/studio-maven-plugin/1.0.6-SNAPSHOT/studio-maven-plugin-1.0.6-20120809.030515-200-sources.jar
Uploaded: https://repository.apache.org/content/repositories/snapshots/org/apache/directory/studio/studio-maven-plugin/1.0.6-SNAPSHOT/studio-maven-plugin-1.0.6-20120809.030515-200-sources.jar
(26 KB at 25.9 KB/sec)
Uploading: https://repository.apache.org/content/repositories/snapshots/org/apache/directory/studio/studio-maven-plugin/1.0.6-SNAPSHOT/maven-metadata.xml
Uploaded: https://repository.apache.org/content/repositories/snapshots/org/apache/directory/studio/studio-maven-plugin/1.0.6-SNAPSHOT/maven-metadata.xml
(1018 B at 1.7 KB/sec)
mojoSucceeded org.apache.maven.plugins:maven-deploy-plugin:2.7(default-deploy)
mojoStarted org.apache.maven.plugins:maven-docck-plugin:1.0(default)
[INFO] 
[INFO] --- maven-docck-plugin:1.0:check (default) @ studio-maven-plugin ---
[INFO] Checking project: Apache Directory Studio Plugin
[INFO] Using 2 extractors.
[INFO] Applying extractor for language: java
[INFO] Extractor for language: java found 6 mojo descriptors.
[INFO] Applying extractor for language: bsh
[INFO] Extractor for language: bsh found 0 mojo descriptors.
[ERROR] The following documentation problems were found:

o Apache Directory Studio Plugin (1 error, 0 warnings)
  [ERROR] Cannot reach Issue Management with URL: 'http://issues.apache.org/jira/browse/DIRSTUDIO'.

mojoFailed org.apache.maven.plugins:maven-docck-plugin:1.0(default)
projectFailed org.apache.directory.studio:studio-maven-plugin:1.0.6-SNAPSHOT
sessionEnded
[INFO] ------------------------------------------------------------------------
[INFO] BUILD FAILURE
[INFO] ------------------------------------------------------------------------
[INFO] Total time: 3:23.966s
[INFO] Finished at: Thu Aug 09 03:05:36 GMT+00:00 2012
[INFO] Final Memory: 23M/221M
[INFO] ------------------------------------------------------------------------
Projects to build: [MavenProject: org.apache.directory.studio:studio-maven-plugin:1.0.6-SNAPSHOT
@ <https://builds.apache.org/job/dir-studio-maven-plugin-jdk15-deploy-site/ws/trunk/pom.xml]>
[JENKINS] Archiving <https://builds.apache.org/job/dir-studio-maven-plugin-jdk15-deploy-site/ws/trunk/pom.xml>
to /home/hudson/hudson/jobs/dir-studio-maven-plugin-jdk15-deploy-site/modules/org.apache.directory.studio$studio-maven-plugin/builds/2012-08-09_03-00-43/archive/org.apache.directory.studio/studio-maven-plugin/1.0.6-SNAPSHOT/studio-maven-plugin-1.0.6-SNAPSHOT.pom
[JENKINS] Archiving <https://builds.apache.org/job/dir-studio-maven-plugin-jdk15-deploy-site/ws/trunk/target/studio-maven-plugin-1.0.6-SNAPSHOT.jar>
to /home/hudson/hudson/jobs/dir-studio-maven-plugin-jdk15-deploy-site/modules/org.apache.directory.studio$studio-maven-plugin/builds/2012-08-09_03-00-43/archive/org.apache.directory.studio/studio-maven-plugin/1.0.6-20120809.030515-200/studio-maven-plugin-1.0.6-20120809.030515-200.jar
[JENKINS] Archiving <https://builds.apache.org/job/dir-studio-maven-plugin-jdk15-deploy-site/ws/trunk/target/studio-maven-plugin-1.0.6-SNAPSHOT-sources.jar>
to /home/hudson/hudson/jobs/dir-studio-maven-plugin-jdk15-deploy-site/modules/org.apache.directory.studio$studio-maven-plugin/builds/2012-08-09_03-00-43/archive/org.apache.directory.studio/studio-maven-plugin/1.0.6-20120809.030515-200/studio-maven-plugin-1.0.6-20120809.030515-200-sources.jar
Waiting for Jenkins to finish collecting data
mavenExecutionResult exceptions not empty
message : Failed to execute goal org.apache.maven.plugins:maven-docck-plugin:1.0:check (default)
on project studio-maven-plugin: Documentation problems were found. Please see the console
output above for more information.
cause : Documentation problems were found. Please see the console output above for more information.
Stack trace : 
org.apache.maven.lifecycle.LifecycleExecutionException: Failed to execute goal org.apache.maven.plugins:maven-docck-plugin:1.0:check
(default) on project studio-maven-plugin: Documentation problems were found. Please see the
console output above for more information.
	at org.apache.maven.lifecycle.internal.MojoExecutor.execute(MojoExecutor.java:213)
	at org.apache.maven.lifecycle.internal.MojoExecutor.execute(MojoExecutor.java:153)
	at org.apache.maven.lifecycle.internal.MojoExecutor.execute(MojoExecutor.java:145)
	at org.apache.maven.lifecycle.internal.LifecycleModuleBuilder.buildProject(LifecycleModuleBuilder.java:84)
	at org.apache.maven.lifecycle.internal.LifecycleModuleBuilder.buildProject(LifecycleModuleBuilder.java:59)
	at org.apache.maven.lifecycle.internal.LifecycleStarter.singleThreadedBuild(LifecycleStarter.java:183)
	at org.apache.maven.lifecycle.internal.LifecycleStarter.execute(LifecycleStarter.java:161)
	at org.apache.maven.DefaultMaven.doExecute(DefaultMaven.java:319)
	at org.apache.maven.DefaultMaven.execute(DefaultMaven.java:156)
	at org.jvnet.hudson.maven3.launcher.Maven3Launcher.main(Maven3Launcher.java:79)
	at sun.reflect.NativeMethodAccessorImpl.invoke0(Native Method)
	at sun.reflect.NativeMethodAccessorImpl.invoke(NativeMethodAccessorImpl.java:39)
	at sun.reflect.DelegatingMethodAccessorImpl.invoke(DelegatingMethodAccessorImpl.java:25)
	at java.lang.reflect.Method.invoke(Method.java:592)
	at org.codehaus.plexus.classworlds.launcher.Launcher.launchStandard(Launcher.java:329)
	at org.codehaus.plexus.classworlds.launcher.Launcher.launch(Launcher.java:239)
	at org.jvnet.hudson.maven3.agent.Maven3Main.launch(Maven3Main.java:158)
	at hudson.maven.Maven3Builder.call(Maven3Builder.java:98)
	at hudson.maven.Maven3Builder.call(Maven3Builder.java:64)
	at hudson.remoting.UserRequest.perform(UserRequest.java:118)
	at hudson.remoting.UserRequest.perform(UserRequest.java:48)
	at hudson.remoting.Request$2.run(Request.java:326)
	at hudson.remoting.InterceptingExecutorService$1.call(InterceptingExecutorService.java:72)
	at java.util.concurrent.FutureTask$Sync.innerRun(FutureTask.java:269)
	at java.util.concurrent.FutureTask.run(FutureTask.java:123)
	at java.util.concurrent.ThreadPoolExecutor$Worker.runTask(ThreadPoolExecutor.java:651)
	at java.util.concurrent.ThreadPoolExecutor$Worker.run(ThreadPoolExecutor.java:676)
	at java.lang.Thread.run(Thread.java:595)
Caused by: org.apache.maven.plugin.MojoFailureException: Documentation problems were found.
Please see the console output above for more information.
	at org.apache.maven.plugin.docck.AbstractCheckDocumentationMojo.execute(AbstractCheckDocumentationMojo.java:200)
	at org.apache.maven.plugin.DefaultBuildPluginManager.executeMojo(DefaultBuildPluginManager.java:101)
	at org.apache.maven.lifecycle.internal.MojoExecutor.execute(MojoExecutor.java:209)
	... 27 more
channel stopped

Mime
View raw message