directory-notifications mailing list archives

Site index · List index
Message view « Date » · « Thread »
Top « Date » · « Thread »
From Apache Jenkins Server <jenk...@builds.apache.org>
Subject Build failed in Jenkins: dir-studio-maven-plugin-jdk15-deploy-site #671
Date Sun, 01 Jul 2012 03:03:55 GMT
See <https://builds.apache.org/job/dir-studio-maven-plugin-jdk15-deploy-site/671/>

------------------------------------------
[...truncated 58 lines...]
A         src/main/java
A         src/main/java/org
A         src/main/java/org/apache
A         src/main/java/org/apache/directory
A         src/main/java/org/apache/directory/studio
A         src/main/java/org/apache/directory/studio/maven
A         src/main/java/org/apache/directory/studio/maven/plugins
AU        src/main/java/org/apache/directory/studio/maven/plugins/StudioCleanMojo.java
AU        src/main/java/org/apache/directory/studio/maven/plugins/AbstractStudioMojo.java
AU        src/main/java/org/apache/directory/studio/maven/plugins/StudioEclipseMojo.java
AU        src/main/java/org/apache/directory/studio/maven/plugins/StudioPrepareJarPackageMojo.java
AU        src/main/java/org/apache/directory/studio/maven/plugins/StudioUnpackPrefixedMojo.java
AU        src/main/java/org/apache/directory/studio/maven/plugins/StudioCopyEclipseDependencyMojo.java
AU        src/main/java/org/apache/directory/studio/maven/plugins/ArtifactItem.java
AU        src/main/java/org/apache/directory/studio/maven/plugins/StudioReplaceFileInJarMojo.java
A         src/site
AU        src/site/site.xml
A         src/site/apt
A         src/site/apt/usage.apt
A         src/site/apt/index.apt
A         src/site/apt/examples
A         src/site/apt/examples/unpack-with-artifactid-prefix.apt
A         src/site/apt/examples/prepare-jar-package.apt
A         src/site/apt/examples/copy-eclipse-artifact.apt
A         src/site/apt/examples/replace-file-in-eclipse-artifact.apt
A         src/site/resources
A         src/site/resources/images
AU        src/site/resources/images/studio-icon_128x128.png
A         src/site/fml
A         src/site/fml/faq.fml
A         src/checkstyle
A         src/checkstyle/suppressions.xml
AU        pom.xml
 U        .
At revision 1355842
no change for http://svn.apache.org/repos/asf/directory/buildtools/studio-plugin/trunk since
the previous build
Parsing POMs
[trunk] $ /home/hudson/tools/java/latest1.5/bin/java -cp /home/jenkins/jenkins-slave/maven3-agent.jar:/home/hudson/tools/maven/latest3/boot/plexus-classworlds-2.4.jar
org.jvnet.hudson.maven3.agent.Maven3Main /home/hudson/tools/maven/latest3 /home/jenkins/jenkins-slave/slave.jar
/home/jenkins/jenkins-slave/maven3-interceptor.jar 56305
<===[JENKINS REMOTING CAPACITY]===>channel started
   log4j:WARN No appenders could be found for logger (org.apache.commons.beanutils.converters.BooleanConverter).
log4j:WARN Please initialize the log4j system properly.
Executing Maven:  -B -f <https://builds.apache.org/job/dir-studio-maven-plugin-jdk15-deploy-site/ws/trunk/pom.xml>
-Dmaven.repo.local=/home/jenkins/jenkins-slave/maven-repositories/1 clean deploy site
[INFO] Scanning for projects...
Projects to build: [MavenProject: org.apache.directory.studio:studio-maven-plugin:1.0.6-SNAPSHOT
@ <https://builds.apache.org/job/dir-studio-maven-plugin-jdk15-deploy-site/ws/trunk/pom.xml]>
projectStarted org.apache.directory.studio:studio-maven-plugin:1.0.6-SNAPSHOT
[INFO]                                                                         
[INFO] ------------------------------------------------------------------------
[INFO] Building Apache Directory Studio Plugin 1.0.6-SNAPSHOT
[INFO] ------------------------------------------------------------------------
mojoStarted org.apache.maven.plugins:maven-clean-plugin:2.4.1(default-clean)
[INFO] 
[INFO] --- maven-clean-plugin:2.4.1:clean (default-clean) @ studio-maven-plugin ---
mojoSucceeded org.apache.maven.plugins:maven-clean-plugin:2.4.1(default-clean)
mojoStarted org.apache.maven.plugins:maven-plugin-plugin:2.9(default-descriptor)
[INFO] 
[INFO] --- maven-plugin-plugin:2.9:descriptor (default-descriptor) @ studio-maven-plugin ---
[INFO] Using 'UTF-8' encoding to read mojo metadata.
[INFO] Applying mojo extractor for language: java
[INFO] Mojo extractor for language: java found 6 mojo descriptors.
[INFO] Applying mojo extractor for language: bsh
[INFO] Mojo extractor for language: bsh found 0 mojo descriptors.
mojoSucceeded org.apache.maven.plugins:maven-plugin-plugin:2.9(default-descriptor)
mojoStarted org.apache.maven.plugins:maven-remote-resources-plugin:1.2.1(default)
[INFO] 
[INFO] --- maven-remote-resources-plugin:1.2.1:process (default) @ studio-maven-plugin ---
mojoSucceeded org.apache.maven.plugins:maven-remote-resources-plugin:1.2.1(default)
mojoStarted org.apache.maven.plugins:maven-resources-plugin:2.5(default-resources)
[INFO] 
[INFO] --- maven-resources-plugin:2.5:resources (default-resources) @ studio-maven-plugin
---
[debug] execute contextualize
[INFO] Using 'UTF-8' encoding to copy filtered resources.
[INFO] skip non existing resourceDirectory <https://builds.apache.org/job/dir-studio-maven-plugin-jdk15-deploy-site/ws/trunk/src/main/resources>
[INFO] Copying 3 resources
mojoSucceeded org.apache.maven.plugins:maven-resources-plugin:2.5(default-resources)
mojoStarted org.apache.maven.plugins:maven-compiler-plugin:2.3.2(default-compile)
[INFO] 
[INFO] --- maven-compiler-plugin:2.3.2:compile (default-compile) @ studio-maven-plugin ---
[INFO] Compiling 8 source files to <https://builds.apache.org/job/dir-studio-maven-plugin-jdk15-deploy-site/ws/trunk/target/classes>
mojoSucceeded org.apache.maven.plugins:maven-compiler-plugin:2.3.2(default-compile)
mojoStarted org.apache.maven.plugins:maven-resources-plugin:2.5(default-testResources)[debug]
execute contextualize
[INFO] Using 'UTF-8' encoding to copy filtered resources.

[INFO] 
[INFO] --- maven-resources-plugin:2.5:testResources (default-testResources) @ studio-maven-plugin
---
[INFO] Copying 16 resources
[INFO] Copying 3 resources
mojoSucceeded org.apache.maven.plugins:maven-resources-plugin:2.5(default-testResources)
mojoStarted org.apache.maven.plugins:maven-compiler-plugin:2.3.2(default-testCompile)[INFO]
Compiling 6 source files to <https://builds.apache.org/job/dir-studio-maven-plugin-jdk15-deploy-site/ws/trunk/target/test-classes>

[INFO] 
[INFO] --- maven-compiler-plugin:2.3.2:testCompile (default-testCompile) @ studio-maven-plugin
---
mojoSucceeded org.apache.maven.plugins:maven-compiler-plugin:2.3.2(default-testCompile)
mojoStarted org.apache.maven.plugins:maven-surefire-plugin:2.10(default-test)
[INFO] 
[INFO] --- maven-surefire-plugin:2.10:test (default-test) @ studio-maven-plugin ---
[INFO] Surefire report directory: <https://builds.apache.org/job/dir-studio-maven-plugin-jdk15-deploy-site/ws/trunk/target/surefire-reports>

-------------------------------------------------------
 T E S T S
-------------------------------------------------------

Results :

mojoSucceeded org.apache.maven.plugins:maven-surefire-plugin:2.10(default-test)Tests run:
0, Failures: 0, Errors: 0, Skipped: 0


[JENKINS] Recording test results
mojoStarted org.apache.maven.plugins:maven-jar-plugin:2.3.2(default-jar)
[INFO] 
[INFO] --- maven-jar-plugin:2.3.2:jar (default-jar) @ studio-maven-plugin ---
[INFO] Building jar: <https://builds.apache.org/job/dir-studio-maven-plugin-jdk15-deploy-site/ws/trunk/target/studio-maven-plugin-1.0.6-SNAPSHOT.jar>
mojoSucceeded org.apache.maven.plugins:maven-jar-plugin:2.3.2(default-jar)
mojoStarted org.apache.maven.plugins:maven-plugin-plugin:2.9(default-addPluginArtifactMetadata)
[INFO] 
[INFO] --- maven-plugin-plugin:2.9:addPluginArtifactMetadata (default-addPluginArtifactMetadata)
@ studio-maven-plugin ---
mojoSucceeded org.apache.maven.plugins:maven-plugin-plugin:2.9(default-addPluginArtifactMetadata)
Jul 1, 2012 3:03:45 AM hudson.maven.ExecutedMojo <init>
WARNING: Failed to getClass for org.apache.maven.plugin.source.SourceJarMojo
mojoStarted org.apache.maven.plugins:maven-source-plugin:2.1.2(attach-sources)
[INFO] 
[INFO] --- maven-source-plugin:2.1.2:jar (attach-sources) @ studio-maven-plugin ---
[INFO] META-INF already added, skipping
[INFO] META-INF/NOTICE already added, skipping
[INFO] META-INF/DEPENDENCIES already added, skipping
[INFO] META-INF/LICENSE already added, skipping
[INFO] Building jar: <https://builds.apache.org/job/dir-studio-maven-plugin-jdk15-deploy-site/ws/trunk/target/studio-maven-plugin-1.0.6-SNAPSHOT-sources.jar>
[INFO] META-INF already added, skipping
[INFO] META-INF/NOTICE already added, skipping
[INFO] META-INF/DEPENDENCIES already added, skipping
[INFO] META-INF/LICENSE already added, skipping
mojoSucceeded org.apache.maven.plugins:maven-source-plugin:2.1.2(attach-sources)
mojoStarted org.apache.geronimo.genesis.plugins:tools-maven-plugin:1.4(verify-legal-files)
[INFO] 
[INFO] --- tools-maven-plugin:1.4:verify-legal-files (verify-legal-files) @ studio-maven-plugin
---
[INFO] Checking legal files in: studio-maven-plugin-1.0.6-SNAPSHOT.jar
[INFO] Checking legal files in: studio-maven-plugin-1.0.6-SNAPSHOT-sources.jar
mojoSucceeded org.apache.geronimo.genesis.plugins:tools-maven-plugin:1.4(verify-legal-files)
mojoStarted org.apache.maven.plugins:maven-install-plugin:2.3.1(default-install)
[INFO] 
[INFO] --- maven-install-plugin:2.3.1:install (default-install) @ studio-maven-plugin ---
[INFO] Installing <https://builds.apache.org/job/dir-studio-maven-plugin-jdk15-deploy-site/ws/trunk/target/studio-maven-plugin-1.0.6-SNAPSHOT.jar>
to /home/jenkins/jenkins-slave/maven-repositories/1/org/apache/directory/studio/studio-maven-plugin/1.0.6-SNAPSHOT/studio-maven-plugin-1.0.6-SNAPSHOT.jar
[INFO] Installing <https://builds.apache.org/job/dir-studio-maven-plugin-jdk15-deploy-site/ws/trunk/pom.xml>
to /home/jenkins/jenkins-slave/maven-repositories/1/org/apache/directory/studio/studio-maven-plugin/1.0.6-SNAPSHOT/studio-maven-plugin-1.0.6-SNAPSHOT.pom
[INFO] Installing <https://builds.apache.org/job/dir-studio-maven-plugin-jdk15-deploy-site/ws/trunk/target/studio-maven-plugin-1.0.6-SNAPSHOT-sources.jar>
to /home/jenkins/jenkins-slave/maven-repositories/1/org/apache/directory/studio/studio-maven-plugin/1.0.6-SNAPSHOT/studio-maven-plugin-1.0.6-SNAPSHOT-sources.jar
mojoSucceeded org.apache.maven.plugins:maven-install-plugin:2.3.1(default-install)
mojoStarted org.apache.maven.plugins:maven-deploy-plugin:2.7(default-deploy)
[INFO] 
[INFO] --- maven-deploy-plugin:2.7:deploy (default-deploy) @ studio-maven-plugin ---
Downloading: https://repository.apache.org/content/repositories/snapshots/org/apache/directory/studio/studio-maven-plugin/1.0.6-SNAPSHOT/maven-metadata.xml
[WARNING] Could not transfer metadata org.apache.directory.studio:studio-maven-plugin:1.0.6-SNAPSHOT/maven-metadata.xml
from/to apache.snapshots.https (https://repository.apache.org/content/repositories/snapshots):
Error transferring file: Server returned HTTP response code: 503 for URL: https://repository.apache.org/content/repositories/snapshots/org/apache/directory/studio/studio-maven-plugin/1.0.6-SNAPSHOT/maven-metadata.xml
mojoFailed org.apache.maven.plugins:maven-deploy-plugin:2.7(default-deploy)
projectFailed org.apache.directory.studio:studio-maven-plugin:1.0.6-SNAPSHOT
sessionEnded
[INFO] ------------------------------------------------------------------------
[INFO] BUILD FAILURE
[INFO] ------------------------------------------------------------------------
[INFO] Total time: 52.313s
[INFO] Finished at: Sun Jul 01 03:03:48 UTC 2012
[INFO] Final Memory: 26M/328M
[INFO] ------------------------------------------------------------------------
Projects to build: [MavenProject: org.apache.directory.studio:studio-maven-plugin:1.0.6-SNAPSHOT
@ <https://builds.apache.org/job/dir-studio-maven-plugin-jdk15-deploy-site/ws/trunk/pom.xml]>
[JENKINS] Archiving <https://builds.apache.org/job/dir-studio-maven-plugin-jdk15-deploy-site/ws/trunk/pom.xml>
to /home/hudson/hudson/jobs/dir-studio-maven-plugin-jdk15-deploy-site/modules/org.apache.directory.studio$studio-maven-plugin/builds/2012-07-01_03-02-41/archive/org.apache.directory.studio/studio-maven-plugin/1.0.6-SNAPSHOT/studio-maven-plugin-1.0.6-SNAPSHOT.pom
[JENKINS] Archiving <https://builds.apache.org/job/dir-studio-maven-plugin-jdk15-deploy-site/ws/trunk/target/studio-maven-plugin-1.0.6-SNAPSHOT.jar>
to /home/hudson/hudson/jobs/dir-studio-maven-plugin-jdk15-deploy-site/modules/org.apache.directory.studio$studio-maven-plugin/builds/2012-07-01_03-02-41/archive/org.apache.directory.studio/studio-maven-plugin/1.0.6-SNAPSHOT/studio-maven-plugin-1.0.6-SNAPSHOT.jar
[JENKINS] Archiving <https://builds.apache.org/job/dir-studio-maven-plugin-jdk15-deploy-site/ws/trunk/target/studio-maven-plugin-1.0.6-SNAPSHOT-sources.jar>
to /home/hudson/hudson/jobs/dir-studio-maven-plugin-jdk15-deploy-site/modules/org.apache.directory.studio$studio-maven-plugin/builds/2012-07-01_03-02-41/archive/org.apache.directory.studio/studio-maven-plugin/1.0.6-SNAPSHOT/studio-maven-plugin-1.0.6-SNAPSHOT-sources.jar
Waiting for Jenkins to finish collecting data
mavenExecutionResult exceptions not empty
message : Failed to execute goal org.apache.maven.plugins:maven-deploy-plugin:2.7:deploy (default-deploy)
on project studio-maven-plugin: Failed to retrieve remote metadata org.apache.directory.studio:studio-maven-plugin:1.0.6-SNAPSHOT/maven-metadata.xml:
Could not transfer metadata org.apache.directory.studio:studio-maven-plugin:1.0.6-SNAPSHOT/maven-metadata.xml
from/to apache.snapshots.https (https://repository.apache.org/content/repositories/snapshots):
Error transferring file: Server returned HTTP response code: 503 for URL: https://repository.apache.org/content/repositories/snapshots/org/apache/directory/studio/studio-maven-plugin/1.0.6-SNAPSHOT/maven-metadata.xml
cause : Failed to retrieve remote metadata org.apache.directory.studio:studio-maven-plugin:1.0.6-SNAPSHOT/maven-metadata.xml:
Could not transfer metadata org.apache.directory.studio:studio-maven-plugin:1.0.6-SNAPSHOT/maven-metadata.xml
from/to apache.snapshots.https (https://repository.apache.org/content/repositories/snapshots):
Error transferring file: Server returned HTTP response code: 503 for URL: https://repository.apache.org/content/repositories/snapshots/org/apache/directory/studio/studio-maven-plugin/1.0.6-SNAPSHOT/maven-metadata.xml
Stack trace : 
org.apache.maven.lifecycle.LifecycleExecutionException: Failed to execute goal org.apache.maven.plugins:maven-deploy-plugin:2.7:deploy
(default-deploy) on project studio-maven-plugin: Failed to retrieve remote metadata org.apache.directory.studio:studio-maven-plugin:1.0.6-SNAPSHOT/maven-metadata.xml:
Could not transfer metadata org.apache.directory.studio:studio-maven-plugin:1.0.6-SNAPSHOT/maven-metadata.xml
from/to apache.snapshots.https (https://repository.apache.org/content/repositories/snapshots):
Error transferring file: Server returned HTTP response code: 503 for URL: https://repository.apache.org/content/repositories/snapshots/org/apache/directory/studio/studio-maven-plugin/1.0.6-SNAPSHOT/maven-metadata.xml
	at org.apache.maven.lifecycle.internal.MojoExecutor.execute(MojoExecutor.java:217)
	at org.apache.maven.lifecycle.internal.MojoExecutor.execute(MojoExecutor.java:153)
	at org.apache.maven.lifecycle.internal.MojoExecutor.execute(MojoExecutor.java:145)
	at org.apache.maven.lifecycle.internal.LifecycleModuleBuilder.buildProject(LifecycleModuleBuilder.java:84)
	at org.apache.maven.lifecycle.internal.LifecycleModuleBuilder.buildProject(LifecycleModuleBuilder.java:59)
	at org.apache.maven.lifecycle.internal.LifecycleStarter.singleThreadedBuild(LifecycleStarter.java:183)
	at org.apache.maven.lifecycle.internal.LifecycleStarter.execute(LifecycleStarter.java:161)
	at org.apache.maven.DefaultMaven.doExecute(DefaultMaven.java:319)
	at org.apache.maven.DefaultMaven.execute(DefaultMaven.java:156)
	at org.jvnet.hudson.maven3.launcher.Maven3Launcher.main(Maven3Launcher.java:79)
	at sun.reflect.NativeMethodAccessorImpl.invoke0(Native Method)
	at sun.reflect.NativeMethodAccessorImpl.invoke(NativeMethodAccessorImpl.java:39)
	at sun.reflect.DelegatingMethodAccessorImpl.invoke(DelegatingMethodAccessorImpl.java:25)
	at java.lang.reflect.Method.invoke(Method.java:592)
	at org.codehaus.plexus.classworlds.launcher.Launcher.launchStandard(Launcher.java:329)
	at org.codehaus.plexus.classworlds.launcher.Launcher.launch(Launcher.java:239)
	at org.jvnet.hudson.maven3.agent.Maven3Main.launch(Maven3Main.java:158)
	at hudson.maven.Maven3Builder.call(Maven3Builder.java:98)
	at hudson.maven.Maven3Builder.call(Maven3Builder.java:64)
	at hudson.remoting.UserRequest.perform(UserRequest.java:118)
	at hudson.remoting.UserRequest.perform(UserRequest.java:48)
	at hudson.remoting.Request$2.run(Request.java:287)
	at hudson.remoting.InterceptingExecutorService$1.call(InterceptingExecutorService.java:72)
	at java.util.concurrent.FutureTask$Sync.innerRun(FutureTask.java:269)
	at java.util.concurrent.FutureTask.run(FutureTask.java:123)
	at java.util.concurrent.ThreadPoolExecutor$Worker.runTask(ThreadPoolExecutor.java:651)
	at java.util.concurrent.ThreadPoolExecutor$Worker.run(ThreadPoolExecutor.java:676)
	at java.lang.Thread.run(Thread.java:595)
Caused by: org.apache.maven.plugin.MojoExecutionException: Failed to retrieve remote metadata
org.apache.directory.studio:studio-maven-plugin:1.0.6-SNAPSHOT/maven-metadata.xml: Could not
transfer metadata org.apache.directory.studio:studio-maven-plugin:1.0.6-SNAPSHOT/maven-metadata.xml
from/to apache.snapshots.https (https://repository.apache.org/content/repositories/snapshots):
Error transferring file: Server returned HTTP response code: 503 for URL: https://repository.apache.org/content/repositories/snapshots/org/apache/directory/studio/studio-maven-plugin/1.0.6-SNAPSHOT/maven-metadata.xml
	at org.apache.maven.plugin.deploy.DeployMojo.execute(DeployMojo.java:193)
	at org.apache.maven.plugin.DefaultBuildPluginManager.executeMojo(DefaultBuildPluginManager.java:101)
	at org.apache.maven.lifecycle.internal.MojoExecutor.execute(MojoExecutor.java:209)
	... 27 more
Caused by: org.apache.maven.artifact.deployer.ArtifactDeploymentException: Failed to retrieve
remote metadata org.apache.directory.studio:studio-maven-plugin:1.0.6-SNAPSHOT/maven-metadata.xml:
Could not transfer metadata org.apache.directory.studio:studio-maven-plugin:1.0.6-SNAPSHOT/maven-metadata.xml
from/to apache.snapshots.https (https://repository.apache.org/content/repositories/snapshots):
Error transferring file: Server returned HTTP response code: 503 for URL: https://repository.apache.org/content/repositories/snapshots/org/apache/directory/studio/studio-maven-plugin/1.0.6-SNAPSHOT/maven-metadata.xml
	at org.apache.maven.artifact.deployer.DefaultArtifactDeployer.deploy(DefaultArtifactDeployer.java:141)
	at org.apache.maven.plugin.deploy.AbstractDeployMojo.deploy(AbstractDeployMojo.java:167)
	at org.apache.maven.plugin.deploy.DeployMojo.execute(DeployMojo.java:157)
	... 29 more
Caused by: org.sonatype.aether.deployment.DeploymentException: Failed to retrieve remote metadata
org.apache.directory.studio:studio-maven-plugin:1.0.6-SNAPSHOT/maven-metadata.xml: Could not
transfer metadata org.apache.directory.studio:studio-maven-plugin:1.0.6-SNAPSHOT/maven-metadata.xml
from/to apache.snapshots.https (https://repository.apache.org/content/repositories/snapshots):
Error transferring file: Server returned HTTP response code: 503 for URL: https://repository.apache.org/content/repositories/snapshots/org/apache/directory/studio/studio-maven-plugin/1.0.6-SNAPSHOT/maven-metadata.xml
	at org.sonatype.aether.impl.internal.DefaultDeployer.upload(DefaultDeployer.java:407)
	at org.sonatype.aether.impl.internal.DefaultDeployer.deploy(DefaultDeployer.java:260)
	at org.sonatype.aether.impl.internal.DefaultDeployer.deploy(DefaultDeployer.java:215)
	at org.sonatype.aether.impl.internal.DefaultRepositorySystem.deploy(DefaultRepositorySystem.java:480)
	at org.apache.maven.artifact.deployer.DefaultArtifactDeployer.deploy(DefaultArtifactDeployer.java:137)
	... 31 more
Caused by: org.sonatype.aether.transfer.MetadataTransferException: Could not transfer metadata
org.apache.directory.studio:studio-maven-plugin:1.0.6-SNAPSHOT/maven-metadata.xml from/to
apache.snapshots.https (https://repository.apache.org/content/repositories/snapshots): Error
transferring file: Server returned HTTP response code: 503 for URL: https://repository.apache.org/content/repositories/snapshots/org/apache/directory/studio/studio-maven-plugin/1.0.6-SNAPSHOT/maven-metadata.xml
	at org.sonatype.aether.connector.wagon.WagonRepositoryConnector$3.wrap(WagonRepositoryConnector.java:932)
	at org.sonatype.aether.connector.wagon.WagonRepositoryConnector$3.wrap(WagonRepositoryConnector.java:923)
	at org.sonatype.aether.connector.wagon.WagonRepositoryConnector$GetTask.flush(WagonRepositoryConnector.java:695)
	at org.sonatype.aether.connector.wagon.WagonRepositoryConnector$GetTask.flush(WagonRepositoryConnector.java:689)
	at org.sonatype.aether.connector.wagon.WagonRepositoryConnector.get(WagonRepositoryConnector.java:445)
	at org.sonatype.aether.impl.internal.DefaultDeployer.upload(DefaultDeployer.java:379)
	... 35 more
Caused by: org.apache.maven.wagon.TransferFailedException: Error transferring file: Server
returned HTTP response code: 503 for URL: https://repository.apache.org/content/repositories/snapshots/org/apache/directory/studio/studio-maven-plugin/1.0.6-SNAPSHOT/maven-metadata.xml
	at org.apache.maven.wagon.providers.http.LightweightHttpWagon.fillInputData(LightweightHttpWagon.java:143)
	at org.apache.maven.wagon.StreamWagon.getInputStream(StreamWagon.java:116)
	at org.apache.maven.wagon.StreamWagon.getIfNewer(StreamWagon.java:88)
	at org.apache.maven.wagon.StreamWagon.get(StreamWagon.java:61)
	at org.sonatype.aether.connector.wagon.WagonRepositoryConnector$GetTask.run(WagonRepositoryConnector.java:608)
	at org.sonatype.aether.util.concurrency.RunnableErrorForwarder$1.run(RunnableErrorForwarder.java:64)
	... 3 more
Caused by: java.io.IOException: Server returned HTTP response code: 503 for URL: https://repository.apache.org/content/repositories/snapshots/org/apache/directory/studio/studio-maven-plugin/1.0.6-SNAPSHOT/maven-metadata.xml
	at sun.reflect.NativeConstructorAccessorImpl.newInstance0(Native Method)
	at sun.reflect.NativeConstructorAccessorImpl.newInstance(NativeConstructorAccessorImpl.java:39)
	at sun.reflect.DelegatingConstructorAccessorImpl.newInstance(DelegatingConstructorAccessorImpl.java:27)
	at java.lang.reflect.Constructor.newInstance(Constructor.java:501)
	at sun.net.www.protocol.http.HttpURLConnection$6.run(HttpURLConnection.java:1250)
	at java.security.AccessController.doPrivileged(Native Method)
	at sun.net.www.protocol.http.HttpURLConnection.getChainedException(HttpURLConnection.java:1244)
	at sun.net.www.protocol.http.HttpURLConnection.getInputStream(HttpURLConnection.java:932)
	at sun.net.www.protocol.https.HttpsURLConnectionImpl.getInputStream(HttpsURLConnectionImpl.java:234)
	at org.apache.maven.wagon.providers.http.LightweightHttpWagon.fillInputData(LightweightHttpWagon.java:122)
	... 8 more
Caused by: java.io.IOException: Server returned HTTP response code: 503 for URL: https://repository.apache.org/content/repositories/snapshots/org/apache/directory/studio/studio-maven-plugin/1.0.6-SNAPSHOT/maven-metadata.xml
	at sun.net.www.protocol.http.HttpURLConnection.getInputStream(HttpURLConnection.java:1196)
	at java.net.HttpURLConnection.getResponseCode(HttpURLConnection.java:367)
	at sun.net.www.protocol.https.HttpsURLConnectionImpl.getResponseCode(HttpsURLConnectionImpl.java:318)
	at org.apache.maven.wagon.providers.http.LightweightHttpWagon.fillInputData(LightweightHttpWagon.java:115)
	... 8 more
channel stopped

Mime
View raw message