directory-notifications mailing list archives

Site index · List index
Message view « Date » · « Thread »
Top « Date » · « Thread »
From Apache Jenkins Server <jenk...@builds.apache.org>
Subject Build failed in Jenkins: dir-apacheds-jdk16-ubuntu-deploy #584
Date Mon, 02 Apr 2012 04:12:38 GMT
See <https://builds.apache.org/job/dir-apacheds-jdk16-ubuntu-deploy/584/>

------------------------------------------
[...truncated 2069 lines...]
[INFO] META-INF/DEPENDENCIES already added, skipping
[INFO] Building jar: <https://builds.apache.org/job/dir-apacheds-jdk16-ubuntu-deploy/ws/trunk/core/target/apacheds-core-2.0.0-M7-SNAPSHOT-sources.jar>
[INFO] org already added, skipping
[INFO] org/apache already added, skipping
[INFO] org/apache/directory already added, skipping
[INFO] org/apache/directory/server already added, skipping
[INFO] org/apache/directory/server/core already added, skipping
[INFO] META-INF already added, skipping
[INFO] META-INF already added, skipping
[INFO] META-INF/NOTICE already added, skipping
[INFO] META-INF/LICENSE already added, skipping
[INFO] META-INF/DEPENDENCIES already added, skipping
[INFO] [INFO] Installing <https://builds.apache.org/job/dir-apacheds-jdk16-ubuntu-deploy/ws/trunk/core/target/apacheds-core-2.0.0-M7-SNAPSHOT.jar>
to /home/jenkins/jenkins-slave/maven-repositories/1/org/apache/directory/server/apacheds-core/2.0.0-M7-SNAPSHOT/apacheds-core-2.0.0-M7-SNAPSHOT.jar

[INFO] [INFO] Installing <https://builds.apache.org/job/dir-apacheds-jdk16-ubuntu-deploy/ws/trunk/core/pom.xml>
to /home/jenkins/jenkins-slave/maven-repositories/1/org/apache/directory/server/apacheds-core/2.0.0-M7-SNAPSHOT/apacheds-core-2.0.0-M7-SNAPSHOT.pom
--- maven-install-plugin:2.3.1:install (default-install) @ apacheds-core ---
[INFO] Installing <https://builds.apache.org/job/dir-apacheds-jdk16-ubuntu-deploy/ws/trunk/core/target/apacheds-core-2.0.0-M7-SNAPSHOT-sources.jar>
to /home/jenkins/jenkins-slave/maven-repositories/1/org/apache/directory/server/apacheds-core/2.0.0-M7-SNAPSHOT/apacheds-core-2.0.0-M7-SNAPSHOT-sources.jar
[INFO] 
[INFO] --- maven-bundle-plugin:2.3.7:install (default-install) @ apacheds-core ---
[INFO] Installing org/apache/directory/server/apacheds-core/2.0.0-M7-SNAPSHOT/apacheds-core-2.0.0-M7-SNAPSHOT.jar
[INFO] Writing OBR metadata
[INFO] Downloading: https://repository.apache.org/content/repositories/snapshots/org/apache/directory/server/apacheds-core/2.0.0-M7-SNAPSHOT/maven-metadata.xml

[INFO] --- maven-deploy-plugin:2.7:deploy (default-deploy) @ apacheds-core ---
Downloaded: https://repository.apache.org/content/repositories/snapshots/org/apache/directory/server/apacheds-core/2.0.0-M7-SNAPSHOT/maven-metadata.xml
(1020 B at 3.4 KB/sec)
Uploading: https://repository.apache.org/content/repositories/snapshots/org/apache/directory/server/apacheds-core/2.0.0-M7-SNAPSHOT/apacheds-core-2.0.0-M7-20120402.041230-36.jar
Uploaded: https://repository.apache.org/content/repositories/snapshots/org/apache/directory/server/apacheds-core/2.0.0-M7-SNAPSHOT/apacheds-core-2.0.0-M7-20120402.041230-36.jar
(51 KB at 123.9 KB/sec)
Uploading: https://repository.apache.org/content/repositories/snapshots/org/apache/directory/server/apacheds-core/2.0.0-M7-SNAPSHOT/apacheds-core-2.0.0-M7-20120402.041230-36.pom
Uploaded: https://repository.apache.org/content/repositories/snapshots/org/apache/directory/server/apacheds-core/2.0.0-M7-SNAPSHOT/apacheds-core-2.0.0-M7-20120402.041230-36.pom
(7 KB at 36.9 KB/sec)
Downloading: https://repository.apache.org/content/repositories/snapshots/org/apache/directory/server/apacheds-core/maven-metadata.xml
Downloaded: https://repository.apache.org/content/repositories/snapshots/org/apache/directory/server/apacheds-core/maven-metadata.xml
(406 B at 1.1 KB/sec)
Uploading: https://repository.apache.org/content/repositories/snapshots/org/apache/directory/server/apacheds-core/2.0.0-M7-SNAPSHOT/maven-metadata.xml
Uploaded: https://repository.apache.org/content/repositories/snapshots/org/apache/directory/server/apacheds-core/2.0.0-M7-SNAPSHOT/maven-metadata.xml
(1020 B at 4.1 KB/sec)
Uploading: https://repository.apache.org/content/repositories/snapshots/org/apache/directory/server/apacheds-core/maven-metadata.xml
Uploaded: https://repository.apache.org/content/repositories/snapshots/org/apache/directory/server/apacheds-core/maven-metadata.xml
(406 B at 1.5 KB/sec)
Uploading: https://repository.apache.org/content/repositories/snapshots/org/apache/directory/server/apacheds-core/2.0.0-M7-SNAPSHOT/apacheds-core-2.0.0-M7-20120402.041230-36-sources.jar
Uploaded: https://repository.apache.org/content/repositories/snapshots/org/apache/directory/server/apacheds-core/2.0.0-M7-SNAPSHOT/apacheds-core-2.0.0-M7-20120402.041230-36-sources.jar
(38 KB at 120.8 KB/sec)
Uploading: https://repository.apache.org/content/repositories/snapshots/org/apache/directory/server/apacheds-core/2.0.0-M7-SNAPSHOT/maven-metadata.xml
Uploaded: https://repository.apache.org/content/repositories/snapshots/org/apache/directory/server/apacheds-core/2.0.0-M7-SNAPSHOT/maven-metadata.xml
(1020 B at 5.3 KB/sec)
[INFO] [INFO] Remote OBR update disabled (enable with -DremoteOBR)

[INFO] --- maven-bundle-plugin:2.3.7:deploy (default-deploy) @ apacheds-core ---
[JENKINS] Archiving <https://builds.apache.org/job/dir-apacheds-jdk16-ubuntu-deploy/ws/trunk/core/pom.xml>
to /home/hudson/hudson/jobs/dir-apacheds-jdk16-ubuntu-deploy/modules/org.apache.directory.server$apacheds-core/builds/2012-04-02_04-06-47/archive/org.apache.directory.server/apacheds-core/2.0.0-M7-SNAPSHOT/apacheds-core-2.0.0-M7-SNAPSHOT.pom
[JENKINS] Archiving <https://builds.apache.org/job/dir-apacheds-jdk16-ubuntu-deploy/ws/trunk/core/target/apacheds-core-2.0.0-M7-SNAPSHOT.jar>
to /home/hudson/hudson/jobs/dir-apacheds-jdk16-ubuntu-deploy/modules/org.apache.directory.server$apacheds-core/builds/2012-04-02_04-06-47/archive/org.apache.directory.server/apacheds-core/2.0.0-M7-20120402.041230-36/apacheds-core-2.0.0-M7-20120402.041230-36.jar
[JENKINS] Archiving <https://builds.apache.org/job/dir-apacheds-jdk16-ubuntu-deploy/ws/trunk/core/target/apacheds-core-2.0.0-M7-SNAPSHOT-sources.jar>
to /home/hudson/hudson/jobs/dir-apacheds-jdk16-ubuntu-deploy/modules/org.apache.directory.server$apacheds-core/builds/2012-04-02_04-06-47/archive/org.apache.directory.server/apacheds-core/2.0.0-M7-20120402.041230-36/apacheds-core-2.0.0-M7-20120402.041230-36-sources.jar
[INFO] [INFO] Deleting <https://builds.apache.org/job/dir-apacheds-jdk16-ubuntu-deploy/ws/trunk/core-avl/target>
                                                                        
[INFO] ------------------------------------------------------------------------
[INFO] Building ApacheDS Core AVL 2.0.0-M7-SNAPSHOT
[INFO] ------------------------------------------------------------------------
[INFO] 
[INFO] --- maven-clean-plugin:2.4.1:clean (default-clean) @ apacheds-core-avl ---
[INFO] 
[INFO] --- maven-remote-resources-plugin:1.2.1:process (default) @ apacheds-core-avl ---
[INFO] [debug] execute contextualize
[INFO] Using 'UTF-8' encoding to copy filtered resources.
[INFO] skip non existing resourceDirectory <https://builds.apache.org/job/dir-apacheds-jdk16-ubuntu-deploy/ws/trunk/core-avl/src/main/resources>
[INFO] Copying 3 resources

[INFO] --- maven-resources-plugin:2.5:resources (default-resources) @ apacheds-core-avl ---
[INFO] [INFO] Compiling 22 source files to <https://builds.apache.org/job/dir-apacheds-jdk16-ubuntu-deploy/ws/trunk/core-avl/target/classes>

[INFO] --- maven-compiler-plugin:2.3.2:compile (default-compile) @ apacheds-core-avl ---
[INFO] -------------------------------------------------------------
[ERROR] COMPILATION ERROR : 
[INFO] -------------------------------------------------------------
[ERROR] <https://builds.apache.org/job/dir-apacheds-jdk16-ubuntu-deploy/ws/trunk/core-avl/src/main/java/org/apache/directory/server/core/avltree/AvlTreeMapNoDupsWrapperCursor.java>:[23,52]
cannot find symbol
symbol  : class AbstractTupleCursor
location: package org.apache.directory.shared.ldap.model.cursor
[ERROR] <https://builds.apache.org/job/dir-apacheds-jdk16-ubuntu-deploy/ws/trunk/core-avl/src/main/java/org/apache/directory/server/core/avltree/AvlTreeMapNoDupsWrapperCursor.java>:[35,57]
cannot find symbol
symbol: class AbstractTupleCursor
public class AvlTreeMapNoDupsWrapperCursor<K, V> extends AbstractTupleCursor<K, V>
[ERROR] <https://builds.apache.org/job/dir-apacheds-jdk16-ubuntu-deploy/ws/trunk/core-avl/src/main/java/org/apache/directory/server/core/avltree/AvlTreeMapNoDupsWrapperCursor.java>:[35,76]
a generic class may not extend java.lang.Throwable
[ERROR] <https://builds.apache.org/job/dir-apacheds-jdk16-ubuntu-deploy/ws/trunk/core-avl/src/main/java/org/apache/directory/server/core/avltree/AvlSingletonOrOrderedSetCursor.java>:[25,52]
cannot find symbol
symbol  : class AbstractTupleCursor
location: package org.apache.directory.shared.ldap.model.cursor
[ERROR] <https://builds.apache.org/job/dir-apacheds-jdk16-ubuntu-deploy/ws/trunk/core-avl/src/main/java/org/apache/directory/server/core/avltree/AvlSingletonOrOrderedSetCursor.java>:[35,58]
cannot find symbol
symbol: class AbstractTupleCursor
public class AvlSingletonOrOrderedSetCursor<K, V> extends AbstractTupleCursor<K,
SingletonOrOrderedSet<V>>
[ERROR] <https://builds.apache.org/job/dir-apacheds-jdk16-ubuntu-deploy/ws/trunk/core-avl/src/main/java/org/apache/directory/server/core/avltree/AvlSingletonOrOrderedSetCursor.java>:[35,77]
a generic class may not extend java.lang.Throwable
[ERROR] <https://builds.apache.org/job/dir-apacheds-jdk16-ubuntu-deploy/ws/trunk/core-avl/src/main/java/org/apache/directory/server/core/avltree/KeyTupleAvlCursor.java>:[23,52]
cannot find symbol
symbol  : class AbstractTupleCursor
location: package org.apache.directory.shared.ldap.model.cursor
[ERROR] <https://builds.apache.org/job/dir-apacheds-jdk16-ubuntu-deploy/ws/trunk/core-avl/src/main/java/org/apache/directory/server/core/avltree/KeyTupleAvlCursor.java>:[35,45]
cannot find symbol
symbol: class AbstractTupleCursor
public class KeyTupleAvlCursor<K, V> extends AbstractTupleCursor<K, V>
[ERROR] <https://builds.apache.org/job/dir-apacheds-jdk16-ubuntu-deploy/ws/trunk/core-avl/src/main/java/org/apache/directory/server/core/avltree/KeyTupleAvlCursor.java>:[35,64]
a generic class may not extend java.lang.Throwable
[ERROR] <https://builds.apache.org/job/dir-apacheds-jdk16-ubuntu-deploy/ws/trunk/core-avl/src/main/java/org/apache/directory/server/core/avltree/AvlSingletonOrOrderedSetCursor.java>:[75,8]
cannot find symbol
symbol  : method checkNotClosed(java.lang.String)
location: class org.apache.directory.server.core.avltree.AvlSingletonOrOrderedSetCursor<K,V>
[ERROR] <https://builds.apache.org/job/dir-apacheds-jdk16-ubuntu-deploy/ws/trunk/core-avl/src/main/java/org/apache/directory/server/core/avltree/AvlSingletonOrOrderedSetCursor.java>:[95,8]
cannot find symbol
symbol  : method checkNotClosed(java.lang.String)
location: class org.apache.directory.server.core.avltree.AvlSingletonOrOrderedSetCursor<K,V>
[ERROR] <https://builds.apache.org/job/dir-apacheds-jdk16-ubuntu-deploy/ws/trunk/core-avl/src/main/java/org/apache/directory/server/core/avltree/AvlSingletonOrOrderedSetCursor.java>:[103,8]
cannot find symbol
symbol  : method checkNotClosed(java.lang.String)
location: class org.apache.directory.server.core.avltree.AvlSingletonOrOrderedSetCursor<K,V>
[ERROR] <https://builds.apache.org/job/dir-apacheds-jdk16-ubuntu-deploy/ws/trunk/core-avl/src/main/java/org/apache/directory/server/core/avltree/AvlSingletonOrOrderedSetCursor.java>:[122,8]
cannot find symbol
symbol  : method checkNotClosed(java.lang.String)
location: class org.apache.directory.server.core.avltree.AvlSingletonOrOrderedSetCursor<K,V>
[ERROR] <https://builds.apache.org/job/dir-apacheds-jdk16-ubuntu-deploy/ws/trunk/core-avl/src/main/java/org/apache/directory/server/core/avltree/AvlSingletonOrOrderedSetCursor.java>:[137,8]
cannot find symbol
symbol  : method checkNotClosed(java.lang.String)
location: class org.apache.directory.server.core.avltree.AvlSingletonOrOrderedSetCursor<K,V>
[ERROR] <https://builds.apache.org/job/dir-apacheds-jdk16-ubuntu-deploy/ws/trunk/core-avl/src/main/java/org/apache/directory/server/core/avltree/AvlSingletonOrOrderedSetCursor.java>:[156,8]
cannot find symbol
symbol  : method checkNotClosed(java.lang.String)
location: class org.apache.directory.server.core.avltree.AvlSingletonOrOrderedSetCursor<K,V>
[ERROR] <https://builds.apache.org/job/dir-apacheds-jdk16-ubuntu-deploy/ws/trunk/core-avl/src/main/java/org/apache/directory/server/core/avltree/AvlSingletonOrOrderedSetCursor.java>:[192,8]
cannot find symbol
symbol  : method checkNotClosed(java.lang.String)
location: class org.apache.directory.server.core.avltree.AvlSingletonOrOrderedSetCursor<K,V>
[ERROR] <https://builds.apache.org/job/dir-apacheds-jdk16-ubuntu-deploy/ws/trunk/core-avl/src/main/java/org/apache/directory/server/core/avltree/AvlSingletonOrOrderedSetCursor.java>:[228,8]
cannot find symbol
symbol  : method checkNotClosed(java.lang.String)
location: class org.apache.directory.server.core.avltree.AvlSingletonOrOrderedSetCursor<K,V>
[ERROR] <https://builds.apache.org/job/dir-apacheds-jdk16-ubuntu-deploy/ws/trunk/core-avl/src/main/java/org/apache/directory/server/core/avltree/AvlSingletonOrOrderedSetCursor.java>:[260,8]
cannot find symbol
symbol  : method checkNotClosed(java.lang.String)
location: class org.apache.directory.server.core.avltree.AvlSingletonOrOrderedSetCursor<K,V>
[ERROR] <https://builds.apache.org/job/dir-apacheds-jdk16-ubuntu-deploy/ws/trunk/core-avl/src/main/java/org/apache/directory/server/core/avltree/KeyTupleAvlCursor.java>:[85,8]
cannot find symbol
symbol  : method checkNotClosed(java.lang.String)
location: class org.apache.directory.server.core.avltree.KeyTupleAvlCursor<K,V>
[ERROR] <https://builds.apache.org/job/dir-apacheds-jdk16-ubuntu-deploy/ws/trunk/core-avl/src/main/java/org/apache/directory/server/core/avltree/KeyTupleAvlCursor.java>:[98,8]
cannot find symbol
symbol  : method checkNotClosed(java.lang.String)
location: class org.apache.directory.server.core.avltree.KeyTupleAvlCursor<K,V>
[ERROR] <https://builds.apache.org/job/dir-apacheds-jdk16-ubuntu-deploy/ws/trunk/core-avl/src/main/java/org/apache/directory/server/core/avltree/KeyTupleAvlCursor.java>:[119,8]
cannot find symbol
symbol  : method checkNotClosed(java.lang.String)
location: class org.apache.directory.server.core.avltree.KeyTupleAvlCursor<K,V>
[ERROR] <https://builds.apache.org/job/dir-apacheds-jdk16-ubuntu-deploy/ws/trunk/core-avl/src/main/java/org/apache/directory/server/core/avltree/KeyTupleAvlCursor.java>:[127,8]
cannot find symbol
symbol  : method checkNotClosed(java.lang.String)
location: class org.apache.directory.server.core.avltree.KeyTupleAvlCursor<K,V>
[ERROR] <https://builds.apache.org/job/dir-apacheds-jdk16-ubuntu-deploy/ws/trunk/core-avl/src/main/java/org/apache/directory/server/core/avltree/KeyTupleAvlCursor.java>:[135,8]
cannot find symbol
symbol  : method checkNotClosed(java.lang.String)
location: class org.apache.directory.server.core.avltree.KeyTupleAvlCursor<K,V>
[ERROR] <https://builds.apache.org/job/dir-apacheds-jdk16-ubuntu-deploy/ws/trunk/core-avl/src/main/java/org/apache/directory/server/core/avltree/KeyTupleAvlCursor.java>:[143,8]
cannot find symbol
symbol  : method checkNotClosed(java.lang.String)
location: class org.apache.directory.server.core.avltree.KeyTupleAvlCursor<K,V>
[ERROR] <https://builds.apache.org/job/dir-apacheds-jdk16-ubuntu-deploy/ws/trunk/core-avl/src/main/java/org/apache/directory/server/core/avltree/KeyTupleAvlCursor.java>:[165,8]
cannot find symbol
symbol  : method checkNotClosed(java.lang.String)
location: class org.apache.directory.server.core.avltree.KeyTupleAvlCursor<K,V>
[ERROR] <https://builds.apache.org/job/dir-apacheds-jdk16-ubuntu-deploy/ws/trunk/core-avl/src/main/java/org/apache/directory/server/core/avltree/KeyTupleAvlCursor.java>:[182,8]
cannot find symbol
symbol  : method checkNotClosed(java.lang.String)
location: class org.apache.directory.server.core.avltree.KeyTupleAvlCursor<K,V>
[ERROR] <https://builds.apache.org/job/dir-apacheds-jdk16-ubuntu-deploy/ws/trunk/core-avl/src/main/java/org/apache/directory/server/core/avltree/KeyTupleAvlCursor.java>:[199,8]
cannot find symbol
symbol  : method checkNotClosed(java.lang.String)
location: class org.apache.directory.server.core.avltree.KeyTupleAvlCursor<K,V>
[INFO] 27 errors 
[INFO] -------------------------------------------------------------
[JENKINS] Archiving <https://builds.apache.org/job/dir-apacheds-jdk16-ubuntu-deploy/ws/trunk/core-avl/pom.xml>
to /home/hudson/hudson/jobs/dir-apacheds-jdk16-ubuntu-deploy/modules/org.apache.directory.server$apacheds-core-avl/builds/2012-04-02_04-06-47/archive/org.apache.directory.server/apacheds-core-avl/2.0.0-M7-SNAPSHOT/apacheds-core-avl-2.0.0-M7-SNAPSHOT.pom
[INFO] ------------------------------------------------------------------------
[INFO] Reactor Summary:
[INFO] 
[INFO] ApacheDS .......................................... SUCCESS [28.939s]
[INFO] ApacheDS I18n ..................................... SUCCESS [7.987s]
[INFO] ApacheDS Core Constants ........................... SUCCESS [7.121s]
[INFO] ApacheDS Core API ................................. SUCCESS [36.194s]
[INFO] ApacheDS Core Shared .............................. SUCCESS [8.740s]
[INFO] ApacheDS Interceptors ............................. SUCCESS [2.037s]
[INFO] ApacheDS AdministrativePoint Interceptor .......... SUCCESS [7.595s]
[INFO] ApacheDS Authentication Interceptor ............... SUCCESS [15.929s]
[INFO] ApacheDS Authorization Interceptor ................ SUCCESS [30.300s]
[INFO] ApacheDS ChangeLog Interceptor .................... SUCCESS [16.210s]
[INFO] ApacheDS Collective Attribute Interceptor ......... SUCCESS [6.236s]
[INFO] ApacheDS Event Interceptor ........................ SUCCESS [6.103s]
[INFO] ApacheDS Exception Interceptor .................... SUCCESS [6.581s]
[INFO] ApacheDS Journal Interceptor ...................... SUCCESS [16.018s]
[INFO] ApacheDS Normalization Interceptor ................ SUCCESS [13.367s]
[INFO] ApacheDS Operational Attribute Interceptor ........ SUCCESS [6.954s]
[INFO] ApacheDS Referral Interceptor ..................... SUCCESS [6.407s]
[INFO] ApacheDS Schema Interceptor ....................... SUCCESS [27.882s]
[INFO] ApacheDS Subtree Interceptor ...................... SUCCESS [25.812s]
[INFO] ApacheDS Triggers Interceptor ..................... SUCCESS [7.242s]
[INFO] ApacheDS Core ..................................... SUCCESS [10.558s]
[INFO] ApacheDS Core AVL ................................. FAILURE [1.227s]
[INFO] ApacheDS Generalized (X) DBM Partition ............ SKIPPED
[INFO] ApacheDS LDIF Partition ........................... SKIPPED
[INFO] ApacheDS JDBM Partition ........................... SKIPPED
[INFO] ApacheDS Core Annotations ......................... SKIPPED
[INFO] ApacheDS Core JNDI ................................ SKIPPED
[INFO] ApacheDS Protocol Shared .......................... SKIPPED
[INFO] ApacheDS Protocol Kerberos Codec .................. SKIPPED
[INFO] ApacheDS Interceptors for Kerberos ................ SKIPPED
[INFO] ApacheDS Protocol Dhcp ............................ SKIPPED
[INFO] ApacheDS Protocol Dns ............................. SKIPPED
[INFO] ApacheDS Protocol Kerberos ........................ SKIPPED
[INFO] ApacheDS Protocol Ldap ............................ SKIPPED
[INFO] ApacheDS Protocol Ntp ............................. SKIPPED
[INFO] Apacheds Server Annotations ....................... SKIPPED
[INFO] ApacheDS Server Config ............................ SKIPPED
[INFO] ApacheDS Server JNDI .............................. SKIPPED
[INFO] ApacheDS Server Replication Service ............... SKIPPED
[INFO] ApacheDS Test Framework ........................... SKIPPED
[INFO] ApacheDS Generalized (X) DBM Tools ................ SKIPPED
[INFO] ApacheDS All ...................................... SKIPPED
[INFO] ApacheDS Logger Interceptor ....................... SKIPPED
[INFO] ApacheDS Password Hashing Interceptor ............. SKIPPED
[INFO] ApacheDS Core Integration ......................... SKIPPED
[INFO] ApacheDS Server Integration ....................... SKIPPED
[INFO] ApacheDS DirectoryService-WebApp bridge ........... SKIPPED
[INFO] ApacheDS Jetty HTTP Server Integration ............ SKIPPED
[INFO] ApacheDS Service Builder .......................... SKIPPED
[INFO] ApacheDS Protocol Kerberos Test ................... SKIPPED
[INFO] Apache Directory LDAP Client API test ............. SKIPPED
[INFO] ApacheDS Service .................................. SKIPPED
[INFO] ApacheDS Wrapper .................................. SKIPPED
[INFO] ApacheDS Installers Maven Plugin .................. SKIPPED
[INFO] ApacheDS Installers ............................... SKIPPED
[INFO] ------------------------------------------------------------------------
[INFO] BUILD FAILURE
[INFO] ------------------------------------------------------------------------
[INFO] Total time: 5:30.317s
[INFO] Finished at: Mon Apr 02 04:12:35 UTC 2012
[INFO] Final Memory: 142M/334M
[INFO] ------------------------------------------------------------------------
mavenExecutionResult exceptions not empty
message : Failed to execute goal org.apache.maven.plugins:maven-compiler-plugin:2.3.2:compile
(default-compile) on project apacheds-core-avl: Compilation failure
cause : Compilation failure
Stack trace : 
org.apache.maven.lifecycle.LifecycleExecutionException: Failed to execute goal org.apache.maven.plugins:maven-compiler-plugin:2.3.2:compile
(default-compile) on project apacheds-core-avl: Compilation failure
	at org.apache.maven.lifecycle.internal.MojoExecutor.execute(MojoExecutor.java:213)
	at org.apache.maven.lifecycle.internal.MojoExecutor.execute(MojoExecutor.java:153)
	at org.apache.maven.lifecycle.internal.MojoExecutor.execute(MojoExecutor.java:145)
	at org.apache.maven.lifecycle.internal.LifecycleModuleBuilder.buildProject(LifecycleModuleBuilder.java:84)
	at org.apache.maven.lifecycle.internal.LifecycleModuleBuilder.buildProject(LifecycleModuleBuilder.java:59)
	at org.apache.maven.lifecycle.internal.LifecycleStarter.singleThreadedBuild(LifecycleStarter.java:183)
	at org.apache.maven.lifecycle.internal.LifecycleStarter.execute(LifecycleStarter.java:161)
	at org.apache.maven.DefaultMaven.doExecute(DefaultMaven.java:319)
	at org.apache.maven.DefaultMaven.execute(DefaultMaven.java:156)
	at org.jvnet.hudson.maven3.launcher.Maven3Launcher.main(Maven3Launcher.java:79)
	at sun.reflect.NativeMethodAccessorImpl.invoke0(Native Method)
	at sun.reflect.NativeMethodAccessorImpl.invoke(NativeMethodAccessorImpl.java:39)
	at sun.reflect.DelegatingMethodAccessorImpl.invoke(DelegatingMethodAccessorImpl.java:25)
	at java.lang.reflect.Method.invoke(Method.java:597)
	at org.codehaus.plexus.classworlds.launcher.Launcher.launchStandard(Launcher.java:329)
	at org.codehaus.plexus.classworlds.launcher.Launcher.launch(Launcher.java:239)
	at org.jvnet.hudson.maven3.agent.Maven3Main.launch(Maven3Main.java:158)
	at hudson.maven.Maven3Builder.call(Maven3Builder.java:104)
	at hudson.maven.Maven3Builder.call(Maven3Builder.java:70)
	at hudson.remoting.UserRequest.perform(UserRequest.java:118)
	at hudson.remoting.UserRequest.perform(UserRequest.java:48)
	at hudson.remoting.Request$2.run(Request.java:287)
	at hudson.remoting.InterceptingExecutorService$1.call(InterceptingExecutorService.java:72)
	at java.util.concurrent.FutureTask$Sync.innerRun(FutureTask.java:303)
	at java.util.concurrent.FutureTask.run(FutureTask.java:138)
	at java.util.concurrent.ThreadPoolExecutor$Worker.runTask(ThreadPoolExecutor.java:886)
	at java.util.concurrent.ThreadPoolExecutor$Worker.run(ThreadPoolExecutor.java:908)
	at java.lang.Thread.run(Thread.java:619)
Caused by: org.apache.maven.plugin.CompilationFailureException: Compilation failure
	at org.apache.maven.plugin.AbstractCompilerMojo.execute(AbstractCompilerMojo.java:656)
	at org.apache.maven.plugin.CompilerMojo.execute(CompilerMojo.java:128)
	at org.apache.maven.plugin.DefaultBuildPluginManager.executeMojo(DefaultBuildPluginManager.java:101)
	at org.apache.maven.lifecycle.internal.MojoExecutor.execute(MojoExecutor.java:209)
	... 27 more
channel stopped

Mime
View raw message