directory-notifications mailing list archives

Site index · List index
Message view « Date » · « Thread »
Top « Date » · « Thread »
From Apache Jenkins Server <jenk...@builds.apache.org>
Subject Build failed in Jenkins: dir-apacheds-jdk16-win #86
Date Sun, 01 Apr 2012 04:06:36 GMT
See <https://builds.apache.org/job/dir-apacheds-jdk16-win/86/>

------------------------------------------
[...truncated 1553 lines...]
[INFO] 
[INFO] --- maven-bundle-plugin:2.3.7:bundle (default-bundle) @ apacheds-core ---
[INFO] 
[INFO] --- maven-site-plugin:3.0:attach-descriptor (attach-descriptor) @ apacheds-core ---
[INFO] [INFO] Checking legal files in: apacheds-core-2.0.0-M7-SNAPSHOT.jar

[INFO] --- tools-maven-plugin:1.4:verify-legal-files (verify-legal-files) @ apacheds-core
---
Apr 1, 2012 5:06:15 AM hudson.maven.ExecutedMojo <init>
WARNING: Failed to getClass for org.apache.maven.plugin.source.SourceJarMojo
[INFO] 
[INFO] --- maven-source-plugin:2.1.2:jar (attach-sources) @ apacheds-core ---
[INFO] META-INF already added, skipping
[INFO] org already added, skipping
[INFO] org\apache already added, skipping
[INFO] org\apache\directory already added, skipping
[INFO] org\apache\directory\server already added, skipping
[INFO] org\apache\directory\server\core already added, skipping
[INFO] META-INF already added, skipping
[INFO] META-INF\DEPENDENCIES already added, skipping
[INFO] META-INF\LICENSE already added, skipping
[INFO] META-INF\NOTICE already added, skipping
[INFO] Building jar: F:\hudson\hudson-slave\workspace\dir-apacheds-jdk16-win\trunk\core\target\apacheds-core-2.0.0-M7-SNAPSHOT-sources.jar
[INFO] META-INF already added, skipping
[INFO] org already added, skipping
[INFO] org\apache already added, skipping
[INFO] org\apache\directory already added, skipping
[INFO] org\apache\directory\server already added, skipping
[INFO] org\apache\directory\server\core already added, skipping
[INFO] META-INF already added, skipping
[INFO] META-INF\DEPENDENCIES already added, skipping
[INFO] META-INF\LICENSE already added, skipping
[INFO] META-INF\NOTICE already added, skipping
[INFO] [INFO] Installing F:\hudson\hudson-slave\workspace\dir-apacheds-jdk16-win\trunk\core\target\apacheds-core-2.0.0-M7-SNAPSHOT.jar
to f:\hudson\hudson-slave\maven-repositories\0\org\apache\directory\server\apacheds-core\2.0.0-M7-SNAPSHOT\apacheds-core-2.0.0-M7-SNAPSHOT.jar

[INFO] --- maven-install-plugin:2.3.1:install (default-install) @ apacheds-core ---
[INFO] Installing F:\hudson\hudson-slave\workspace\dir-apacheds-jdk16-win\trunk\core\pom.xml
to f:\hudson\hudson-slave\maven-repositories\0\org\apache\directory\server\apacheds-core\2.0.0-M7-SNAPSHOT\apacheds-core-2.0.0-M7-SNAPSHOT.pom
[INFO] Installing F:\hudson\hudson-slave\workspace\dir-apacheds-jdk16-win\trunk\core\target\apacheds-core-2.0.0-M7-SNAPSHOT-sources.jar
to f:\hudson\hudson-slave\maven-repositories\0\org\apache\directory\server\apacheds-core\2.0.0-M7-SNAPSHOT\apacheds-core-2.0.0-M7-SNAPSHOT-sources.jar
[INFO] 
[INFO] --- maven-bundle-plugin:2.3.7:install (default-install) @ apacheds-core ---
[INFO] Installing org/apache/directory/server/apacheds-core/2.0.0-M7-SNAPSHOT/apacheds-core-2.0.0-M7-SNAPSHOT.jar
[INFO] Writing OBR metadata
[JENKINS] Archiving disabled - not archiving F:\hudson\hudson-slave\workspace\dir-apacheds-jdk16-win\trunk\core\pom.xml
[JENKINS] Archiving disabled - not archiving F:\hudson\hudson-slave\workspace\dir-apacheds-jdk16-win\trunk\core\target\apacheds-core-2.0.0-M7-SNAPSHOT.jar
[JENKINS] Archiving disabled - not archiving F:\hudson\hudson-slave\workspace\dir-apacheds-jdk16-win\trunk\core\target\apacheds-core-2.0.0-M7-SNAPSHOT-sources.jar
[INFO]                                                                         
[INFO] ------------------------------------------------------------------------
[INFO] Building ApacheDS Core AVL 2.0.0-M7-SNAPSHOT
[INFO] ------------------------------------------------------------------------
[INFO] Deleting F:\hudson\hudson-slave\workspace\dir-apacheds-jdk16-win\trunk\core-avl\target
[INFO] 
[INFO] --- maven-clean-plugin:2.4.1:clean (default-clean) @ apacheds-core-avl ---
[INFO] 
[INFO] --- maven-remote-resources-plugin:1.2.1:process (default) @ apacheds-core-avl ---
[debug] execute contextualize
[INFO] Using 'UTF-8' encoding to copy filtered resources.
[INFO] skip non existing resourceDirectory F:\hudson\hudson-slave\workspace\dir-apacheds-jdk16-win\trunk\core-avl\src\main\resources
[INFO] Copying 3 resources
[INFO] 
[INFO] --- maven-resources-plugin:2.5:resources (default-resources) @ apacheds-core-avl ---
[INFO] 
[INFO] --- maven-compiler-plugin:2.3.2:compile (default-compile) @ apacheds-core-avl ---
[INFO] Compiling 22 source files to F:\hudson\hudson-slave\workspace\dir-apacheds-jdk16-win\trunk\core-avl\target\classes
[INFO] -------------------------------------------------------------
[ERROR] COMPILATION ERROR : 
[INFO] -------------------------------------------------------------
[ERROR] \hudson\hudson-slave\workspace\dir-apacheds-jdk16-win\trunk\core-avl\src\main\java\org\apache\directory\server\core\avltree\AvlTreeMapNoDupsWrapperCursor.java:[23,52]
cannot find symbol
symbol  : class AbstractTupleCursor
location: package org.apache.directory.shared.ldap.model.cursor
[ERROR] \hudson\hudson-slave\workspace\dir-apacheds-jdk16-win\trunk\core-avl\src\main\java\org\apache\directory\server\core\avltree\AvlTreeMapNoDupsWrapperCursor.java:[35,57]
cannot find symbol
symbol: class AbstractTupleCursor
public class AvlTreeMapNoDupsWrapperCursor<K, V> extends AbstractTupleCursor<K, V>
[ERROR] \hudson\hudson-slave\workspace\dir-apacheds-jdk16-win\trunk\core-avl\src\main\java\org\apache\directory\server\core\avltree\AvlTreeMapNoDupsWrapperCursor.java:[35,76]
a generic class may not extend java.lang.Throwable
[ERROR] \hudson\hudson-slave\workspace\dir-apacheds-jdk16-win\trunk\core-avl\src\main\java\org\apache\directory\server\core\avltree\AvlSingletonOrOrderedSetCursor.java:[25,52]
cannot find symbol
symbol  : class AbstractTupleCursor
location: package org.apache.directory.shared.ldap.model.cursor
[ERROR] \hudson\hudson-slave\workspace\dir-apacheds-jdk16-win\trunk\core-avl\src\main\java\org\apache\directory\server\core\avltree\AvlSingletonOrOrderedSetCursor.java:[35,58]
cannot find symbol
symbol: class AbstractTupleCursor
public class AvlSingletonOrOrderedSetCursor<K, V> extends AbstractTupleCursor<K,
SingletonOrOrderedSet<V>>
[ERROR] \hudson\hudson-slave\workspace\dir-apacheds-jdk16-win\trunk\core-avl\src\main\java\org\apache\directory\server\core\avltree\AvlSingletonOrOrderedSetCursor.java:[35,77]
a generic class may not extend java.lang.Throwable
[ERROR] \hudson\hudson-slave\workspace\dir-apacheds-jdk16-win\trunk\core-avl\src\main\java\org\apache\directory\server\core\avltree\KeyTupleAvlCursor.java:[23,52]
cannot find symbol
symbol  : class AbstractTupleCursor
location: package org.apache.directory.shared.ldap.model.cursor
[ERROR] \hudson\hudson-slave\workspace\dir-apacheds-jdk16-win\trunk\core-avl\src\main\java\org\apache\directory\server\core\avltree\KeyTupleAvlCursor.java:[35,45]
cannot find symbol
symbol: class AbstractTupleCursor
public class KeyTupleAvlCursor<K, V> extends AbstractTupleCursor<K, V>
[ERROR] \hudson\hudson-slave\workspace\dir-apacheds-jdk16-win\trunk\core-avl\src\main\java\org\apache\directory\server\core\avltree\KeyTupleAvlCursor.java:[35,64]
a generic class may not extend java.lang.Throwable
[ERROR] \hudson\hudson-slave\workspace\dir-apacheds-jdk16-win\trunk\core-avl\src\main\java\org\apache\directory\server\core\avltree\AvlSingletonOrOrderedSetCursor.java:[75,8]
cannot find symbol
symbol  : method checkNotClosed(java.lang.String)
location: class org.apache.directory.server.core.avltree.AvlSingletonOrOrderedSetCursor<K,V>
[ERROR] \hudson\hudson-slave\workspace\dir-apacheds-jdk16-win\trunk\core-avl\src\main\java\org\apache\directory\server\core\avltree\AvlSingletonOrOrderedSetCursor.java:[95,8]
cannot find symbol
symbol  : method checkNotClosed(java.lang.String)
location: class org.apache.directory.server.core.avltree.AvlSingletonOrOrderedSetCursor<K,V>
[ERROR] \hudson\hudson-slave\workspace\dir-apacheds-jdk16-win\trunk\core-avl\src\main\java\org\apache\directory\server\core\avltree\AvlSingletonOrOrderedSetCursor.java:[103,8]
cannot find symbol
symbol  : method checkNotClosed(java.lang.String)
location: class org.apache.directory.server.core.avltree.AvlSingletonOrOrderedSetCursor<K,V>
[ERROR] \hudson\hudson-slave\workspace\dir-apacheds-jdk16-win\trunk\core-avl\src\main\java\org\apache\directory\server\core\avltree\AvlSingletonOrOrderedSetCursor.java:[122,8]
cannot find symbol
symbol  : method checkNotClosed(java.lang.String)
location: class org.apache.directory.server.core.avltree.AvlSingletonOrOrderedSetCursor<K,V>
[ERROR] \hudson\hudson-slave\workspace\dir-apacheds-jdk16-win\trunk\core-avl\src\main\java\org\apache\directory\server\core\avltree\AvlSingletonOrOrderedSetCursor.java:[137,8]
cannot find symbol
symbol  : method checkNotClosed(java.lang.String)
location: class org.apache.directory.server.core.avltree.AvlSingletonOrOrderedSetCursor<K,V>
[ERROR] \hudson\hudson-slave\workspace\dir-apacheds-jdk16-win\trunk\core-avl\src\main\java\org\apache\directory\server\core\avltree\AvlSingletonOrOrderedSetCursor.java:[156,8]
cannot find symbol
symbol  : method checkNotClosed(java.lang.String)
location: class org.apache.directory.server.core.avltree.AvlSingletonOrOrderedSetCursor<K,V>
[ERROR] \hudson\hudson-slave\workspace\dir-apacheds-jdk16-win\trunk\core-avl\src\main\java\org\apache\directory\server\core\avltree\AvlSingletonOrOrderedSetCursor.java:[192,8]
cannot find symbol
symbol  : method checkNotClosed(java.lang.String)
location: class org.apache.directory.server.core.avltree.AvlSingletonOrOrderedSetCursor<K,V>
[ERROR] \hudson\hudson-slave\workspace\dir-apacheds-jdk16-win\trunk\core-avl\src\main\java\org\apache\directory\server\core\avltree\AvlSingletonOrOrderedSetCursor.java:[228,8]
cannot find symbol
symbol  : method checkNotClosed(java.lang.String)
location: class org.apache.directory.server.core.avltree.AvlSingletonOrOrderedSetCursor<K,V>
[ERROR] \hudson\hudson-slave\workspace\dir-apacheds-jdk16-win\trunk\core-avl\src\main\java\org\apache\directory\server\core\avltree\AvlSingletonOrOrderedSetCursor.java:[260,8]
cannot find symbol
symbol  : method checkNotClosed(java.lang.String)
location: class org.apache.directory.server.core.avltree.AvlSingletonOrOrderedSetCursor<K,V>
[ERROR] \hudson\hudson-slave\workspace\dir-apacheds-jdk16-win\trunk\core-avl\src\main\java\org\apache\directory\server\core\avltree\KeyTupleAvlCursor.java:[85,8]
cannot find symbol
symbol  : method checkNotClosed(java.lang.String)
location: class org.apache.directory.server.core.avltree.KeyTupleAvlCursor<K,V>
[ERROR] \hudson\hudson-slave\workspace\dir-apacheds-jdk16-win\trunk\core-avl\src\main\java\org\apache\directory\server\core\avltree\KeyTupleAvlCursor.java:[98,8]
cannot find symbol
symbol  : method checkNotClosed(java.lang.String)
location: class org.apache.directory.server.core.avltree.KeyTupleAvlCursor<K,V>
[ERROR] \hudson\hudson-slave\workspace\dir-apacheds-jdk16-win\trunk\core-avl\src\main\java\org\apache\directory\server\core\avltree\KeyTupleAvlCursor.java:[119,8]
cannot find symbol
symbol  : method checkNotClosed(java.lang.String)
location: class org.apache.directory.server.core.avltree.KeyTupleAvlCursor<K,V>
[ERROR] \hudson\hudson-slave\workspace\dir-apacheds-jdk16-win\trunk\core-avl\src\main\java\org\apache\directory\server\core\avltree\KeyTupleAvlCursor.java:[127,8]
cannot find symbol
symbol  : method checkNotClosed(java.lang.String)
location: class org.apache.directory.server.core.avltree.KeyTupleAvlCursor<K,V>
[ERROR] \hudson\hudson-slave\workspace\dir-apacheds-jdk16-win\trunk\core-avl\src\main\java\org\apache\directory\server\core\avltree\KeyTupleAvlCursor.java:[135,8]
cannot find symbol
symbol  : method checkNotClosed(java.lang.String)
location: class org.apache.directory.server.core.avltree.KeyTupleAvlCursor<K,V>
[ERROR] \hudson\hudson-slave\workspace\dir-apacheds-jdk16-win\trunk\core-avl\src\main\java\org\apache\directory\server\core\avltree\KeyTupleAvlCursor.java:[143,8]
cannot find symbol
symbol  : method checkNotClosed(java.lang.String)
location: class org.apache.directory.server.core.avltree.KeyTupleAvlCursor<K,V>
[ERROR] \hudson\hudson-slave\workspace\dir-apacheds-jdk16-win\trunk\core-avl\src\main\java\org\apache\directory\server\core\avltree\KeyTupleAvlCursor.java:[165,8]
cannot find symbol
symbol  : method checkNotClosed(java.lang.String)
location: class org.apache.directory.server.core.avltree.KeyTupleAvlCursor<K,V>
[ERROR] \hudson\hudson-slave\workspace\dir-apacheds-jdk16-win\trunk\core-avl\src\main\java\org\apache\directory\server\core\avltree\KeyTupleAvlCursor.java:[182,8]
cannot find symbol
symbol  : method checkNotClosed(java.lang.String)
location: class org.apache.directory.server.core.avltree.KeyTupleAvlCursor<K,V>
[ERROR] \hudson\hudson-slave\workspace\dir-apacheds-jdk16-win\trunk\core-avl\src\main\java\org\apache\directory\server\core\avltree\KeyTupleAvlCursor.java:[199,8]
cannot find symbol
symbol  : method checkNotClosed(java.lang.String)
location: class org.apache.directory.server.core.avltree.KeyTupleAvlCursor<K,V>
[INFO] 27 errors 
[INFO] -------------------------------------------------------------
[JENKINS] Archiving disabled - not archiving F:\hudson\hudson-slave\workspace\dir-apacheds-jdk16-win\trunk\core-avl\pom.xml
[INFO] ------------------------------------------------------------------------
[INFO] Reactor Summary:
[INFO] 
[INFO] ApacheDS .......................................... SUCCESS [11.624s]
[INFO] ApacheDS I18n ..................................... SUCCESS [5.441s]
[INFO] ApacheDS Core Constants ........................... SUCCESS [1.713s]
[INFO] ApacheDS Core API ................................. SUCCESS [22.726s]
[INFO] ApacheDS Core Shared .............................. SUCCESS [7.602s]
[INFO] ApacheDS Interceptors ............................. SUCCESS [0.091s]
[INFO] ApacheDS AdministrativePoint Interceptor .......... SUCCESS [2.392s]
[INFO] ApacheDS Authentication Interceptor ............... SUCCESS [13.592s]
[INFO] ApacheDS Authorization Interceptor ................ SUCCESS [26.251s]
[INFO] ApacheDS ChangeLog Interceptor .................... SUCCESS [21.274s]
[INFO] ApacheDS Collective Attribute Interceptor ......... SUCCESS [1.750s]
[INFO] ApacheDS Event Interceptor ........................ SUCCESS [1.679s]
[INFO] ApacheDS Exception Interceptor .................... SUCCESS [6.055s]
[INFO] ApacheDS Journal Interceptor ...................... SUCCESS [2.397s]
[INFO] ApacheDS Normalization Interceptor ................ SUCCESS [12.438s]
[INFO] ApacheDS Operational Attribute Interceptor ........ SUCCESS [2.911s]
[INFO] ApacheDS Referral Interceptor ..................... SUCCESS [2.477s]
[INFO] ApacheDS Schema Interceptor ....................... SUCCESS [25.552s]
[INFO] ApacheDS Subtree Interceptor ...................... SUCCESS [21.997s]
[INFO] ApacheDS Triggers Interceptor ..................... SUCCESS [6.740s]
[INFO] ApacheDS Core ..................................... SUCCESS [5.750s]
[INFO] ApacheDS Core AVL ................................. FAILURE [5.371s]
[INFO] ApacheDS Generalized (X) DBM Partition ............ SKIPPED
[INFO] ApacheDS LDIF Partition ........................... SKIPPED
[INFO] ApacheDS JDBM Partition ........................... SKIPPED
[INFO] ApacheDS Core Annotations ......................... SKIPPED
[INFO] ApacheDS Core JNDI ................................ SKIPPED
[INFO] ApacheDS Protocol Shared .......................... SKIPPED
[INFO] ApacheDS Protocol Kerberos Codec .................. SKIPPED
[INFO] ApacheDS Interceptors for Kerberos ................ SKIPPED
[INFO] ApacheDS Protocol Dhcp ............................ SKIPPED
[INFO] ApacheDS Protocol Dns ............................. SKIPPED
[INFO] ApacheDS Protocol Kerberos ........................ SKIPPED
[INFO] ApacheDS Protocol Ldap ............................ SKIPPED
[INFO] ApacheDS Protocol Ntp ............................. SKIPPED
[INFO] Apacheds Server Annotations ....................... SKIPPED
[INFO] ApacheDS Server Config ............................ SKIPPED
[INFO] ApacheDS Server JNDI .............................. SKIPPED
[INFO] ApacheDS Server Replication Service ............... SKIPPED
[INFO] ApacheDS Test Framework ........................... SKIPPED
[INFO] ApacheDS Generalized (X) DBM Tools ................ SKIPPED
[INFO] ApacheDS All ...................................... SKIPPED
[INFO] ApacheDS Logger Interceptor ....................... SKIPPED
[INFO] ApacheDS Password Hashing Interceptor ............. SKIPPED
[INFO] ApacheDS Core Integration ......................... SKIPPED
[INFO] ApacheDS Server Integration ....................... SKIPPED
[INFO] ApacheDS DirectoryService-WebApp bridge ........... SKIPPED
[INFO] ApacheDS Jetty HTTP Server Integration ............ SKIPPED
[INFO] ApacheDS Service Builder .......................... SKIPPED
[INFO] ApacheDS Protocol Kerberos Test ................... SKIPPED
[INFO] Apache Directory LDAP Client API test ............. SKIPPED
[INFO] ApacheDS Service .................................. SKIPPED
[INFO] ApacheDS Wrapper .................................. SKIPPED
[INFO] ApacheDS Installers Maven Plugin .................. SKIPPED
[INFO] ApacheDS Installers ............................... SKIPPED
[INFO] ------------------------------------------------------------------------
[INFO] BUILD FAILURE
[INFO] ------------------------------------------------------------------------
[INFO] Total time: 3:52.102s
[INFO] Finished at: Sun Apr 01 05:06:21 BST 2012
[INFO] Final Memory: 169M/291M
[INFO] ------------------------------------------------------------------------
mavenExecutionResult exceptions not empty
message : Failed to execute goal org.apache.maven.plugins:maven-compiler-plugin:2.3.2:compile
(default-compile) on project apacheds-core-avl: Compilation failure
cause : Compilation failure
Stack trace : 
org.apache.maven.lifecycle.LifecycleExecutionException: Failed to execute goal org.apache.maven.plugins:maven-compiler-plugin:2.3.2:compile
(default-compile) on project apacheds-core-avl: Compilation failure
	at org.apache.maven.lifecycle.internal.MojoExecutor.execute(MojoExecutor.java:213)
	at org.apache.maven.lifecycle.internal.MojoExecutor.execute(MojoExecutor.java:153)
	at org.apache.maven.lifecycle.internal.MojoExecutor.execute(MojoExecutor.java:145)
	at org.apache.maven.lifecycle.internal.LifecycleModuleBuilder.buildProject(LifecycleModuleBuilder.java:84)
	at org.apache.maven.lifecycle.internal.LifecycleModuleBuilder.buildProject(LifecycleModuleBuilder.java:59)
	at org.apache.maven.lifecycle.internal.LifecycleStarter.singleThreadedBuild(LifecycleStarter.java:183)
	at org.apache.maven.lifecycle.internal.LifecycleStarter.execute(LifecycleStarter.java:161)
	at org.apache.maven.DefaultMaven.doExecute(DefaultMaven.java:319)
	at org.apache.maven.DefaultMaven.execute(DefaultMaven.java:156)
	at org.jvnet.hudson.maven3.launcher.Maven3Launcher.main(Maven3Launcher.java:79)
	at sun.reflect.NativeMethodAccessorImpl.invoke0(Native Method)
	at sun.reflect.NativeMethodAccessorImpl.invoke(NativeMethodAccessorImpl.java:39)
	at sun.reflect.DelegatingMethodAccessorImpl.invoke(DelegatingMethodAccessorImpl.java:25)
	at java.lang.reflect.Method.invoke(Method.java:597)
	at org.codehaus.plexus.classworlds.launcher.Launcher.launchStandard(Launcher.java:329)
	at org.codehaus.plexus.classworlds.launcher.Launcher.launch(Launcher.java:239)
	at org.jvnet.hudson.maven3.agent.Maven3Main.launch(Maven3Main.java:158)
	at hudson.maven.Maven3Builder.call(Maven3Builder.java:104)
	at hudson.maven.Maven3Builder.call(Maven3Builder.java:70)
	at hudson.remoting.UserRequest.perform(UserRequest.java:118)
	at hudson.remoting.UserRequest.perform(UserRequest.java:48)
	at hudson.remoting.Request$2.run(Request.java:287)
	at hudson.remoting.InterceptingExecutorService$1.call(InterceptingExecutorService.java:72)
	at java.util.concurrent.FutureTask$Sync.innerRun(FutureTask.java:303)
	at java.util.concurrent.FutureTask.run(FutureTask.java:138)
	at java.util.concurrent.ThreadPoolExecutor$Worker.runTask(ThreadPoolExecutor.java:886)
	at java.util.concurrent.ThreadPoolExecutor$Worker.run(ThreadPoolExecutor.java:908)
	at java.lang.Thread.run(Thread.java:662)
Caused by: org.apache.maven.plugin.CompilationFailureException: Compilation failure
	at org.apache.maven.plugin.AbstractCompilerMojo.execute(AbstractCompilerMojo.java:656)
	at org.apache.maven.plugin.CompilerMojo.execute(CompilerMojo.java:128)
	at org.apache.maven.plugin.DefaultBuildPluginManager.executeMojo(DefaultBuildPluginManager.java:107)
	at org.apache.maven.lifecycle.internal.MojoExecutor.execute(MojoExecutor.java:209)
	... 27 more
Sending e-mails to: notifications@directory.apache.org
channel stopped

Mime
View raw message