directory-notifications mailing list archives

Site index · List index
Message view « Date » · « Thread »
Top « Date » · « Thread »
From Apache Jenkins Server <jenk...@builds.apache.org>
Subject Build failed in Jenkins: dir-shared-jdk15-ubuntu-deploy #579
Date Tue, 13 Mar 2012 03:05:26 GMT
See <https://builds.apache.org/job/dir-shared-jdk15-ubuntu-deploy/579/changes>

Changes:

[elecharny] o Created a MutableAttributeType class
o Removed the modifiers from the AttributeType class
o Modified the impacted code in the api and Studio

[elecharny] o Created a MutableObjectClass class
o Removed the modifiers from the ObjectClass class
o Modified the impacted code in the api and Studio

[elecharny] Removed the LdapConnectionFactory class

[elecharny] o Added a AbstractLdapConnection class to gather the common properties and method
for the LdapConnection implementations

------------------------------------------
Started by timer
Building remotely on ubuntu2 in workspace <https://builds.apache.org/job/dir-shared-jdk15-ubuntu-deploy/ws/>
Updating https://svn.apache.org/repos/asf/directory/shared/trunk
U         ldap/model/src/test/java/org/apache/directory/shared/ldap/model/schema/parsers/OpenLdapSchemaParserTest.java
U         ldap/model/src/test/java/org/apache/directory/shared/ldap/model/schema/registries/AttributeTypeRegistryTest.java
U         ldap/model/src/test/java/org/apache/directory/shared/ldap/model/schema/SchemaUtilsTest.java
U         ldap/model/src/test/java/org/apache/directory/shared/ldap/model/entry/BinaryValueTest.java
U         ldap/model/src/test/java/org/apache/directory/shared/ldap/model/entry/EntryUtils.java
U         ldap/model/src/test/java/org/apache/directory/shared/ldap/model/entry/BinaryValueAttributeTypeTest.java
U         ldap/model/src/main/antlr/schema.g
U         ldap/model/src/main/java/org/apache/directory/shared/ldap/model/schema/parsers/OpenLdapSchemaParser.java
U         ldap/model/src/main/java/org/apache/directory/shared/ldap/model/schema/parsers/ObjectClassDescriptionSchemaParser.java
A         ldap/model/src/main/java/org/apache/directory/shared/ldap/model/schema/MutableObjectClass.java
U         ldap/model/src/main/java/org/apache/directory/shared/ldap/model/schema/registries/helper/AttributeTypeHelper.java
U         ldap/model/src/main/java/org/apache/directory/shared/ldap/model/schema/registries/Registries.java
U         ldap/model/src/main/java/org/apache/directory/shared/ldap/model/schema/AttributeType.java
A         ldap/model/src/main/java/org/apache/directory/shared/ldap/model/schema/MutableAttributeType.java
U         ldap/model/src/main/java/org/apache/directory/shared/ldap/model/schema/ObjectClass.java
U         ldap/schema/data/src/test/java/org/apache/directory/shared/ldap/schemaloader/SchemaManagerDelTest.java
U         ldap/schema/data/src/test/java/org/apache/directory/shared/ldap/schemaloader/SchemaManagerAddTest.java
U         ldap/schema/data/src/main/java/org/apache/directory/shared/ldap/schemaloader/SchemaEntityFactory.java
D         ldap/client/api/src/main/java/org/apache/directory/ldap/client/api/LdapConnectionFactory.java
U         ldap/client/api/src/main/java/org/apache/directory/ldap/client/api/LdapNetworkConnection.java
A         ldap/client/api/src/main/java/org/apache/directory/ldap/client/api/AbstractLdapConnection.java
U         integ/src/test/java/org/apache/directory/shared/ldap/entry/TestEntryUtils.java
At revision 1299959
Parsing POMs
ERROR: Failed to parse POMs
hudson.util.IOException2: remote file operation failed: <https://builds.apache.org/job/dir-shared-jdk15-ubuntu-deploy/ws/trunk>
at hudson.remoting.Channel@74a7ef0e:ubuntu2
	at hudson.FilePath.act(FilePath.java:784)
	at hudson.FilePath.act(FilePath.java:770)
	at hudson.maven.MavenModuleSetBuild$RunnerImpl.parsePoms(MavenModuleSetBuild.java:914)
	at hudson.maven.MavenModuleSetBuild$RunnerImpl.doRun(MavenModuleSetBuild.java:658)
	at hudson.model.AbstractBuild$AbstractRunner.run(AbstractBuild.java:473)
	at hudson.model.Run.run(Run.java:1408)
	at hudson.maven.MavenModuleSetBuild.run(MavenModuleSetBuild.java:481)
	at hudson.model.ResourceController.execute(ResourceController.java:88)
	at hudson.model.Executor.run(Executor.java:238)
Caused by: hudson.remoting.ProxyException: hudson.maven.MavenModuleSetBuild$MavenExecutionException:
org.apache.maven.project.ProjectBuildingException: Some problems were encountered while processing
the POMs:
[FATAL] Non-resolvable parent POM: Could not find artifact org.apache.directory.project:project:pom:27-SNAPSHOT
and 'parent.relativePath' points at wrong local POM @ line 22, column 11

	at hudson.maven.MavenModuleSetBuild$PomParser.invoke(MavenModuleSetBuild.java:1274)
	at hudson.maven.MavenModuleSetBuild$PomParser.invoke(MavenModuleSetBuild.java:1049)
	at hudson.FilePath$FileCallableWrapper.call(FilePath.java:2099)
	at hudson.remoting.UserRequest.perform(UserRequest.java:118)
	at hudson.remoting.UserRequest.perform(UserRequest.java:48)
	at hudson.remoting.Request$2.run(Request.java:287)
	at hudson.remoting.InterceptingExecutorService$1.call(InterceptingExecutorService.java:72)
	at java.util.concurrent.FutureTask$Sync.innerRun(FutureTask.java:334)
	at java.util.concurrent.FutureTask.run(FutureTask.java:166)
	at java.util.concurrent.ThreadPoolExecutor.runWorker(ThreadPoolExecutor.java:1110)
	at java.util.concurrent.ThreadPoolExecutor$Worker.run(ThreadPoolExecutor.java:603)
	at java.lang.Thread.run(Thread.java:636)
Caused by: hudson.remoting.ProxyException: org.apache.maven.project.ProjectBuildingException:
Some problems were encountered while processing the POMs:
[FATAL] Non-resolvable parent POM: Could not find artifact org.apache.directory.project:project:pom:27-SNAPSHOT
and 'parent.relativePath' points at wrong local POM @ line 22, column 11

	at org.apache.maven.project.DefaultProjectBuilder.build(DefaultProjectBuilder.java:363)
	at hudson.maven.MavenEmbedder.buildProjects(MavenEmbedder.java:361)
	at hudson.maven.MavenEmbedder.readProjects(MavenEmbedder.java:331)
	at hudson.maven.MavenModuleSetBuild$PomParser.invoke(MavenModuleSetBuild.java:1224)
	... 11 more


Mime
View raw message