directory-notifications mailing list archives

Site index · List index
Message view « Date » · « Thread »
Top « Date » · « Thread »
From Apache Jenkins Server <jenk...@builds.apache.org>
Subject Build failed in Jenkins: dir-shared-jdk16-win #530
Date Thu, 01 Mar 2012 22:02:53 GMT
See <https://builds.apache.org/job/dir-shared-jdk16-win/530/changes>

Changes:

[elecharny] Referenced the latest parent's SNAPSHOT

[elecharny] Removed the setRegistries() method from SchemaObjects

[elecharny] Removed the useless registerOid() method from SchemaObject

[elecharny] Moved the removeFromRegistries() method from the SchemaObject sub-classes, to
some helper classes.

[elecharny] Moved the addToRegistries() method out of all the SchemaObject classes to helper
classes.

[elecharny] reverted back to project-26 version instead of a SNAPSHOT

[elecharny] bumped up the dependencies to the latest version

[elecharny] removed a useless plugin version, it will be pulled from project/pom.xml

------------------------------------------
Started by timer
Building remotely on windows1 in workspace <https://builds.apache.org/job/dir-shared-jdk16-win/ws/>
Updating https://svn.apache.org/repos/asf/directory/shared/trunk
U         ldap\model\src\main\java\org\apache\directory\shared\ldap\model\schema\AbstractSchemaObject.java
U         ldap\model\src\main\java\org\apache\directory\shared\ldap\model\schema\LoadableSchemaObject.java
U         ldap\model\src\main\java\org\apache\directory\shared\ldap\model\schema\MatchingRule.java
U         ldap\model\src\main\java\org\apache\directory\shared\ldap\model\schema\MatchingRuleUse.java
A         ldap\model\src\main\java\org\apache\directory\shared\ldap\model\schema\registries\helper\MatchingRuleUseHelper.java
A         ldap\model\src\main\java\org\apache\directory\shared\ldap\model\schema\registries\helper\MatchingRuleHelper.java
U         ldap\model\src\main\java\org\apache\directory\shared\ldap\model\schema\registries\helper\DitContentRuleHelper.java
A         ldap\model\src\main\java\org\apache\directory\shared\ldap\model\schema\registries\helper\NameFormHelper.java
U         ldap\model\src\main\java\org\apache\directory\shared\ldap\model\schema\registries\helper\AttributeTypeHelper.java
A         ldap\model\src\main\java\org\apache\directory\shared\ldap\model\schema\registries\helper\LdapSyntaxHelper.java
A         ldap\model\src\main\java\org\apache\directory\shared\ldap\model\schema\registries\helper\DitStructureRuleHelper.java
U         ldap\model\src\main\java\org\apache\directory\shared\ldap\model\schema\registries\helper\ObjectClassHelper.java
U         ldap\model\src\main\java\org\apache\directory\shared\ldap\model\schema\registries\Registries.java
U         ldap\model\src\main\java\org\apache\directory\shared\ldap\model\schema\NameForm.java
U         ldap\model\src\main\java\org\apache\directory\shared\ldap\model\schema\AttributeType.java
U         ldap\model\src\main\java\org\apache\directory\shared\ldap\model\schema\LdapSyntax.java
U         ldap\model\src\main\java\org\apache\directory\shared\ldap\model\schema\SchemaObject.java
U         ldap\model\src\main\java\org\apache\directory\shared\ldap\model\schema\ObjectClass.java
U         ldap\schema\data\pom.xml
U         pom.xml
At revision 1295933
Parsing POMs
ERROR: Failed to parse POMs
hudson.util.IOException2: remote file operation failed: <https://builds.apache.org/job/dir-shared-jdk16-win/ws/trunk>
at hudson.remoting.Channel@5770c61c:windows1
	at hudson.FilePath.act(FilePath.java:784)
	at hudson.FilePath.act(FilePath.java:770)
	at hudson.maven.MavenModuleSetBuild$RunnerImpl.parsePoms(MavenModuleSetBuild.java:914)
	at hudson.maven.MavenModuleSetBuild$RunnerImpl.doRun(MavenModuleSetBuild.java:658)
	at hudson.model.AbstractBuild$AbstractRunner.run(AbstractBuild.java:473)
	at hudson.model.Run.run(Run.java:1408)
	at hudson.maven.MavenModuleSetBuild.run(MavenModuleSetBuild.java:481)
	at hudson.model.ResourceController.execute(ResourceController.java:88)
	at hudson.model.Executor.run(Executor.java:238)
Caused by: hudson.remoting.ProxyException: hudson.maven.MavenModuleSetBuild$MavenExecutionException:
org.apache.maven.project.ProjectBuildingException: Some problems were encountered while processing
the POMs:
[FATAL] Non-resolvable parent POM: Could not find artifact org.apache.directory.project:project:pom:27-SNAPSHOT
and 'parent.relativePath' points at no local POM @ line 22, column 11

	at hudson.maven.MavenModuleSetBuild$PomParser.invoke(MavenModuleSetBuild.java:1274)
	at hudson.maven.MavenModuleSetBuild$PomParser.invoke(MavenModuleSetBuild.java:1049)
	at hudson.FilePath$FileCallableWrapper.call(FilePath.java:2099)
	at hudson.remoting.UserRequest.perform(UserRequest.java:118)
	at hudson.remoting.UserRequest.perform(UserRequest.java:48)
	at hudson.remoting.Request$2.run(Request.java:287)
	at hudson.remoting.InterceptingExecutorService$1.call(InterceptingExecutorService.java:72)
	at java.util.concurrent.FutureTask$Sync.innerRun(Unknown Source)
	at java.util.concurrent.FutureTask.run(Unknown Source)
	at java.util.concurrent.ThreadPoolExecutor.runWorker(Unknown Source)
	at java.util.concurrent.ThreadPoolExecutor$Worker.run(Unknown Source)
	at hudson.remoting.Engine$1$1.run(Engine.java:60)
	at java.lang.Thread.run(Unknown Source)
Caused by: hudson.remoting.ProxyException: org.apache.maven.project.ProjectBuildingException:
Some problems were encountered while processing the POMs:
[FATAL] Non-resolvable parent POM: Could not find artifact org.apache.directory.project:project:pom:27-SNAPSHOT
and 'parent.relativePath' points at no local POM @ line 22, column 11

	at org.apache.maven.project.DefaultProjectBuilder.build(DefaultProjectBuilder.java:363)
	at hudson.maven.MavenEmbedder.buildProjects(MavenEmbedder.java:361)
	at hudson.maven.MavenEmbedder.readProjects(MavenEmbedder.java:331)
	at hudson.maven.MavenModuleSetBuild$PomParser.invoke(MavenModuleSetBuild.java:1224)
	... 12 more


Mime
View raw message