directory-notifications mailing list archives

Site index · List index
Message view « Date » · « Thread »
Top « Date » · « Thread »
From Apache Jenkins Server <jenk...@builds.apache.org>
Subject Build failed in Jenkins: dir-studio-jdk16-win #507
Date Sat, 03 Mar 2012 04:16:59 GMT
See <https://builds.apache.org/job/dir-studio-jdk16-win/507/changes>

Changes:

[pamarcelot] Reverted previous fixes on MANIFEST.MF generation.
Specific rollback to version 2.3.4 of the org.apache.felix:maven-bundle-plugin (moving to
the newer version makes the RCP application fail with an emtpy perspective.

------------------------------------------
Started by timer
Building remotely on windows1 in workspace <https://builds.apache.org/job/dir-studio-jdk16-win/ws/>
Updating https://svn.apache.org/repos/asf/directory/studio/trunk
U         plugins\rcp\pom.xml
U         plugins\rcp.fullscreen\pom.xml
U         plugins\ldapservers\pom.xml
U         plugins\valueeditors\pom.xml
U         plugins\schemaeditor\pom.xml
U         plugins\ldapbrowser.core\pom.xml
U         pom.xml
U         libraries\org.dom4j.dom4j\pom.xml
U         libraries\org.slf4j.api\pom.xml
U         libraries\org.apache.directory.server.xdbm.partition\pom.xml
U         libraries\org.apache.mina.core\pom.xml
U         libraries\org.apache.directory.server.core.constants\pom.xml
U         libraries\org.apache.httpcomponents.httpcore\pom.xml
U         libraries\org.apache.directory.server.config\pom.xml
U         libraries\org.antlr.antlr\pom.xml
U         libraries\org.apache.commons.io\pom.xml
U         libraries\org.apache.directory.server.core.avl\pom.xml
U         libraries\org.bouncycastle.bcprov.jdk15\pom.xml
U         libraries\org.slf4j.log4j12\pom.xml
U         libraries\org.apache.commons.pool\pom.xml
U         libraries\org.apache.commons.codec\pom.xml
U         libraries\org.apache.directory.server.i18n\pom.xml
U         libraries\org.apache.commons.collections\pom.xml
U         libraries\org.apache.commons.lang\pom.xml
U         libraries\net.sf.ehcache.core\pom.xml
U         libraries\org.apache.directory.server.ldif.partition\pom.xml
U         libraries\org.apache.directory.server.core\pom.xml
U         libraries\org.apache.commons.logging\pom.xml
U         libraries\org.apache.httpcomponents.httpclient\pom.xml
U         libraries\org.xpp3.xpp3\pom.xml
U         libraries\org.apache.logging.log4j\pom.xml
U         libraries\org.apache.directory.server.core.api\pom.xml
At revision 1296573
Parsing POMs
Failed to transfer Could not find metadata org.apache.directory.project:project:27-SNAPSHOT/maven-metadata.xml
in studio.repository (file://${project.basedir})
Failed to transfer Could not find artifact org.apache.directory.project:project:pom:27-SNAPSHOT
in studio.repository (file://${project.basedir})
ERROR: Failed to parse POMs
hudson.util.IOException2: remote file operation failed: <https://builds.apache.org/job/dir-studio-jdk16-win/ws/trunk>
at hudson.remoting.Channel@6382167:windows1
	at hudson.FilePath.act(FilePath.java:784)
	at hudson.FilePath.act(FilePath.java:770)
	at hudson.maven.MavenModuleSetBuild$RunnerImpl.parsePoms(MavenModuleSetBuild.java:914)
	at hudson.maven.MavenModuleSetBuild$RunnerImpl.doRun(MavenModuleSetBuild.java:658)
	at hudson.model.AbstractBuild$AbstractRunner.run(AbstractBuild.java:473)
	at hudson.model.Run.run(Run.java:1408)
	at hudson.maven.MavenModuleSetBuild.run(MavenModuleSetBuild.java:481)
	at hudson.model.ResourceController.execute(ResourceController.java:88)
	at hudson.model.Executor.run(Executor.java:238)
Caused by: hudson.remoting.ProxyException: hudson.maven.MavenModuleSetBuild$MavenExecutionException:
org.apache.maven.project.ProjectBuildingException: Some problems were encountered while processing
the POMs:
[FATAL] Non-resolvable parent POM: Could not find artifact org.apache.directory.project:project:pom:27-SNAPSHOT
in studio.repository (file://${project.basedir}) and 'parent.relativePath' points at no local
POM @ line 23, column 11

	at hudson.maven.MavenModuleSetBuild$PomParser.invoke(MavenModuleSetBuild.java:1274)
	at hudson.maven.MavenModuleSetBuild$PomParser.invoke(MavenModuleSetBuild.java:1049)
	at hudson.FilePath$FileCallableWrapper.call(FilePath.java:2099)
	at hudson.remoting.UserRequest.perform(UserRequest.java:118)
	at hudson.remoting.UserRequest.perform(UserRequest.java:48)
	at hudson.remoting.Request$2.run(Request.java:287)
	at hudson.remoting.InterceptingExecutorService$1.call(InterceptingExecutorService.java:72)
	at java.util.concurrent.FutureTask$Sync.innerRun(Unknown Source)
	at java.util.concurrent.FutureTask.run(Unknown Source)
	at java.util.concurrent.ThreadPoolExecutor.runWorker(Unknown Source)
	at java.util.concurrent.ThreadPoolExecutor$Worker.run(Unknown Source)
	at hudson.remoting.Engine$1$1.run(Engine.java:60)
	at java.lang.Thread.run(Unknown Source)
Caused by: hudson.remoting.ProxyException: org.apache.maven.project.ProjectBuildingException:
Some problems were encountered while processing the POMs:
[FATAL] Non-resolvable parent POM: Could not find artifact org.apache.directory.project:project:pom:27-SNAPSHOT
in studio.repository (file://${project.basedir}) and 'parent.relativePath' points at no local
POM @ line 23, column 11

	at org.apache.maven.project.DefaultProjectBuilder.build(DefaultProjectBuilder.java:363)
	at hudson.maven.MavenEmbedder.buildProjects(MavenEmbedder.java:361)
	at hudson.maven.MavenEmbedder.readProjects(MavenEmbedder.java:331)
	at hudson.maven.MavenModuleSetBuild$PomParser.invoke(MavenModuleSetBuild.java:1224)
	... 12 more


Mime
View raw message