directory-notifications mailing list archives

Site index · List index
Message view « Date » · « Thread »
Top « Date » · « Thread »
From Apache Jenkins Server <jenk...@builds.apache.org>
Subject Build failed in Jenkins: dir-shared-jdk15-ubuntu-deploy #587
Date Wed, 21 Mar 2012 03:02:34 GMT
See <https://builds.apache.org/job/dir-shared-jdk15-ubuntu-deploy/587/changes>

Changes:

[elecharny] o Get rid of the getNormalized() method in JdbmIndex and AvlIndex : the values
are already normalized anyway
o Fixed a couple of places where the values weren't normalized before being injected into
the index
o Some entries formating
o Fixed the parser that was not creating an Assertion Value depending on the AttributeType
syntax

------------------------------------------
Started by timer
Building remotely on ubuntu2 in workspace <https://builds.apache.org/job/dir-shared-jdk15-ubuntu-deploy/ws/>
Updating https://svn.apache.org/repos/asf/directory/shared/trunk
U         ldap/model/src/main/java/org/apache/directory/shared/ldap/model/filter/FilterParser.java
U         ldap/schema/data/src/test/java/org/apache/directory/shared/ldap/schemaloader/SchemaManagerLoadWithDepsTest.java
U         ldap/schema/data/src/test/java/org/apache/directory/shared/ldap/schemaloader/SchemaManagerEnableDisableLoadTest.java
U         ldap/schema/data/src/test/java/org/apache/directory/shared/ldap/schemaloader/SchemaManagerLoadTest.java
D         ldap/schema/data/src/main/resources/schema/ou=schema/cn=apache/ou=attributetypes/m-oid=1.3.6.1.4.1.18060.0.4.1.2.1.ldif
D         ldap/schema/data/src/main/resources/schema/ou=schema/cn=apache/ou=attributetypes/m-oid=1.3.6.1.4.1.18060.0.4.1.2.2.ldif
U         integ/src/test/java/org/apache/directory/shared/ldap/model/name/DnTest.java
At revision 1303258
Parsing POMs
ERROR: Failed to parse POMs
hudson.util.IOException2: remote file operation failed: <https://builds.apache.org/job/dir-shared-jdk15-ubuntu-deploy/ws/trunk>
at hudson.remoting.Channel@7ce0f00e:ubuntu2
	at hudson.FilePath.act(FilePath.java:784)
	at hudson.FilePath.act(FilePath.java:770)
	at hudson.maven.MavenModuleSetBuild$RunnerImpl.parsePoms(MavenModuleSetBuild.java:914)
	at hudson.maven.MavenModuleSetBuild$RunnerImpl.doRun(MavenModuleSetBuild.java:658)
	at hudson.model.AbstractBuild$AbstractRunner.run(AbstractBuild.java:473)
	at hudson.model.Run.run(Run.java:1410)
	at hudson.maven.MavenModuleSetBuild.run(MavenModuleSetBuild.java:481)
	at hudson.model.ResourceController.execute(ResourceController.java:88)
	at hudson.model.Executor.run(Executor.java:238)
Caused by: hudson.remoting.ProxyException: hudson.maven.MavenModuleSetBuild$MavenExecutionException:
org.apache.maven.project.ProjectBuildingException: Some problems were encountered while processing
the POMs:
[FATAL] Non-resolvable parent POM: Could not find artifact org.apache.directory.project:project:pom:27-SNAPSHOT
and 'parent.relativePath' points at wrong local POM @ line 22, column 11

	at hudson.maven.MavenModuleSetBuild$PomParser.invoke(MavenModuleSetBuild.java:1274)
	at hudson.maven.MavenModuleSetBuild$PomParser.invoke(MavenModuleSetBuild.java:1049)
	at hudson.FilePath$FileCallableWrapper.call(FilePath.java:2099)
	at hudson.remoting.UserRequest.perform(UserRequest.java:118)
	at hudson.remoting.UserRequest.perform(UserRequest.java:48)
	at hudson.remoting.Request$2.run(Request.java:287)
	at hudson.remoting.InterceptingExecutorService$1.call(InterceptingExecutorService.java:72)
	at java.util.concurrent.FutureTask$Sync.innerRun(FutureTask.java:334)
	at java.util.concurrent.FutureTask.run(FutureTask.java:166)
	at java.util.concurrent.ThreadPoolExecutor.runWorker(ThreadPoolExecutor.java:1110)
	at java.util.concurrent.ThreadPoolExecutor$Worker.run(ThreadPoolExecutor.java:603)
	at java.lang.Thread.run(Thread.java:636)
Caused by: hudson.remoting.ProxyException: org.apache.maven.project.ProjectBuildingException:
Some problems were encountered while processing the POMs:
[FATAL] Non-resolvable parent POM: Could not find artifact org.apache.directory.project:project:pom:27-SNAPSHOT
and 'parent.relativePath' points at wrong local POM @ line 22, column 11

	at org.apache.maven.project.DefaultProjectBuilder.build(DefaultProjectBuilder.java:363)
	at hudson.maven.MavenEmbedder.buildProjects(MavenEmbedder.java:361)
	at hudson.maven.MavenEmbedder.readProjects(MavenEmbedder.java:331)
	at hudson.maven.MavenModuleSetBuild$PomParser.invoke(MavenModuleSetBuild.java:1224)
	... 11 more

Mime
View raw message