directory-notifications mailing list archives

Site index · List index
Message view « Date » · « Thread »
Top « Date » · « Thread »
From Apache Jenkins Server <jenk...@builds.apache.org>
Subject Build failed in Jenkins: dir-apacheds-jdk16-ubuntu-deploy #548
Date Mon, 27 Feb 2012 17:19:09 GMT
See <https://builds.apache.org/job/dir-apacheds-jdk16-ubuntu-deploy/548/changes>

Changes:

[pamarcelot] Moved to next snapshot versions.

[elecharny] o Fixed the compareTo() method in the ParentIdAndRdn class, to allow comparison
of RDN with more than one Ava
o Added a ParentIdAndRdn test class

------------------------------------------
[...truncated 2089 lines...]
Downloading: https://repository.apache.org/content/repositories/snapshots/org/apache/directory/server/apacheds-core/maven-metadata.xml
Downloaded: https://repository.apache.org/content/repositories/snapshots/org/apache/directory/server/apacheds-core/maven-metadata.xml
(406 B at 1.7 KB/sec)
Uploading: https://repository.apache.org/content/repositories/snapshots/org/apache/directory/server/apacheds-core/2.0.0-M7-SNAPSHOT/maven-metadata.xml
Uploaded: https://repository.apache.org/content/repositories/snapshots/org/apache/directory/server/apacheds-core/2.0.0-M7-SNAPSHOT/maven-metadata.xml
(799 B at 3.5 KB/sec)
Uploading: https://repository.apache.org/content/repositories/snapshots/org/apache/directory/server/apacheds-core/maven-metadata.xml
Uploaded: https://repository.apache.org/content/repositories/snapshots/org/apache/directory/server/apacheds-core/maven-metadata.xml
(449 B at 2.6 KB/sec)
Uploading: https://repository.apache.org/content/repositories/snapshots/org/apache/directory/server/apacheds-core/2.0.0-M7-SNAPSHOT/apacheds-core-2.0.0-M7-20120227.171846-1-sources.jar
Uploaded: https://repository.apache.org/content/repositories/snapshots/org/apache/directory/server/apacheds-core/2.0.0-M7-SNAPSHOT/apacheds-core-2.0.0-M7-20120227.171846-1-sources.jar
(38 KB at 153.3 KB/sec)
Uploading: https://repository.apache.org/content/repositories/snapshots/org/apache/directory/server/apacheds-core/2.0.0-M7-SNAPSHOT/maven-metadata.xml
Uploaded: https://repository.apache.org/content/repositories/snapshots/org/apache/directory/server/apacheds-core/2.0.0-M7-SNAPSHOT/maven-metadata.xml
(1016 B at 7.5 KB/sec)
[INFO] [INFO] Remote OBR update disabled (enable with -DremoteOBR)

[INFO] --- maven-bundle-plugin:2.3.4:deploy (default-deploy) @ apacheds-core ---
[JENKINS] Archiving <https://builds.apache.org/job/dir-apacheds-jdk16-ubuntu-deploy/ws/trunk/core/pom.xml>
to /home/hudson/hudson/jobs/dir-apacheds-jdk16-ubuntu-deploy/modules/org.apache.directory.server$apacheds-core/builds/2012-02-27_17-13-32/archive/org.apache.directory.server/apacheds-core/2.0.0-M7-SNAPSHOT/apacheds-core-2.0.0-M7-SNAPSHOT.pom
[JENKINS] Archiving <https://builds.apache.org/job/dir-apacheds-jdk16-ubuntu-deploy/ws/trunk/core/target/apacheds-core-2.0.0-M7-SNAPSHOT.jar>
to /home/hudson/hudson/jobs/dir-apacheds-jdk16-ubuntu-deploy/modules/org.apache.directory.server$apacheds-core/builds/2012-02-27_17-13-32/archive/org.apache.directory.server/apacheds-core/2.0.0-M7-20120227.171846-1/apacheds-core-2.0.0-M7-20120227.171846-1.jar
[JENKINS] Archiving <https://builds.apache.org/job/dir-apacheds-jdk16-ubuntu-deploy/ws/trunk/core/target/apacheds-core-2.0.0-M7-SNAPSHOT-sources.jar>
to /home/hudson/hudson/jobs/dir-apacheds-jdk16-ubuntu-deploy/modules/org.apache.directory.server$apacheds-core/builds/2012-02-27_17-13-32/archive/org.apache.directory.server/apacheds-core/2.0.0-M7-20120227.171846-1/apacheds-core-2.0.0-M7-20120227.171846-1-sources.jar
[INFO] [INFO] Deleting <https://builds.apache.org/job/dir-apacheds-jdk16-ubuntu-deploy/ws/trunk/core-avl/target>
                                                                        
[INFO] ------------------------------------------------------------------------
[INFO] Building ApacheDS Core AVL 2.0.0-M7-SNAPSHOT
[INFO] ------------------------------------------------------------------------
[INFO] 
[INFO] --- maven-clean-plugin:2.4.1:clean (default-clean) @ apacheds-core-avl ---
[INFO] 
[INFO] --- maven-remote-resources-plugin:1.2.1:process (default) @ apacheds-core-avl ---
[debug] execute contextualize
[INFO] [INFO] Using 'UTF-8' encoding to copy filtered resources.
[INFO] skip non existing resourceDirectory <https://builds.apache.org/job/dir-apacheds-jdk16-ubuntu-deploy/ws/trunk/core-avl/src/main/resources>
[INFO] Copying 3 resources

[INFO] --- maven-resources-plugin:2.5:resources (default-resources) @ apacheds-core-avl ---
[INFO] 
[INFO] --- maven-compiler-plugin:2.3.2:compile (default-compile) @ apacheds-core-avl ---
[INFO] Compiling 22 source files to <https://builds.apache.org/job/dir-apacheds-jdk16-ubuntu-deploy/ws/trunk/core-avl/target/classes>
[debug] execute contextualize
[INFO] [INFO] Using 'UTF-8' encoding to copy filtered resources.
[INFO] Copying 1 resource
[INFO] Copying 3 resources

[INFO] --- maven-resources-plugin:2.5:testResources (default-testResources) @ apacheds-core-avl
---
[INFO] [INFO] Compiling 11 source files to <https://builds.apache.org/job/dir-apacheds-jdk16-ubuntu-deploy/ws/trunk/core-avl/target/test-classes>

[INFO] --- maven-compiler-plugin:2.3.2:testCompile (default-testCompile) @ apacheds-core-avl
---
[INFO] [INFO] Surefire report directory: <https://builds.apache.org/job/dir-apacheds-jdk16-ubuntu-deploy/ws/trunk/core-avl/target/surefire-reports>

-------------------------------------------------------
 T E S T S
-------------------------------------------------------

[INFO] --- maven-surefire-plugin:2.10:test (default-test) @ apacheds-core-avl ---
Running org.apache.directory.server.core.avltree.AvlTreeMapTest
Tests run: 12, Failures: 0, Errors: 0, Skipped: 0, Time elapsed: 0.12 sec
Running org.apache.directory.server.core.avltree.AvlTreeTest
Tests run: 22, Failures: 0, Errors: 0, Skipped: 0, Time elapsed: 0.017 sec
Running org.apache.directory.server.core.avltree.avl.AvlTreePerfTest
total time for inserting 1000000 items into the RBTree-->559.0 msec
total time for inserting 1000000 items into the AVLTree-->371.0 msec
Tests run: 8, Failures: 0, Errors: 0, Skipped: 6, Time elapsed: 0.943 sec
Running org.apache.directory.server.core.avltree.AvlTreeCursorTest
Tests run: 3, Failures: 0, Errors: 0, Skipped: 0, Time elapsed: 0.006 sec
Running org.apache.directory.server.core.avltree.AvlTreeMapNoDupsCursorTest
Tests run: 6, Failures: 0, Errors: 0, Skipped: 0, Time elapsed: 0.005 sec
Running org.apache.directory.server.core.avltree.ArrayTreeTest
Tests run: 70, Failures: 0, Errors: 0, Skipped: 0, Time elapsed: 0.042 sec
Running org.apache.directory.server.core.avltree.AvlTreePerfTest
total time for inserting 1000000 items into the RBTree-->488.0 msec
total time for inserting 1000000 items into the AVLTree-->3887.0 msec
Tests run: 10, Failures: 0, Errors: 0, Skipped: 8, Time elapsed: 4.38 sec
Running org.apache.directory.server.core.avltree.DefaultMarshallerTest
Tests run: 2, Failures: 0, Errors: 0, Skipped: 0, Time elapsed: 0.014 sec
Running org.apache.directory.server.core.avltree.ArrayTreeCursorTest
Tests run: 3, Failures: 0, Errors: 0, Skipped: 0, Time elapsed: 0.003 sec
Running org.apache.directory.server.core.avltree.AvlTreeMarshallerTest
Tests run: 12, Failures: 0, Errors: 0, Skipped: 0, Time elapsed: 0.064 sec

Results :

Tests run: 148, Failures: 0, Errors: 0, Skipped: 14

[JENKINS] Recording test results
[INFO] 
[INFO] --- maven-bundle-plugin:2.3.4:bundle (default-bundle) @ apacheds-core-avl ---
[INFO] 
[INFO] --- maven-site-plugin:3.0:attach-descriptor (attach-descriptor) @ apacheds-core-avl
---
[INFO] [INFO] Checking legal files in: apacheds-core-avl-2.0.0-M7-SNAPSHOT.jar

[INFO] --- tools-maven-plugin:1.4:verify-legal-files (verify-legal-files) @ apacheds-core-avl
---
[INFO] Installing <https://builds.apache.org/job/dir-apacheds-jdk16-ubuntu-deploy/ws/trunk/core-avl/target/apacheds-core-avl-2.0.0-M7-SNAPSHOT.jar>
to /home/hudson/hudson-slave/maven-repositories/1/org/apache/directory/server/apacheds-core-avl/2.0.0-M7-SNAPSHOT/apacheds-core-avl-2.0.0-M7-SNAPSHOT.jar
[INFO] [INFO] Installing <https://builds.apache.org/job/dir-apacheds-jdk16-ubuntu-deploy/ws/trunk/core-avl/pom.xml>
to /home/hudson/hudson-slave/maven-repositories/1/org/apache/directory/server/apacheds-core-avl/2.0.0-M7-SNAPSHOT/apacheds-core-avl-2.0.0-M7-SNAPSHOT.pom

[INFO] --- maven-install-plugin:2.3.1:install (default-install) @ apacheds-core-avl ---
[INFO] [INFO] Installing org/apache/directory/server/apacheds-core-avl/2.0.0-M7-SNAPSHOT/apacheds-core-avl-2.0.0-M7-SNAPSHOT.jar
[INFO] Writing OBR metadata

[INFO] --- maven-bundle-plugin:2.3.4:install (default-install) @ apacheds-core-avl ---
[INFO] Downloading: https://repository.apache.org/content/repositories/snapshots/org/apache/directory/server/apacheds-core-avl/2.0.0-M7-SNAPSHOT/maven-metadata.xml

[INFO] --- maven-deploy-plugin:2.7:deploy (default-deploy) @ apacheds-core-avl ---
Uploading: https://repository.apache.org/content/repositories/snapshots/org/apache/directory/server/apacheds-core-avl/2.0.0-M7-SNAPSHOT/apacheds-core-avl-2.0.0-M7-20120227.171901-1.jar
Uploaded: https://repository.apache.org/content/repositories/snapshots/org/apache/directory/server/apacheds-core-avl/2.0.0-M7-SNAPSHOT/apacheds-core-avl-2.0.0-M7-20120227.171901-1.jar
(58 KB at 158.1 KB/sec)
Uploading: https://repository.apache.org/content/repositories/snapshots/org/apache/directory/server/apacheds-core-avl/2.0.0-M7-SNAPSHOT/apacheds-core-avl-2.0.0-M7-20120227.171901-1.pom
Uploaded: https://repository.apache.org/content/repositories/snapshots/org/apache/directory/server/apacheds-core-avl/2.0.0-M7-SNAPSHOT/apacheds-core-avl-2.0.0-M7-20120227.171901-1.pom
(4 KB at 21.2 KB/sec)
Downloading: https://repository.apache.org/content/repositories/snapshots/org/apache/directory/server/apacheds-core-avl/maven-metadata.xml
Downloaded: https://repository.apache.org/content/repositories/snapshots/org/apache/directory/server/apacheds-core-avl/maven-metadata.xml
(410 B at 1.9 KB/sec)
Uploading: https://repository.apache.org/content/repositories/snapshots/org/apache/directory/server/apacheds-core-avl/2.0.0-M7-SNAPSHOT/maven-metadata.xml
Uploaded: https://repository.apache.org/content/repositories/snapshots/org/apache/directory/server/apacheds-core-avl/2.0.0-M7-SNAPSHOT/maven-metadata.xml
(803 B at 3.8 KB/sec)
Uploading: https://repository.apache.org/content/repositories/snapshots/org/apache/directory/server/apacheds-core-avl/maven-metadata.xml
Uploaded: https://repository.apache.org/content/repositories/snapshots/org/apache/directory/server/apacheds-core-avl/maven-metadata.xml
(453 B at 2.9 KB/sec)
[INFO] [INFO] Remote OBR update disabled (enable with -DremoteOBR)

[INFO] --- maven-bundle-plugin:2.3.4:deploy (default-deploy) @ apacheds-core-avl ---
[JENKINS] Archiving <https://builds.apache.org/job/dir-apacheds-jdk16-ubuntu-deploy/ws/trunk/core-avl/pom.xml>
to /home/hudson/hudson/jobs/dir-apacheds-jdk16-ubuntu-deploy/modules/org.apache.directory.server$apacheds-core-avl/builds/2012-02-27_17-13-32/archive/org.apache.directory.server/apacheds-core-avl/2.0.0-M7-SNAPSHOT/apacheds-core-avl-2.0.0-M7-SNAPSHOT.pom
[JENKINS] Archiving <https://builds.apache.org/job/dir-apacheds-jdk16-ubuntu-deploy/ws/trunk/core-avl/target/apacheds-core-avl-2.0.0-M7-SNAPSHOT.jar>
to /home/hudson/hudson/jobs/dir-apacheds-jdk16-ubuntu-deploy/modules/org.apache.directory.server$apacheds-core-avl/builds/2012-02-27_17-13-32/archive/org.apache.directory.server/apacheds-core-avl/2.0.0-M7-20120227.171901-1/apacheds-core-avl-2.0.0-M7-20120227.171901-1.jar
[INFO]                                                                         
[INFO] ------------------------------------------------------------------------
[INFO] Building ApacheDS Generalized (X) DBM Partition 2.0.0-M7-SNAPSHOT
[INFO] ------------------------------------------------------------------------
[INFO] Deleting <https://builds.apache.org/job/dir-apacheds-jdk16-ubuntu-deploy/ws/trunk/xdbm-partition/target>
[INFO] 
[INFO] --- maven-clean-plugin:2.4.1:clean (default-clean) @ apacheds-xdbm-partition ---
[INFO] 
[INFO] --- maven-remote-resources-plugin:1.2.1:process (default) @ apacheds-xdbm-partition
---
[debug] execute contextualize
[INFO] [INFO] Using 'UTF-8' encoding to copy filtered resources.
[INFO] skip non existing resourceDirectory <https://builds.apache.org/job/dir-apacheds-jdk16-ubuntu-deploy/ws/trunk/xdbm-partition/src/main/resources>
[INFO] Copying 3 resources

[INFO] --- maven-resources-plugin:2.5:resources (default-resources) @ apacheds-xdbm-partition
---
[INFO] 
[INFO] --- maven-compiler-plugin:2.3.2:compile (default-compile) @ apacheds-xdbm-partition
---
[INFO] Compiling 82 source files to <https://builds.apache.org/job/dir-apacheds-jdk16-ubuntu-deploy/ws/trunk/xdbm-partition/target/classes>
[INFO] -------------------------------------------------------------
[ERROR] COMPILATION ERROR : 
[INFO] -------------------------------------------------------------
[ERROR] <https://builds.apache.org/job/dir-apacheds-jdk16-ubuntu-deploy/ws/trunk/xdbm-partition/src/main/java/org/apache/directory/server/xdbm/ParentIdAndRdn.java>:[212,29]
cannot find symbol
symbol  : method compareTo(org.apache.directory.shared.ldap.model.name.Ava)
location: class org.apache.directory.shared.ldap.model.name.Ava
[ERROR] <https://builds.apache.org/job/dir-apacheds-jdk16-ubuntu-deploy/ws/trunk/xdbm-partition/src/main/java/org/apache/directory/server/xdbm/ParentIdAndRdn.java>:[252,37]
cannot find symbol
symbol  : method compareTo(org.apache.directory.shared.ldap.model.name.Ava)
location: class org.apache.directory.shared.ldap.model.name.Ava
[INFO] 2 errors 
[INFO] -------------------------------------------------------------
[JENKINS] Archiving <https://builds.apache.org/job/dir-apacheds-jdk16-ubuntu-deploy/ws/trunk/xdbm-partition/pom.xml>
to /home/hudson/hudson/jobs/dir-apacheds-jdk16-ubuntu-deploy/modules/org.apache.directory.server$apacheds-xdbm-partition/builds/2012-02-27_17-13-32/archive/org.apache.directory.server/apacheds-xdbm-partition/2.0.0-M7-SNAPSHOT/apacheds-xdbm-partition-2.0.0-M7-SNAPSHOT.pom
[INFO] ------------------------------------------------------------------------
[INFO] Reactor Summary:
[INFO] 
[INFO] ApacheDS .......................................... SUCCESS [33.798s]
[INFO] ApacheDS I18n ..................................... SUCCESS [8.687s]
[INFO] ApacheDS Core Constants ........................... SUCCESS [4.949s]
[INFO] ApacheDS Core API ................................. SUCCESS [38.879s]
[INFO] ApacheDS Core Shared .............................. SUCCESS [7.170s]
[INFO] ApacheDS Interceptors ............................. SUCCESS [1.803s]
[INFO] ApacheDS AdministrativePoint Interceptor .......... SUCCESS [6.680s]
[INFO] ApacheDS Authentication Interceptor ............... SUCCESS [14.696s]
[INFO] ApacheDS Authorization Interceptor ................ SUCCESS [28.328s]
[INFO] ApacheDS ChangeLog Interceptor .................... SUCCESS [12.535s]
[INFO] ApacheDS Collective Attribute Interceptor ......... SUCCESS [5.539s]
[INFO] ApacheDS Event Interceptor ........................ SUCCESS [6.110s]
[INFO] ApacheDS Exception Interceptor .................... SUCCESS [5.257s]
[INFO] ApacheDS Journal Interceptor ...................... SUCCESS [4.999s]
[INFO] ApacheDS Normalization Interceptor ................ SUCCESS [11.823s]
[INFO] ApacheDS Operational Attribute Interceptor ........ SUCCESS [4.732s]
[INFO] ApacheDS Referral Interceptor ..................... SUCCESS [4.769s]
[INFO] ApacheDS Schema Interceptor ....................... SUCCESS [24.395s]
[INFO] ApacheDS Subtree Interceptor ...................... SUCCESS [23.842s]
[INFO] ApacheDS Triggers Interceptor ..................... SUCCESS [6.537s]
[INFO] ApacheDS Core ..................................... SUCCESS [9.650s]
[INFO] ApacheDS Core AVL ................................. SUCCESS [12.724s]
[INFO] ApacheDS Generalized (X) DBM Partition ............ FAILURE [2.954s]
[INFO] ApacheDS LDIF Partition ........................... SKIPPED
[INFO] ApacheDS JDBM Partition ........................... SKIPPED
[INFO] ApacheDS Core Annotations ......................... SKIPPED
[INFO] ApacheDS Core JNDI ................................ SKIPPED
[INFO] ApacheDS Protocol Shared .......................... SKIPPED
[INFO] ApacheDS Protocol Kerberos Codec .................. SKIPPED
[INFO] ApacheDS Interceptors for Kerberos ................ SKIPPED
[INFO] ApacheDS Protocol Dhcp ............................ SKIPPED
[INFO] ApacheDS Protocol Dns ............................. SKIPPED
[INFO] ApacheDS Protocol Kerberos ........................ SKIPPED
[INFO] ApacheDS Protocol Ldap ............................ SKIPPED
[INFO] ApacheDS Protocol Ntp ............................. SKIPPED
[INFO] Apacheds Server Annotations ....................... SKIPPED
[INFO] ApacheDS Server Config ............................ SKIPPED
[INFO] ApacheDS Server JNDI .............................. SKIPPED
[INFO] ApacheDS Server Replication Service ............... SKIPPED
[INFO] ApacheDS Test Framework ........................... SKIPPED
[INFO] ApacheDS Generalized (X) DBM Tools ................ SKIPPED
[INFO] ApacheDS All ...................................... SKIPPED
[INFO] ApacheDS Logger Interceptor ....................... SKIPPED
[INFO] ApacheDS Password Hashing Interceptor ............. SKIPPED
[INFO] ApacheDS Core Integration ......................... SKIPPED
[INFO] ApacheDS Server Integration ....................... SKIPPED
[INFO] ApacheDS DirectoryService-WebApp bridge ........... SKIPPED
[INFO] ApacheDS Jetty HTTP Server Integration ............ SKIPPED
[INFO] ApacheDS Service Builder .......................... SKIPPED
[INFO] ApacheDS Protocol Kerberos Test ................... SKIPPED
[INFO] Apache Directory LDAP Client API test ............. SKIPPED
[INFO] ApacheDS Service .................................. SKIPPED
[INFO] ApacheDS Wrapper .................................. SKIPPED
[INFO] ApacheDS Installers Maven Plugin .................. SKIPPED
[INFO] ApacheDS Installers ............................... SKIPPED
[INFO] ------------------------------------------------------------------------
[INFO] BUILD FAILURE
[INFO] ------------------------------------------------------------------------
[INFO] Total time: 5:15.978s
[INFO] Finished at: Mon Feb 27 17:19:07 UTC 2012
[INFO] Final Memory: 145M/247M
[INFO] ------------------------------------------------------------------------
Waiting for Jenkins to finish collecting data
mavenExecutionResult exceptions not empty
message : Failed to execute goal org.apache.maven.plugins:maven-compiler-plugin:2.3.2:compile
(default-compile) on project apacheds-xdbm-partition: Compilation failure
cause : Compilation failure
Stack trace : 
org.apache.maven.lifecycle.LifecycleExecutionException: Failed to execute goal org.apache.maven.plugins:maven-compiler-plugin:2.3.2:compile
(default-compile) on project apacheds-xdbm-partition: Compilation failure
	at org.apache.maven.lifecycle.internal.MojoExecutor.execute(MojoExecutor.java:213)
	at org.apache.maven.lifecycle.internal.MojoExecutor.execute(MojoExecutor.java:153)
	at org.apache.maven.lifecycle.internal.MojoExecutor.execute(MojoExecutor.java:145)
	at org.apache.maven.lifecycle.internal.LifecycleModuleBuilder.buildProject(LifecycleModuleBuilder.java:84)
	at org.apache.maven.lifecycle.internal.LifecycleModuleBuilder.buildProject(LifecycleModuleBuilder.java:59)
	at org.apache.maven.lifecycle.internal.LifecycleStarter.singleThreadedBuild(LifecycleStarter.java:183)
	at org.apache.maven.lifecycle.internal.LifecycleStarter.execute(LifecycleStarter.java:161)
	at org.apache.maven.DefaultMaven.doExecute(DefaultMaven.java:319)
	at org.apache.maven.DefaultMaven.execute(DefaultMaven.java:156)
	at org.jvnet.hudson.maven3.launcher.Maven3Launcher.main(Maven3Launcher.java:79)
	at sun.reflect.NativeMethodAccessorImpl.invoke0(Native Method)
	at sun.reflect.NativeMethodAccessorImpl.invoke(NativeMethodAccessorImpl.java:39)
	at sun.reflect.DelegatingMethodAccessorImpl.invoke(DelegatingMethodAccessorImpl.java:25)
	at java.lang.reflect.Method.invoke(Method.java:597)
	at org.codehaus.plexus.classworlds.launcher.Launcher.launchStandard(Launcher.java:329)
	at org.codehaus.plexus.classworlds.launcher.Launcher.launch(Launcher.java:239)
	at org.jvnet.hudson.maven3.agent.Maven3Main.launch(Maven3Main.java:158)
	at hudson.maven.Maven3Builder.call(Maven3Builder.java:104)
	at hudson.maven.Maven3Builder.call(Maven3Builder.java:70)
	at hudson.remoting.UserRequest.perform(UserRequest.java:118)
	at hudson.remoting.UserRequest.perform(UserRequest.java:48)
	at hudson.remoting.Request$2.run(Request.java:287)
	at hudson.remoting.InterceptingExecutorService$1.call(InterceptingExecutorService.java:72)
	at java.util.concurrent.FutureTask$Sync.innerRun(FutureTask.java:303)
	at java.util.concurrent.FutureTask.run(FutureTask.java:138)
	at java.util.concurrent.ThreadPoolExecutor$Worker.runTask(ThreadPoolExecutor.java:886)
	at java.util.concurrent.ThreadPoolExecutor$Worker.run(ThreadPoolExecutor.java:908)
	at java.lang.Thread.run(Thread.java:619)
Caused by: org.apache.maven.plugin.CompilationFailureException: Compilation failure
	at org.apache.maven.plugin.AbstractCompilerMojo.execute(AbstractCompilerMojo.java:656)
	at org.apache.maven.plugin.CompilerMojo.execute(CompilerMojo.java:128)
	at org.apache.maven.plugin.DefaultBuildPluginManager.executeMojo(DefaultBuildPluginManager.java:101)
	at org.apache.maven.lifecycle.internal.MojoExecutor.execute(MojoExecutor.java:209)
	... 27 more
channel stopped


Mime
View raw message