directory-notifications mailing list archives

Site index · List index
Message view « Date » · « Thread »
Top « Date » · « Thread »
From Apache Jenkins Server <jenk...@builds.apache.org>
Subject Build failed in Jenkins: dir-apacheds-jdk16-win #55
Date Tue, 28 Feb 2012 14:52:41 GMT
See <https://builds.apache.org/job/dir-apacheds-jdk16-win/55/>

------------------------------------------
[...truncated 1942 lines...]
[JENKINS] Archiving disabled - not archiving F:\hudson\hudson-slave\workspace\dir-apacheds-jdk16-win\trunk\core-annotations\pom.xml
[INFO] ------------------------------------------------------------------------
[INFO] Reactor Summary:
[INFO] 
[INFO] ApacheDS .......................................... SUCCESS [3.674s]
[INFO] ApacheDS I18n ..................................... SUCCESS [2.257s]
[INFO] ApacheDS Core Constants ........................... SUCCESS [1.383s]
[INFO] ApacheDS Core API ................................. SUCCESS [13.933s]
[INFO] ApacheDS Core Shared .............................. SUCCESS [3.280s]
[INFO] ApacheDS Interceptors ............................. SUCCESS [0.055s]
[INFO] ApacheDS AdministrativePoint Interceptor .......... SUCCESS [1.821s]
[INFO] ApacheDS Authentication Interceptor ............... SUCCESS [7.692s]
[INFO] ApacheDS Authorization Interceptor ................ SUCCESS [19.361s]
[INFO] ApacheDS ChangeLog Interceptor .................... SUCCESS [6.699s]
[INFO] ApacheDS Collective Attribute Interceptor ......... SUCCESS [1.839s]
[INFO] ApacheDS Event Interceptor ........................ SUCCESS [1.547s]
[INFO] ApacheDS Exception Interceptor .................... SUCCESS [1.839s]
[INFO] ApacheDS Journal Interceptor ...................... SUCCESS [1.378s]
[INFO] ApacheDS Normalization Interceptor ................ SUCCESS [6.690s]
[INFO] ApacheDS Operational Attribute Interceptor ........ SUCCESS [1.874s]
[INFO] ApacheDS Referral Interceptor ..................... SUCCESS [1.260s]
[INFO] ApacheDS Schema Interceptor ....................... SUCCESS [17.882s]
[INFO] ApacheDS Subtree Interceptor ...................... SUCCESS [17.124s]
[INFO] ApacheDS Triggers Interceptor ..................... SUCCESS [1.794s]
[INFO] ApacheDS Core ..................................... SUCCESS [5.596s]
[INFO] ApacheDS Core AVL ................................. SUCCESS [10.259s]
[INFO] ApacheDS Generalized (X) DBM Partition ............ SUCCESS [16.350s]
[INFO] ApacheDS LDIF Partition ........................... SUCCESS [12.853s]
[INFO] ApacheDS JDBM Partition ........................... SUCCESS [19.662s]
[INFO] ApacheDS Core Annotations ......................... FAILURE [0.459s]
[INFO] ApacheDS Core JNDI ................................ SKIPPED
[INFO] ApacheDS Protocol Shared .......................... SKIPPED
[INFO] ApacheDS Protocol Kerberos Codec .................. SKIPPED
[INFO] ApacheDS Interceptors for Kerberos ................ SKIPPED
[INFO] ApacheDS Protocol Dhcp ............................ SKIPPED
[INFO] ApacheDS Protocol Dns ............................. SKIPPED
[INFO] ApacheDS Protocol Kerberos ........................ SKIPPED
[INFO] ApacheDS Protocol Ldap ............................ SKIPPED
[INFO] ApacheDS Protocol Ntp ............................. SKIPPED
[INFO] Apacheds Server Annotations ....................... SKIPPED
[INFO] ApacheDS Server Config ............................ SKIPPED
[INFO] ApacheDS Server JNDI .............................. SKIPPED
[INFO] ApacheDS Server Replication Service ............... SKIPPED
[INFO] ApacheDS Test Framework ........................... SKIPPED
[INFO] ApacheDS Generalized (X) DBM Tools ................ SKIPPED
[INFO] ApacheDS All ...................................... SKIPPED
[INFO] ApacheDS Logger Interceptor ....................... SKIPPED
[INFO] ApacheDS Password Hashing Interceptor ............. SKIPPED
[INFO] ApacheDS Core Integration ......................... SKIPPED
[INFO] ApacheDS Server Integration ....................... SKIPPED
[INFO] ApacheDS DirectoryService-WebApp bridge ........... SKIPPED
[INFO] ApacheDS Jetty HTTP Server Integration ............ SKIPPED
[INFO] ApacheDS Service Builder .......................... SKIPPED
[INFO] ApacheDS Protocol Kerberos Test ................... SKIPPED
[INFO] Apache Directory LDAP Client API test ............. SKIPPED
[INFO] ApacheDS Service .................................. SKIPPED
[INFO] ApacheDS Wrapper .................................. SKIPPED
[INFO] ApacheDS Installers Maven Plugin .................. SKIPPED
[INFO] ApacheDS Installers ............................... SKIPPED
[INFO] ------------------------------------------------------------------------
[INFO] BUILD FAILURE
[INFO] ------------------------------------------------------------------------
[INFO] Total time: 3:02.691s
[INFO] Finished at: Tue Feb 28 14:52:37 GMT 2012
[INFO] Final Memory: 82M/252M
[INFO] ------------------------------------------------------------------------
mavenExecutionResult exceptions not empty
message : Failed to execute goal org.apache.maven.plugins:maven-remote-resources-plugin:1.2.1:process
(default) on project apacheds-core-annotations: Failed to resolve dependencies for one or
more projects in the reactor. Reason: Missing:
----------
1) org.apache.directory.jdbm:apacheds-jdbm2:bundle:2.0.0-M2-SNAPSHOT

  Try downloading the file manually from the project website.

  Then, install it using the command: 
      mvn install:install-file -DgroupId=org.apache.directory.jdbm -DartifactId=apacheds-jdbm2
-Dversion=2.0.0-M2-SNAPSHOT -Dpackaging=bundle -Dfile=/path/to/file

  Alternatively, if you host your own repository you can deploy the file there: 
      mvn deploy:deploy-file -DgroupId=org.apache.directory.jdbm -DartifactId=apacheds-jdbm2
-Dversion=2.0.0-M2-SNAPSHOT -Dpackaging=bundle -Dfile=/path/to/file -Durl=[url] -DrepositoryId=[id]

  Path to dependency: 
  	1) org.apache.directory.server:apacheds-core-annotations:bundle:2.0.0-M7-SNAPSHOT
  	2) org.apache.directory.server:apacheds-jdbm-partition:jar:2.0.0-M7-SNAPSHOT
  	3) org.apache.directory.jdbm:apacheds-jdbm2:bundle:2.0.0-M2-SNAPSHOT

----------
1 required artifact is missing.

for artifact: 
  org.apache.directory.server:apacheds-core-annotations:bundle:2.0.0-M7-SNAPSHOT

from the specified remote repositories:
  Nexus (http://repository.apache.org/snapshots, releases=false, snapshots=true),
  central (http://repo1.maven.org/maven2, releases=true, snapshots=false)

cause : Failed to resolve dependencies for one or more projects in the reactor. Reason: Missing:
----------
1) org.apache.directory.jdbm:apacheds-jdbm2:bundle:2.0.0-M2-SNAPSHOT

  Try downloading the file manually from the project website.

  Then, install it using the command: 
      mvn install:install-file -DgroupId=org.apache.directory.jdbm -DartifactId=apacheds-jdbm2
-Dversion=2.0.0-M2-SNAPSHOT -Dpackaging=bundle -Dfile=/path/to/file

  Alternatively, if you host your own repository you can deploy the file there: 
      mvn deploy:deploy-file -DgroupId=org.apache.directory.jdbm -DartifactId=apacheds-jdbm2
-Dversion=2.0.0-M2-SNAPSHOT -Dpackaging=bundle -Dfile=/path/to/file -Durl=[url] -DrepositoryId=[id]

  Path to dependency: 
  	1) org.apache.directory.server:apacheds-core-annotations:bundle:2.0.0-M7-SNAPSHOT
  	2) org.apache.directory.server:apacheds-jdbm-partition:jar:2.0.0-M7-SNAPSHOT
  	3) org.apache.directory.jdbm:apacheds-jdbm2:bundle:2.0.0-M2-SNAPSHOT

----------
1 required artifact is missing.

for artifact: 
  org.apache.directory.server:apacheds-core-annotations:bundle:2.0.0-M7-SNAPSHOT

from the specified remote repositories:
  Nexus (http://repository.apache.org/snapshots, releases=false, snapshots=true),
  central (http://repo1.maven.org/maven2, releases=true, snapshots=false)

Stack trace : 
org.apache.maven.lifecycle.LifecycleExecutionException: Failed to execute goal org.apache.maven.plugins:maven-remote-resources-plugin:1.2.1:process
(default) on project apacheds-core-annotations: Failed to resolve dependencies for one or
more projects in the reactor. Reason: Missing:
----------
1) org.apache.directory.jdbm:apacheds-jdbm2:bundle:2.0.0-M2-SNAPSHOT

  Try downloading the file manually from the project website.

  Then, install it using the command: 
      mvn install:install-file -DgroupId=org.apache.directory.jdbm -DartifactId=apacheds-jdbm2
-Dversion=2.0.0-M2-SNAPSHOT -Dpackaging=bundle -Dfile=/path/to/file

  Alternatively, if you host your own repository you can deploy the file there: 
      mvn deploy:deploy-file -DgroupId=org.apache.directory.jdbm -DartifactId=apacheds-jdbm2
-Dversion=2.0.0-M2-SNAPSHOT -Dpackaging=bundle -Dfile=/path/to/file -Durl=[url] -DrepositoryId=[id]

  Path to dependency: 
  	1) org.apache.directory.server:apacheds-core-annotations:bundle:2.0.0-M7-SNAPSHOT
  	2) org.apache.directory.server:apacheds-jdbm-partition:jar:2.0.0-M7-SNAPSHOT
  	3) org.apache.directory.jdbm:apacheds-jdbm2:bundle:2.0.0-M2-SNAPSHOT

----------
1 required artifact is missing.

for artifact: 
  org.apache.directory.server:apacheds-core-annotations:bundle:2.0.0-M7-SNAPSHOT

from the specified remote repositories:
  Nexus (http://repository.apache.org/snapshots, releases=false, snapshots=true),
  central (http://repo1.maven.org/maven2, releases=true, snapshots=false)

	at org.apache.maven.lifecycle.internal.MojoExecutor.execute(MojoExecutor.java:217)
	at org.apache.maven.lifecycle.internal.MojoExecutor.execute(MojoExecutor.java:153)
	at org.apache.maven.lifecycle.internal.MojoExecutor.execute(MojoExecutor.java:145)
	at org.apache.maven.lifecycle.internal.LifecycleModuleBuilder.buildProject(LifecycleModuleBuilder.java:84)
	at org.apache.maven.lifecycle.internal.LifecycleModuleBuilder.buildProject(LifecycleModuleBuilder.java:59)
	at org.apache.maven.lifecycle.internal.LifecycleStarter.singleThreadedBuild(LifecycleStarter.java:183)
	at org.apache.maven.lifecycle.internal.LifecycleStarter.execute(LifecycleStarter.java:161)
	at org.apache.maven.DefaultMaven.doExecute(DefaultMaven.java:319)
	at org.apache.maven.DefaultMaven.execute(DefaultMaven.java:156)
	at org.jvnet.hudson.maven3.launcher.Maven3Launcher.main(Maven3Launcher.java:79)
	at sun.reflect.NativeMethodAccessorImpl.invoke0(Native Method)
	at sun.reflect.NativeMethodAccessorImpl.invoke(NativeMethodAccessorImpl.java:39)
	at sun.reflect.DelegatingMethodAccessorImpl.invoke(DelegatingMethodAccessorImpl.java:25)
	at java.lang.reflect.Method.invoke(Method.java:597)
	at org.codehaus.plexus.classworlds.launcher.Launcher.launchStandard(Launcher.java:329)
	at org.codehaus.plexus.classworlds.launcher.Launcher.launch(Launcher.java:239)
	at org.jvnet.hudson.maven3.agent.Maven3Main.launch(Maven3Main.java:158)
	at hudson.maven.Maven3Builder.call(Maven3Builder.java:104)
	at hudson.maven.Maven3Builder.call(Maven3Builder.java:70)
	at hudson.remoting.UserRequest.perform(UserRequest.java:118)
	at hudson.remoting.UserRequest.perform(UserRequest.java:48)
	at hudson.remoting.Request$2.run(Request.java:287)
	at hudson.remoting.InterceptingExecutorService$1.call(InterceptingExecutorService.java:72)
	at java.util.concurrent.FutureTask$Sync.innerRun(FutureTask.java:303)
	at java.util.concurrent.FutureTask.run(FutureTask.java:138)
	at java.util.concurrent.ThreadPoolExecutor$Worker.runTask(ThreadPoolExecutor.java:886)
	at java.util.concurrent.ThreadPoolExecutor$Worker.run(ThreadPoolExecutor.java:908)
	at java.lang.Thread.run(Thread.java:662)
Caused by: org.apache.maven.plugin.MojoExecutionException: Failed to resolve dependencies
for one or more projects in the reactor. Reason: Missing:
----------
1) org.apache.directory.jdbm:apacheds-jdbm2:bundle:2.0.0-M2-SNAPSHOT

  Try downloading the file manually from the project website.

  Then, install it using the command: 
      mvn install:install-file -DgroupId=org.apache.directory.jdbm -DartifactId=apacheds-jdbm2
-Dversion=2.0.0-M2-SNAPSHOT -Dpackaging=bundle -Dfile=/path/to/file

  Alternatively, if you host your own repository you can deploy the file there: 
      mvn deploy:deploy-file -DgroupId=org.apache.directory.jdbm -DartifactId=apacheds-jdbm2
-Dversion=2.0.0-M2-SNAPSHOT -Dpackaging=bundle -Dfile=/path/to/file -Durl=[url] -DrepositoryId=[id]

  Path to dependency: 
  	1) org.apache.directory.server:apacheds-core-annotations:bundle:2.0.0-M7-SNAPSHOT
  	2) org.apache.directory.server:apacheds-jdbm-partition:jar:2.0.0-M7-SNAPSHOT
  	3) org.apache.directory.jdbm:apacheds-jdbm2:bundle:2.0.0-M2-SNAPSHOT

----------
1 required artifact is missing.

for artifact: 
  org.apache.directory.server:apacheds-core-annotations:bundle:2.0.0-M7-SNAPSHOT

from the specified remote repositories:
  Nexus (http://repository.apache.org/snapshots, releases=false, snapshots=true),
  central (http://repo1.maven.org/maven2, releases=true, snapshots=false)

	at org.apache.maven.plugin.resources.remote.ProcessRemoteResourcesMojo.resolveProjectArtifacts(ProcessRemoteResourcesMojo.java:721)
	at org.apache.maven.plugin.resources.remote.ProcessRemoteResourcesMojo.getProjects(ProcessRemoteResourcesMojo.java:621)
	at org.apache.maven.plugin.resources.remote.ProcessRemoteResourcesMojo.configureVelocityContext(ProcessRemoteResourcesMojo.java:988)
	at org.apache.maven.plugin.resources.remote.ProcessRemoteResourcesMojo.execute(ProcessRemoteResourcesMojo.java:511)
	at org.apache.maven.plugin.DefaultBuildPluginManager.executeMojo(DefaultBuildPluginManager.java:107)
	at org.apache.maven.lifecycle.internal.MojoExecutor.execute(MojoExecutor.java:209)
	... 27 more
Caused by: org.apache.maven.artifact.resolver.MultipleArtifactsNotFoundException: Missing:
----------
1) org.apache.directory.jdbm:apacheds-jdbm2:bundle:2.0.0-M2-SNAPSHOT

  Try downloading the file manually from the project website.

  Then, install it using the command: 
      mvn install:install-file -DgroupId=org.apache.directory.jdbm -DartifactId=apacheds-jdbm2
-Dversion=2.0.0-M2-SNAPSHOT -Dpackaging=bundle -Dfile=/path/to/file

  Alternatively, if you host your own repository you can deploy the file there: 
      mvn deploy:deploy-file -DgroupId=org.apache.directory.jdbm -DartifactId=apacheds-jdbm2
-Dversion=2.0.0-M2-SNAPSHOT -Dpackaging=bundle -Dfile=/path/to/file -Durl=[url] -DrepositoryId=[id]

  Path to dependency: 
  	1) org.apache.directory.server:apacheds-core-annotations:bundle:2.0.0-M7-SNAPSHOT
  	2) org.apache.directory.server:apacheds-jdbm-partition:jar:2.0.0-M7-SNAPSHOT
  	3) org.apache.directory.jdbm:apacheds-jdbm2:bundle:2.0.0-M2-SNAPSHOT

----------
1 required artifact is missing.

for artifact: 
  org.apache.directory.server:apacheds-core-annotations:bundle:2.0.0-M7-SNAPSHOT

from the specified remote repositories:
  Nexus (http://repository.apache.org/snapshots, releases=false, snapshots=true),
  central (http://repo1.maven.org/maven2, releases=true, snapshots=false)

	at org.apache.maven.artifact.resolver.DefaultResolutionErrorHandler.throwErrors(DefaultResolutionErrorHandler.java:71)
	at org.apache.maven.artifact.resolver.DefaultArtifactResolver.resolveWithExceptions(DefaultArtifactResolver.java:342)
	at org.apache.maven.artifact.resolver.DefaultArtifactResolver.resolveTransitively(DefaultArtifactResolver.java:330)
	at org.apache.maven.artifact.resolver.DefaultArtifactResolver.resolveTransitively(DefaultArtifactResolver.java:309)
	at org.apache.maven.artifact.resolver.DefaultArtifactResolver.resolveTransitively(DefaultArtifactResolver.java:287)
	at org.apache.maven.shared.artifact.resolver.DefaultProjectDependenciesResolver.resolve(DefaultProjectDependenciesResolver.java:140)
	at org.apache.maven.shared.artifact.resolver.DefaultProjectDependenciesResolver.resolve(DefaultProjectDependenciesResolver.java:187)
	at org.apache.maven.plugin.resources.remote.ProcessRemoteResourcesMojo.resolveProjectArtifacts(ProcessRemoteResourcesMojo.java:716)
	... 32 more
Sending e-mails to: notifications@directory.apache.org
channel stopped


Mime
View raw message