directory-notifications mailing list archives

Site index · List index
Message view « Date » · « Thread »
Top « Date » · « Thread »
From Apache Jenkins Server <jenk...@builds.apache.org>
Subject Build failed in Jenkins: dir-studio-jdk16-ubuntu-deploy #552
Date Sun, 26 Feb 2012 04:03:27 GMT
See <https://builds.apache.org/job/dir-studio-jdk16-ubuntu-deploy/552/>

------------------------------------------
[...truncated 813 lines...]
Downloaded: file://<https://builds.apache.org/job/dir-studio-jdk16-ubuntu-deploy/ws/trunk/repository/org/eclipse/ui/workbench/texteditor/3.7.0.v20110505-0800/texteditor-3.7.0.v20110505-0800.jar>
(569 KB at 10722.9 KB/sec)
Downloading: file://<https://builds.apache.org/job/dir-studio-jdk16-ubuntu-deploy/ws/trunk/repository/org/eclipse/update/ui/3.2.300.v20100512/ui-3.2.300.v20100512.jar>
Downloaded: file://<https://builds.apache.org/job/dir-studio-jdk16-ubuntu-deploy/ws/trunk/repository/org/eclipse/ui/workbench/compatibility/3.2.100.I20110413-1600/compatibility-3.2.100.I20110413-1600.zip>
(14 KB at 226.0 KB/sec)
Downloading: file://<https://builds.apache.org/job/dir-studio-jdk16-ubuntu-deploy/ws/trunk/repository/org/mortbay/jetty/server/6.1.23.v201012071420/server-6.1.23.v201012071420.jar>
Downloaded: file://<https://builds.apache.org/job/dir-studio-jdk16-ubuntu-deploy/ws/trunk/repository/org/eclipse/update/scheduler/3.2.300.v20100512/scheduler-3.2.300.v20100512.jar>
(32 KB at 1243.8 KB/sec)
Downloading: file://<https://builds.apache.org/job/dir-studio-jdk16-ubuntu-deploy/ws/trunk/repository/org/mortbay/jetty/util/6.1.23.v201012071420/util-6.1.23.v201012071420.jar>
Downloaded: file://<https://builds.apache.org/job/dir-studio-jdk16-ubuntu-deploy/ws/trunk/repository/org/eclipse/update/core/3.2.500.v20110330/core-3.2.500.v20110330.jar>
(582 KB at 9235.8 KB/sec)
Downloading: file://<https://builds.apache.org/job/dir-studio-jdk16-ubuntu-deploy/ws/trunk/repository/org/eclipse/languagepack/BabelLanguagePack-eclipse-de/3.6.0.v20101211043401/BabelLanguagePack-eclipse-de-3.6.0.v20101211043401.zip>
Downloaded: file://<https://builds.apache.org/job/dir-studio-jdk16-ubuntu-deploy/ws/trunk/repository/org/eclipse/update/ui/3.2.300.v20100512/ui-3.2.300.v20100512.jar>
(496 KB at 7988.7 KB/sec)
Downloading: file://<https://builds.apache.org/job/dir-studio-jdk16-ubuntu-deploy/ws/trunk/repository/org/eclipse/languagepack/BabelLanguagePack-eclipse-fr/3.6.0.v20101211043401/BabelLanguagePack-eclipse-fr-3.6.0.v20101211043401.zip>
Downloaded: file://<https://builds.apache.org/job/dir-studio-jdk16-ubuntu-deploy/ws/trunk/repository/org/mortbay/jetty/util/6.1.23.v201012071420/util-6.1.23.v201012071420.jar>
(189 KB at 3852.4 KB/sec)
Downloading: file://<https://builds.apache.org/job/dir-studio-jdk16-ubuntu-deploy/ws/trunk/repository/org/eclipse/swtbot/eclipse/core/2.0.0.433-dev-e35/core-2.0.0.433-dev-e35.jar>
Downloaded: file://<https://builds.apache.org/job/dir-studio-jdk16-ubuntu-deploy/ws/trunk/repository/org/mortbay/jetty/server/6.1.23.v201012071420/server-6.1.23.v201012071420.jar>
(545 KB at 4779.0 KB/sec)
Downloading: file://<https://builds.apache.org/job/dir-studio-jdk16-ubuntu-deploy/ws/trunk/repository/org/eclipse/swtbot/eclipse/finder/2.0.0.433-dev-e35/finder-2.0.0.433-dev-e35.jar>
Downloaded: file://<https://builds.apache.org/job/dir-studio-jdk16-ubuntu-deploy/ws/trunk/repository/org/eclipse/swtbot/eclipse/core/2.0.0.433-dev-e35/core-2.0.0.433-dev-e35.jar>
(20 KB at 348.0 KB/sec)
Downloading: file://<https://builds.apache.org/job/dir-studio-jdk16-ubuntu-deploy/ws/trunk/repository/org/eclipse/swtbot/swt/finder/2.0.0.433-dev-e35/finder-2.0.0.433-dev-e35.jar>
Downloaded: file://<https://builds.apache.org/job/dir-studio-jdk16-ubuntu-deploy/ws/trunk/repository/org/eclipse/languagepack/BabelLanguagePack-eclipse-de/3.6.0.v20101211043401/BabelLanguagePack-eclipse-de-3.6.0.v20101211043401.zip>
(1028 KB at 12227.4 KB/sec)
Downloading: file://<https://builds.apache.org/job/dir-studio-jdk16-ubuntu-deploy/ws/trunk/repository/docbook/docbook-xml/4.5/docbook-xml-4.5.zip>
Downloaded: file://<https://builds.apache.org/job/dir-studio-jdk16-ubuntu-deploy/ws/trunk/repository/org/eclipse/swtbot/eclipse/finder/2.0.0.433-dev-e35/finder-2.0.0.433-dev-e35.jar>
(115 KB at 8202.1 KB/sec)
Downloading: file://<https://builds.apache.org/job/dir-studio-jdk16-ubuntu-deploy/ws/trunk/repository/docbook/docbook-xsl/1.71.1/docbook-xsl-1.71.1.zip>
Downloaded: file://<https://builds.apache.org/job/dir-studio-jdk16-ubuntu-deploy/ws/trunk/repository/org/eclipse/languagepack/BabelLanguagePack-eclipse-fr/3.6.0.v20101211043401/BabelLanguagePack-eclipse-fr-3.6.0.v20101211043401.zip>
(1026 KB at 13854.2 KB/sec)
Downloading: file://<https://builds.apache.org/job/dir-studio-jdk16-ubuntu-deploy/ws/trunk/repository/org/openoffice/odfdom/0.6.16/odfdom-0.6.16.jar>
Downloaded: file://<https://builds.apache.org/job/dir-studio-jdk16-ubuntu-deploy/ws/trunk/repository/org/eclipse/ui/workbench/3.7.0.I20110519-0100/workbench-3.7.0.I20110519-0100.jar>
(4068 KB at 18745.0 KB/sec)
Downloaded: file://<https://builds.apache.org/job/dir-studio-jdk16-ubuntu-deploy/ws/trunk/repository/docbook/docbook-xml/4.5/docbook-xml-4.5.zip>
(97 KB at 4182.1 KB/sec)
Downloaded: file://<https://builds.apache.org/job/dir-studio-jdk16-ubuntu-deploy/ws/trunk/repository/org/eclipse/swtbot/swt/finder/2.0.0.433-dev-e35/finder-2.0.0.433-dev-e35.jar>
(594 KB at 13813.2 KB/sec)
Downloaded: file://<https://builds.apache.org/job/dir-studio-jdk16-ubuntu-deploy/ws/trunk/repository/docbook/docbook-xsl/1.71.1/docbook-xsl-1.71.1.zip>
(2489 KB at 19905.0 KB/sec)
Downloaded: file://<https://builds.apache.org/job/dir-studio-jdk16-ubuntu-deploy/ws/trunk/repository/org/openoffice/odfdom/0.6.16/odfdom-0.6.16.jar>
(2863 KB at 19739.8 KB/sec)
[INFO] 
[INFO] --- tools-maven-plugin:1.4:verify-legal-files (verify-legal-files) @ repository ---
[INFO] [INFO] Installing <https://builds.apache.org/job/dir-studio-jdk16-ubuntu-deploy/ws/trunk/repository/pom.xml>
to /home/jenkins/jenkins-slave/maven-repositories/1/org/apache/directory/studio/repository/2.0.0-SNAPSHOT/repository-2.0.0-SNAPSHOT.pom

[INFO] --- maven-install-plugin:2.3.1:install (default-install) @ repository ---
[INFO] Downloading: https://repository.apache.org/content/repositories/snapshots/org/apache/directory/studio/repository/2.0.0-SNAPSHOT/maven-metadata.xml

[INFO] --- maven-deploy-plugin:2.7:deploy (default-deploy) @ repository ---
Downloaded: https://repository.apache.org/content/repositories/snapshots/org/apache/directory/studio/repository/2.0.0-SNAPSHOT/maven-metadata.xml
(618 B at 1.2 KB/sec)
Uploading: https://repository.apache.org/content/repositories/snapshots/org/apache/directory/studio/repository/2.0.0-SNAPSHOT/repository-2.0.0-20120226.040309-498.pom
Uploaded: https://repository.apache.org/content/repositories/snapshots/org/apache/directory/studio/repository/2.0.0-SNAPSHOT/repository-2.0.0-20120226.040309-498.pom
(23 KB at 35.1 KB/sec)
Downloading: https://repository.apache.org/content/repositories/snapshots/org/apache/directory/studio/repository/maven-metadata.xml
Downloaded: https://repository.apache.org/content/repositories/snapshots/org/apache/directory/studio/repository/maven-metadata.xml
(637 B at 1.5 KB/sec)
Uploading: https://repository.apache.org/content/repositories/snapshots/org/apache/directory/studio/repository/2.0.0-SNAPSHOT/maven-metadata.xml
Uploaded: https://repository.apache.org/content/repositories/snapshots/org/apache/directory/studio/repository/2.0.0-SNAPSHOT/maven-metadata.xml
(618 B at 1.8 KB/sec)
Uploading: https://repository.apache.org/content/repositories/snapshots/org/apache/directory/studio/repository/maven-metadata.xml
Uploaded: https://repository.apache.org/content/repositories/snapshots/org/apache/directory/studio/repository/maven-metadata.xml
(637 B at 4.0 KB/sec)
[JENKINS] Archiving <https://builds.apache.org/job/dir-studio-jdk16-ubuntu-deploy/ws/trunk/repository/pom.xml>
to /home/hudson/hudson/jobs/dir-studio-jdk16-ubuntu-deploy/modules/org.apache.directory.studio$repository/builds/2012-02-26_04-02-21/archive/org.apache.directory.studio/repository/2.0.0-SNAPSHOT/repository-2.0.0-SNAPSHOT.pom
[INFO] [INFO] Deleting <https://builds.apache.org/job/dir-studio-jdk16-ubuntu-deploy/ws/trunk/libraries/target>
                                                                        
[INFO] ------------------------------------------------------------------------
[INFO] Building Apache Directory Studio Libraries Plugins 2.0.0-SNAPSHOT
[INFO] ------------------------------------------------------------------------
[INFO] 
[INFO] --- maven-clean-plugin:2.4.1:clean (default-clean) @ parent-libraries ---
[INFO] 
[INFO] --- maven-remote-resources-plugin:1.2.1:process (default) @ parent-libraries ---
[INFO] 
[INFO] --- tools-maven-plugin:1.4:verify-legal-files (verify-legal-files) @ parent-libraries
---
[INFO] [INFO] Installing <https://builds.apache.org/job/dir-studio-jdk16-ubuntu-deploy/ws/trunk/libraries/pom.xml>
to /home/jenkins/jenkins-slave/maven-repositories/1/org/apache/directory/studio/parent-libraries/2.0.0-SNAPSHOT/parent-libraries-2.0.0-SNAPSHOT.pom

[INFO] --- maven-install-plugin:2.3.1:install (default-install) @ parent-libraries ---
[INFO] Downloading: https://repository.apache.org/content/repositories/snapshots/org/apache/directory/studio/parent-libraries/2.0.0-SNAPSHOT/maven-metadata.xml

[INFO] --- maven-deploy-plugin:2.7:deploy (default-deploy) @ parent-libraries ---
Downloaded: https://repository.apache.org/content/repositories/snapshots/org/apache/directory/studio/parent-libraries/2.0.0-SNAPSHOT/maven-metadata.xml
(620 B at 0.3 KB/sec)
Uploading: https://repository.apache.org/content/repositories/snapshots/org/apache/directory/studio/parent-libraries/2.0.0-SNAPSHOT/parent-libraries-2.0.0-20120226.040314-2.pom
Uploaded: https://repository.apache.org/content/repositories/snapshots/org/apache/directory/studio/parent-libraries/2.0.0-SNAPSHOT/parent-libraries-2.0.0-20120226.040314-2.pom
(4 KB at 13.8 KB/sec)
Downloading: https://repository.apache.org/content/repositories/snapshots/org/apache/directory/studio/parent-libraries/maven-metadata.xml
Downloaded: https://repository.apache.org/content/repositories/snapshots/org/apache/directory/studio/parent-libraries/maven-metadata.xml
(444 B at 0.3 KB/sec)
Uploading: https://repository.apache.org/content/repositories/snapshots/org/apache/directory/studio/parent-libraries/2.0.0-SNAPSHOT/maven-metadata.xml
Uploaded: https://repository.apache.org/content/repositories/snapshots/org/apache/directory/studio/parent-libraries/2.0.0-SNAPSHOT/maven-metadata.xml
(620 B at 0.9 KB/sec)
Uploading: https://repository.apache.org/content/repositories/snapshots/org/apache/directory/studio/parent-libraries/maven-metadata.xml
Uploaded: https://repository.apache.org/content/repositories/snapshots/org/apache/directory/studio/parent-libraries/maven-metadata.xml
(423 B at 1.2 KB/sec)
[JENKINS] Archiving <https://builds.apache.org/job/dir-studio-jdk16-ubuntu-deploy/ws/trunk/libraries/pom.xml>
to /home/hudson/hudson/jobs/dir-studio-jdk16-ubuntu-deploy/modules/org.apache.directory.studio$parent-libraries/builds/2012-02-26_04-02-21/archive/org.apache.directory.studio/parent-libraries/2.0.0-SNAPSHOT/parent-libraries-2.0.0-SNAPSHOT.pom
[INFO] Downloading: http://repo1.maven.org/maven2/org/apache/directory/studio/studio-maven-plugin/1.0.5/studio-maven-plugin-1.0.5.pom
                                                                        
[INFO] ------------------------------------------------------------------------
[INFO] Building SLF4J API Module (for Apache Directory Studio) 2.0.0-SNAPSHOT
[INFO] ------------------------------------------------------------------------
Downloaded: http://repo1.maven.org/maven2/org/apache/directory/studio/studio-maven-plugin/1.0.5/studio-maven-plugin-1.0.5.pom
(10 KB at 26.1 KB/sec)
Downloading: http://repo1.maven.org/maven2/org/apache/directory/studio/studio-maven-plugin/1.0.5/studio-maven-plugin-1.0.5.jar
Downloaded: http://repo1.maven.org/maven2/org/apache/directory/studio/studio-maven-plugin/1.0.5/studio-maven-plugin-1.0.5.jar
(36 KB at 67.9 KB/sec)
[INFO] [INFO] Deleting <https://builds.apache.org/job/dir-studio-jdk16-ubuntu-deploy/ws/trunk/libraries/org.slf4j.api/target>

[INFO] --- maven-clean-plugin:2.4.1:clean (default-clean) @ org.slf4j.api ---
[INFO] 
[INFO] --- maven-remote-resources-plugin:1.2.1:process (default) @ org.slf4j.api ---
[INFO] 
[INFO] --- maven-resources-plugin:2.5:resources (default-resources) @ org.slf4j.api ---
[debug] execute contextualize
[INFO] Using 'UTF-8' encoding to copy filtered resources.
[INFO] skip non existing resourceDirectory <https://builds.apache.org/job/dir-studio-jdk16-ubuntu-deploy/ws/trunk/libraries/org.slf4j.api/src/main/resources>
[INFO] Copying 3 resources
Downloading: file://<https://builds.apache.org/job/dir-studio-jdk16-ubuntu-deploy/ws/trunk/libraries/net.sf.ehcache.core/net/sf/ehcache/ehcache-core/2.4.4/ehcache-core-2.4.4.pom>
Downloading: http://repo1.maven.org/maven2/net/sf/ehcache/ehcache-core/2.4.4/ehcache-core-2.4.4.pom
Downloaded: http://repo1.maven.org/maven2/net/sf/ehcache/ehcache-core/2.4.4/ehcache-core-2.4.4.pom
(36 KB at 112.4 KB/sec)
Downloading: file://<https://builds.apache.org/job/dir-studio-jdk16-ubuntu-deploy/ws/trunk/libraries/net.sf.ehcache.core/net/sf/ehcache/ehcache-parent/2.2/ehcache-parent-2.2.pom>
Downloading: http://repo1.maven.org/maven2/net/sf/ehcache/ehcache-parent/2.2/ehcache-parent-2.2.pom
Downloaded: http://repo1.maven.org/maven2/net/sf/ehcache/ehcache-parent/2.2/ehcache-parent-2.2.pom
(20 KB at 40.5 KB/sec)
Downloading: file://<https://builds.apache.org/job/dir-studio-jdk16-ubuntu-deploy/ws/trunk/libraries/net.sf.ehcache.core/org/apache/directory/studio/org.slf4j.api/2.0.0-SNAPSHOT/maven-metadata.xml>
Downloading: http://repository.apache.org/snapshots/org/apache/directory/studio/org.slf4j.api/2.0.0-SNAPSHOT/maven-metadata.xml
Downloading: file://<https://builds.apache.org/job/dir-studio-jdk16-ubuntu-deploy/ws/trunk/libraries/net.sf.ehcache.core/org/apache/directory/studio/org.slf4j.api/2.0.0-SNAPSHOT/maven-metadata.xml>
Downloading: http://repository.apache.org/snapshots/org/apache/directory/studio/org.slf4j.api/2.0.0-SNAPSHOT/maven-metadata.xml
Downloading: file://<https://builds.apache.org/job/dir-studio-jdk16-ubuntu-deploy/ws/trunk/libraries/net.sf.ehcache.core/net/sf/ehcache/ehcache-core/2.4.4/ehcache-core-2.4.4.jar>
Downloading: file://<https://builds.apache.org/job/dir-studio-jdk16-ubuntu-deploy/ws/trunk/libraries/net.sf.ehcache.core/org/apache/directory/studio/org.slf4j.api/2.0.0-SNAPSHOT/org.slf4j.api-2.0.0-SNAPSHOT.jar>
Downloading: http://repo1.maven.org/maven2/net/sf/ehcache/ehcache-core/2.4.4/ehcache-core-2.4.4.jar
Downloaded: http://repo1.maven.org/maven2/net/sf/ehcache/ehcache-core/2.4.4/ehcache-core-2.4.4.jar
(986 KB at 1082.2 KB/sec)
Downloading: http://repository.apache.org/snapshots/org/apache/directory/studio/org.slf4j.api/2.0.0-SNAPSHOT/org.slf4j.api-2.0.0-SNAPSHOT.jar
[WARNING] The following dependencies could not be resolved at this point of the build but
seem to be part of the reactor:
[WARNING] o org.apache.directory.studio:org.slf4j.api:jar:2.0.0-SNAPSHOT (provided)
[WARNING] Try running the build up to the lifecycle phase "package"
Downloading: file://<https://builds.apache.org/job/dir-studio-jdk16-ubuntu-deploy/ws/trunk/libraries/org.apache.directory.server.core.constants/org/apache/directory/server/apacheds-core-constants/2.0.0-M6/apacheds-core-constants-2.0.0-M6.pom>
Downloading: http://repo1.maven.org/maven2/org/apache/directory/server/apacheds-core-constants/2.0.0-M6/apacheds-core-constants-2.0.0-M6.pom
[WARNING] The POM for org.apache.directory.server:apacheds-core-constants:jar:2.0.0-M6 is
missing, no dependency information available
Downloading: file://<https://builds.apache.org/job/dir-studio-jdk16-ubuntu-deploy/ws/trunk/libraries/org.apache.directory.server.core.constants/org/apache/directory/studio/org.slf4j.api/2.0.0-SNAPSHOT/maven-metadata.xml>
Downloading: http://repository.apache.org/snapshots/org/apache/directory/studio/org.slf4j.api/2.0.0-SNAPSHOT/maven-metadata.xml
Downloading: file://<https://builds.apache.org/job/dir-studio-jdk16-ubuntu-deploy/ws/trunk/libraries/org.apache.directory.server.core.constants/org/apache/directory/server/apacheds-core-constants/2.0.0-M6/apacheds-core-constants-2.0.0-M6.jar>
Downloading: file://<https://builds.apache.org/job/dir-studio-jdk16-ubuntu-deploy/ws/trunk/libraries/org.apache.directory.server.core.constants/org/apache/directory/studio/org.slf4j.api/2.0.0-SNAPSHOT/org.slf4j.api-2.0.0-SNAPSHOT.jar>
Downloading: http://repo1.maven.org/maven2/org/apache/directory/server/apacheds-core-constants/2.0.0-M6/apacheds-core-constants-2.0.0-M6.jar
Downloading: http://repository.apache.org/snapshots/org/apache/directory/studio/org.slf4j.api/2.0.0-SNAPSHOT/org.slf4j.api-2.0.0-SNAPSHOT.jar
[JENKINS] Archiving <https://builds.apache.org/job/dir-studio-jdk16-ubuntu-deploy/ws/trunk/libraries/org.slf4j.api/pom.xml>
to /home/hudson/hudson/jobs/dir-studio-jdk16-ubuntu-deploy/modules/org.apache.directory.studio$org.slf4j.api/builds/2012-02-26_04-02-21/archive/org.apache.directory.studio/org.slf4j.api/2.0.0-SNAPSHOT/org.slf4j.api-2.0.0-SNAPSHOT.pom
[INFO] ------------------------------------------------------------------------
[INFO] Reactor Summary:
[INFO] 
[INFO] Apache Directory Studio ........................... SUCCESS [29.213s]
[INFO] Apache Directory Studio Repository ................ SUCCESS [7.699s]
[INFO] Apache Directory Studio Libraries Plugins ......... SUCCESS [5.930s]
[INFO] SLF4J API Module (for Apache Directory Studio) .... FAILURE [6.143s]
[INFO] Ehcache Core (for Apache Directory Studio) ........ SKIPPED
[INFO] Apache Commons Codec (for Apache Directory Studio)  SKIPPED
[INFO] Apache Commons IO (for Apache Directory Studio) ... SKIPPED
[INFO] ApacheDS Core Constants (for Apache Directory Studio)  SKIPPED
[INFO] ApacheDS I18n (for Apache Directory Studio) ....... SKIPPED
[INFO] ApacheDS Core API (for Apache Directory Studio) ... SKIPPED
[INFO] ApacheDS Core AVL (for Apache Directory Studio) ... SKIPPED
[INFO] ApacheDS Generalized (X) DBM Partition (for Apache Directory Studio)  SKIPPED
[INFO] ApacheDS Server Config (for Apache Directory Studio)  SKIPPED
[INFO] ApacheDS Core (for Apache Directory Studio) ....... SKIPPED
[INFO] ApacheDS LDIF Partition (for Apache Directory Studio)  SKIPPED
[INFO] Apache HttpComponents Core (for Apache Directory Studio)  SKIPPED
[INFO] Apache HttpComponents Client (for Apache Directory Studio)  SKIPPED[WARNING] The requested
profile "studio-full" could not be activated because it does not exist.

[INFO] Log4j (for Apache Directory Studio) ............... SKIPPED
[INFO] SLF4J LOG4J-12 Binding (for Apache Directory Studio)  SKIPPED
[INFO] XPP3 (for Apache Directory Studio) ................ SKIPPED
[INFO] Apache Directory Studio Plugins ................... SKIPPED
[INFO] Apache Directory Studio Common UI ................. SKIPPED
[INFO] Apache Directory Studio Common Core ............... SKIPPED
[INFO] Apache Directory Studio LDIF Parser ............... SKIPPED
[INFO] Apache Directory Studio Connection Core ........... SKIPPED
[INFO] Apache Directory Studio Connection UI ............. SKIPPED
[INFO] Apache Directory Studio LDAP Browser Core ......... SKIPPED
[INFO] Apache Directory Studio LDAP Browser Common ....... SKIPPED
[INFO] Apache Directory Studio Value Editors ............. SKIPPED
[INFO] Apache Directory Studio ACI Item Editor ........... SKIPPED
[INFO] Apache Directory Studio ApacheDS Launcher ......... SKIPPED
[INFO] Apache Directory Studio ApacheDS Configuration .... SKIPPED
[INFO] Apache Directory Studio ApacheDS 2.0 Configuration  SKIPPED
[INFO] Apache Directory Studio LDIF Editor ............... SKIPPED
[INFO] Apache Directory Studio LDAP Browser UI ........... SKIPPED
[INFO] Apache Directory Studio LDAP Servers .............. SKIPPED
[INFO] Apache Directory Studio ApacheDS 1.5.3 LDAP Server Adapter  SKIPPED
[INFO] Apache Directory Studio ApacheDS 1.5.4 LDAP Server Adapter  SKIPPED
[INFO] Apache Directory Studio ApacheDS 1.5.5 LDAP Server Adapter  SKIPPED
[INFO] Apache Directory Studio ApacheDS 1.5.6 LDAP Server Adapter  SKIPPED
[INFO] Apache Directory Studio ApacheDS 1.5.7 LDAP Server Adapter  SKIPPED
[INFO] Apache Directory Studio ApacheDS 2.0.0 LDAP Server Adapter  SKIPPED
[INFO] Apache Directory Studio RCP ....................... SKIPPED
[INFO] Apache Directory Studio RCP Fullscreen for OS X Lion  SKIPPED
[INFO] Apache Directory Studio Schema Editor ............. SKIPPED
[INFO] Apache Directory Studio Help Plugins .............. SKIPPED
[INFO] Apache Directory Studio Apache DS Help ............ SKIPPED
[INFO] Apache Directory Studio Apache DS Configuration Help  SKIPPED
[INFO] Apache Directory Studio LDAP Browser Help ......... SKIPPED
[INFO] Apache Directory Studio LDIF Editor Help .......... SKIPPED
[INFO] Apache Directory Studio RCP Help .................. SKIPPED
[INFO] Apache Directory Studio Schema Editor Help ........ SKIPPED
[INFO] Apache Directory Studio Feature Plugins ........... SKIPPED
[INFO] Apache Directory Studio ApacheDS Configuration Feature  SKIPPED
[INFO] Apache Directory Studio ApacheDS 2.0 Configuration Feature  SKIPPED
[INFO] Apache Directory Studio ApacheDS Feature .......... SKIPPED
[INFO] Apache Directory Studio LDAP Browser Feature ...... SKIPPED
[INFO] Apache Directory Studio LDAP Servers Feature ...... SKIPPED
[INFO] Apache Directory Studio LDIF Editor Feature ....... SKIPPED
[INFO] Apache Directory Studio RCP Feature ............... SKIPPED
[INFO] Apache Directory Studio Schema Editor Feature ..... SKIPPED
[INFO] ------------------------------------------------------------------------
[INFO] BUILD FAILURE
[INFO] ------------------------------------------------------------------------
[INFO] Total time: 55.680s
[INFO] Finished at: Sun Feb 26 04:03:25 UTC 2012
[INFO] Final Memory: 37M/205M
[INFO] ------------------------------------------------------------------------
mavenExecutionResult exceptions not empty
message : Failed to execute goal on project org.apache.directory.server.core.constants: Could
not resolve dependencies for project org.apache.directory.studio:org.apache.directory.server.core.constants:jar:2.0.0-SNAPSHOT:
The following artifacts could not be resolved: org.apache.directory.server:apacheds-core-constants:jar:2.0.0-M6,
org.apache.directory.studio:org.slf4j.api:jar:2.0.0-SNAPSHOT: Could not find artifact org.apache.directory.server:apacheds-core-constants:jar:2.0.0-M6
in studio.repository (file://<https://builds.apache.org/job/dir-studio-jdk16-ubuntu-deploy/ws/trunk/libraries/org.apache.directory.server.core.constants)>
cause : Could not resolve dependencies for project org.apache.directory.studio:org.apache.directory.server.core.constants:jar:2.0.0-SNAPSHOT:
The following artifacts could not be resolved: org.apache.directory.server:apacheds-core-constants:jar:2.0.0-M6,
org.apache.directory.studio:org.slf4j.api:jar:2.0.0-SNAPSHOT: Could not find artifact org.apache.directory.server:apacheds-core-constants:jar:2.0.0-M6
in studio.repository (file://<https://builds.apache.org/job/dir-studio-jdk16-ubuntu-deploy/ws/trunk/libraries/org.apache.directory.server.core.constants)>
Stack trace : 
org.apache.maven.lifecycle.LifecycleExecutionException: Failed to execute goal on project
org.apache.directory.server.core.constants: Could not resolve dependencies for project org.apache.directory.studio:org.apache.directory.server.core.constants:jar:2.0.0-SNAPSHOT:
The following artifacts could not be resolved: org.apache.directory.server:apacheds-core-constants:jar:2.0.0-M6,
org.apache.directory.studio:org.slf4j.api:jar:2.0.0-SNAPSHOT: Could not find artifact org.apache.directory.server:apacheds-core-constants:jar:2.0.0-M6
in studio.repository (file://<https://builds.apache.org/job/dir-studio-jdk16-ubuntu-deploy/ws/trunk/libraries/org.apache.directory.server.core.constants)>
	at org.apache.maven.lifecycle.internal.LifecycleDependencyResolver.getDependencies(LifecycleDependencyResolver.java:196)
	at org.apache.maven.lifecycle.internal.LifecycleDependencyResolver.resolveProjectDependencies(LifecycleDependencyResolver.java:108)
	at org.apache.maven.lifecycle.internal.MojoExecutor.ensureDependenciesAreResolved(MojoExecutor.java:275)
	at org.apache.maven.lifecycle.internal.MojoExecutor.execute(MojoExecutor.java:201)
	at org.apache.maven.lifecycle.internal.MojoExecutor.execute(MojoExecutor.java:153)
	at org.apache.maven.lifecycle.internal.MojoExecutor.execute(MojoExecutor.java:145)
	at org.apache.maven.lifecycle.internal.LifecycleModuleBuilder.buildProject(LifecycleModuleBuilder.java:84)
	at org.apache.maven.lifecycle.internal.LifecycleModuleBuilder.buildProject(LifecycleModuleBuilder.java:59)
	at org.apache.maven.lifecycle.internal.LifecycleStarter.singleThreadedBuild(LifecycleStarter.java:183)
	at org.apache.maven.lifecycle.internal.LifecycleStarter.execute(LifecycleStarter.java:161)
	at org.apache.maven.DefaultMaven.doExecute(DefaultMaven.java:319)
	at org.apache.maven.DefaultMaven.execute(DefaultMaven.java:156)
	at org.jvnet.hudson.maven3.launcher.Maven3Launcher.main(Maven3Launcher.java:79)
	at sun.reflect.NativeMethodAccessorImpl.invoke0(Native Method)
	at sun.reflect.NativeMethodAccessorImpl.invoke(NativeMethodAccessorImpl.java:39)
	at sun.reflect.DelegatingMethodAccessorImpl.invoke(DelegatingMethodAccessorImpl.java:25)
	at java.lang.reflect.Method.invoke(Method.java:597)
	at org.codehaus.plexus.classworlds.launcher.Launcher.launchStandard(Launcher.java:329)
	at org.codehaus.plexus.classworlds.launcher.Launcher.launch(Launcher.java:239)
	at org.jvnet.hudson.maven3.agent.Maven3Main.launch(Maven3Main.java:158)
	at hudson.maven.Maven3Builder.call(Maven3Builder.java:104)
	at hudson.maven.Maven3Builder.call(Maven3Builder.java:70)
	at hudson.remoting.UserRequest.perform(UserRequest.java:118)
	at hudson.remoting.UserRequest.perform(UserRequest.java:48)
	at hudson.remoting.Request$2.run(Request.java:287)
	at hudson.remoting.InterceptingExecutorService$1.call(InterceptingExecutorService.java:72)
	at java.util.concurrent.FutureTask$Sync.innerRun(FutureTask.java:303)
	at java.util.concurrent.FutureTask.run(FutureTask.java:138)
	at java.util.concurrent.ThreadPoolExecutor$Worker.runTask(ThreadPoolExecutor.java:886)
	at java.util.concurrent.ThreadPoolExecutor$Worker.run(ThreadPoolExecutor.java:908)
	at java.lang.Thread.run(Thread.java:662)
Caused by: org.apache.maven.project.DependencyResolutionException: Could not resolve dependencies
for project org.apache.directory.studio:org.apache.directory.server.core.constants:jar:2.0.0-SNAPSHOT:
The following artifacts could not be resolved: org.apache.directory.server:apacheds-core-constants:jar:2.0.0-M6,
org.apache.directory.studio:org.slf4j.api:jar:2.0.0-SNAPSHOT: Could not find artifact org.apache.directory.server:apacheds-core-constants:jar:2.0.0-M6
in studio.repository (file://<https://builds.apache.org/job/dir-studio-jdk16-ubuntu-deploy/ws/trunk/libraries/org.apache.directory.server.core.constants)>
	at org.apache.maven.project.DefaultProjectDependenciesResolver.resolve(DefaultProjectDependenciesResolver.java:170)
	at org.apache.maven.lifecycle.internal.LifecycleDependencyResolver.getDependencies(LifecycleDependencyResolver.java:171)
	... 30 more
Caused by: org.sonatype.aether.resolution.DependencyResolutionException: The following artifacts
could not be resolved: org.apache.directory.server:apacheds-core-constants:jar:2.0.0-M6, org.apache.directory.studio:org.slf4j.api:jar:2.0.0-SNAPSHOT:
Could not find artifact org.apache.directory.server:apacheds-core-constants:jar:2.0.0-M6 in
studio.repository (file://<https://builds.apache.org/job/dir-studio-jdk16-ubuntu-deploy/ws/trunk/libraries/org.apache.directory.server.core.constants)>
	at org.sonatype.aether.impl.internal.DefaultRepositorySystem.resolveDependencies(DefaultRepositorySystem.java:412)
	at org.apache.maven.project.DefaultProjectDependenciesResolver.resolve(DefaultProjectDependenciesResolver.java:164)
	... 31 more
Caused by: org.sonatype.aether.resolution.ArtifactResolutionException: The following artifacts
could not be resolved: org.apache.directory.server:apacheds-core-constants:jar:2.0.0-M6, org.apache.directory.studio:org.slf4j.api:jar:2.0.0-SNAPSHOT:
Could not find artifact org.apache.directory.server:apacheds-core-constants:jar:2.0.0-M6 in
studio.repository (file://<https://builds.apache.org/job/dir-studio-jdk16-ubuntu-deploy/ws/trunk/libraries/org.apache.directory.server.core.constants)>
	at org.sonatype.aether.impl.internal.DefaultArtifactResolver.resolve(DefaultArtifactResolver.java:541)
	at org.sonatype.aether.impl.internal.DefaultArtifactResolver.resolveArtifacts(DefaultArtifactResolver.java:220)
	at org.sonatype.aether.impl.internal.DefaultRepositorySystem.resolveDependencies(DefaultRepositorySystem.java:395)
	... 32 more
Caused by: org.sonatype.aether.transfer.ArtifactNotFoundException: Could not find artifact
org.apache.directory.server:apacheds-core-constants:jar:2.0.0-M6 in studio.repository (file://<https://builds.apache.org/job/dir-studio-jdk16-ubuntu-deploy/ws/trunk/libraries/org.apache.directory.server.core.constants)>
	at org.sonatype.aether.connector.wagon.WagonRepositoryConnector$4.wrap(WagonRepositoryConnector.java:945)
	at org.sonatype.aether.connector.wagon.WagonRepositoryConnector$4.wrap(WagonRepositoryConnector.java:940)
	at org.sonatype.aether.connector.wagon.WagonRepositoryConnector$GetTask.flush(WagonRepositoryConnector.java:695)
	at org.sonatype.aether.connector.wagon.WagonRepositoryConnector$GetTask.flush(WagonRepositoryConnector.java:689)
	at org.sonatype.aether.connector.wagon.WagonRepositoryConnector.get(WagonRepositoryConnector.java:445)
	at org.sonatype.aether.impl.internal.DefaultArtifactResolver.resolve(DefaultArtifactResolver.java:460)
	... 34 more
channel stopped


Mime
View raw message