directory-notifications mailing list archives

Site index · List index
Message view « Date » · « Thread »
Top « Date » · « Thread »
From Apache Jenkins Server <jenk...@builds.apache.org>
Subject Build failed in Jenkins: dir-studio-jdk16-win #501
Date Sun, 26 Feb 2012 09:20:46 GMT
See <https://builds.apache.org/job/dir-studio-jdk16-win/501/changes>

Changes:

[pamarcelot] [maven-release-plugin] prepare for next development iteration

[pamarcelot] [maven-release-plugin] prepare release 2.0.0.v20120224

[pamarcelot] - Commented some profiles
- Removed from the build library plugins that already exist in the Maven repostory (already
released by the previous version)

[pamarcelot] Updated release notes.

[pamarcelot] Updated versions for dependencies.

[pamarcelot] Moved to the latest released version 2.0.0-M6.

[pamarcelot] Configured Rat plugin.

------------------------------------------
[...truncated 1258 lines...]
Downloaded: file://F:\hudson\hudson-slave\workspace\dir-studio-jdk16-win\trunk\repository/org/eclipse/languagepack/BabelLanguagePack-eclipse-de/3.6.0.v20101211043401/BabelLanguagePack-eclipse-de-3.6.0.v20101211043401.zip
(1028 KB at 15104.4 KB/sec)
Downloading: file://F:\hudson\hudson-slave\workspace\dir-studio-jdk16-win\trunk\repository/docbook/docbook-xsl/1.71.1/docbook-xsl-1.71.1.zip
Downloaded: file://F:\hudson\hudson-slave\workspace\dir-studio-jdk16-win\trunk\repository/docbook/docbook-xml/4.5/docbook-xml-4.5.zip
(97 KB at 2599.7 KB/sec)
Downloaded: file://F:\hudson\hudson-slave\workspace\dir-studio-jdk16-win\trunk\repository/org/eclipse/swtbot/swt/finder/2.0.0.433-dev-e35/finder-2.0.0.433-dev-e35.jar
(594 KB at 11207.0 KB/sec)
Downloading: file://F:\hudson\hudson-slave\workspace\dir-studio-jdk16-win\trunk\repository/org/openoffice/odfdom/0.6.16/odfdom-0.6.16.jar
Downloaded: file://F:\hudson\hudson-slave\workspace\dir-studio-jdk16-win\trunk\repository/org/eclipse/languagepack/BabelLanguagePack-eclipse-fr/3.6.0.v20101211043401/BabelLanguagePack-eclipse-fr-3.6.0.v20101211043401.zip
(1026 KB at 10051.1 KB/sec)
Downloaded: file://F:\hudson\hudson-slave\workspace\dir-studio-jdk16-win\trunk\repository/org/eclipse/ui/workbench/3.7.0.I20110519-0100/workbench-3.7.0.I20110519-0100.jar
(4068 KB at 18919.4 KB/sec)
Downloaded: file://F:\hudson\hudson-slave\workspace\dir-studio-jdk16-win\trunk\repository/org/openoffice/odfdom/0.6.16/odfdom-0.6.16.jar
(2863 KB at 17139.4 KB/sec)
Downloaded: file://F:\hudson\hudson-slave\workspace\dir-studio-jdk16-win\trunk\repository/docbook/docbook-xsl/1.71.1/docbook-xsl-1.71.1.zip
(2489 KB at 12137.2 KB/sec)
[INFO] 
[INFO] --- tools-maven-plugin:1.4:verify-legal-files (verify-legal-files) @ repository ---
[INFO] Installing F:\hudson\hudson-slave\workspace\dir-studio-jdk16-win\trunk\repository\pom.xml
to f:\hudson\hudson-slave\maven-repositories\1\org\apache\directory\studio\repository\2.0.0-SNAPSHOT\repository-2.0.0-SNAPSHOT.pom
[INFO] 
[INFO] --- maven-install-plugin:2.3.1:install (default-install) @ repository ---
[JENKINS] Archiving disabled - not archiving F:\hudson\hudson-slave\workspace\dir-studio-jdk16-win\trunk\repository\pom.xml
[INFO]                                                                         
[INFO] ------------------------------------------------------------------------
[INFO] Building Apache Directory Studio Libraries Plugins 2.0.0-SNAPSHOT
[INFO] ------------------------------------------------------------------------
[INFO] 
[INFO] --- maven-clean-plugin:2.4.1:clean (default-clean) @ parent-libraries ---
[INFO] Deleting F:\hudson\hudson-slave\workspace\dir-studio-jdk16-win\trunk\libraries\target
[INFO] 
[INFO] --- maven-remote-resources-plugin:1.2.1:process (default) @ parent-libraries ---
[INFO] 
[INFO] --- tools-maven-plugin:1.4:verify-legal-files (verify-legal-files) @ parent-libraries
---
[INFO] Installing F:\hudson\hudson-slave\workspace\dir-studio-jdk16-win\trunk\libraries\pom.xml
to f:\hudson\hudson-slave\maven-repositories\1\org\apache\directory\studio\parent-libraries\2.0.0-SNAPSHOT\parent-libraries-2.0.0-SNAPSHOT.pom
[INFO] 
[INFO] --- maven-install-plugin:2.3.1:install (default-install) @ parent-libraries ---
[JENKINS] Archiving disabled - not archiving F:\hudson\hudson-slave\workspace\dir-studio-jdk16-win\trunk\libraries\pom.xml
[INFO] Downloading: http://repo1.maven.org/maven2/org/apache/directory/studio/studio-maven-plugin/1.0.5/studio-maven-plugin-1.0.5.pom
                                                                        
[INFO] ------------------------------------------------------------------------
[INFO] Building SLF4J API Module (for Apache Directory Studio) 2.0.0-SNAPSHOT
[INFO] ------------------------------------------------------------------------
Downloaded: http://repo1.maven.org/maven2/org/apache/directory/studio/studio-maven-plugin/1.0.5/studio-maven-plugin-1.0.5.pom
(10 KB at 29.8 KB/sec)
Downloading: http://repo1.maven.org/maven2/org/apache/directory/studio/studio-maven-plugin/1.0.5/studio-maven-plugin-1.0.5.jar
Downloaded: http://repo1.maven.org/maven2/org/apache/directory/studio/studio-maven-plugin/1.0.5/studio-maven-plugin-1.0.5.jar
(36 KB at 67.8 KB/sec)
Downloading: http://repo1.maven.org/maven2/org/apache/maven/plugins/maven-resources-plugin/2.5/maven-resources-plugin-2.5.pom
Downloaded: http://repo1.maven.org/maven2/org/apache/maven/plugins/maven-resources-plugin/2.5/maven-resources-plugin-2.5.pom
(7 KB at 14.1 KB/sec)
Downloading: http://repo1.maven.org/maven2/org/apache/maven/plugins/maven-resources-plugin/2.5/maven-resources-plugin-2.5.jar
Downloaded: http://repo1.maven.org/maven2/org/apache/maven/plugins/maven-resources-plugin/2.5/maven-resources-plugin-2.5.jar
(26 KB at 51.3 KB/sec)
Downloading: http://repo1.maven.org/maven2/org/apache/maven/plugins/maven-compiler-plugin/2.3.2/maven-compiler-plugin-2.3.2.pom
Downloaded: http://repo1.maven.org/maven2/org/apache/maven/plugins/maven-compiler-plugin/2.3.2/maven-compiler-plugin-2.3.2.pom
(8 KB at 14.6 KB/sec)
Downloading: http://repo1.maven.org/maven2/org/apache/maven/plugins/maven-compiler-plugin/2.3.2/maven-compiler-plugin-2.3.2.jar
Downloaded: http://repo1.maven.org/maven2/org/apache/maven/plugins/maven-compiler-plugin/2.3.2/maven-compiler-plugin-2.3.2.jar
(29 KB at 57.7 KB/sec)
Downloading: http://repo1.maven.org/maven2/org/apache/maven/plugins/maven-surefire-plugin/2.10/maven-surefire-plugin-2.10.pom
Downloaded: http://repo1.maven.org/maven2/org/apache/maven/plugins/maven-surefire-plugin/2.10/maven-surefire-plugin-2.10.pom
(11 KB at 21.7 KB/sec)
Downloading: http://repo1.maven.org/maven2/org/apache/maven/surefire/surefire/2.10/surefire-2.10.pom
Downloaded: http://repo1.maven.org/maven2/org/apache/maven/surefire/surefire/2.10/surefire-2.10.pom
(12 KB at 24.9 KB/sec)
Downloading: http://repo1.maven.org/maven2/org/apache/maven/maven-parent/20/maven-parent-20.pom
Downloaded: http://repo1.maven.org/maven2/org/apache/maven/maven-parent/20/maven-parent-20.pom
(25 KB at 48.7 KB/sec)
Downloading: http://repo1.maven.org/maven2/org/apache/maven/plugins/maven-surefire-plugin/2.10/maven-surefire-plugin-2.10.jar
Downloaded: http://repo1.maven.org/maven2/org/apache/maven/plugins/maven-surefire-plugin/2.10/maven-surefire-plugin-2.10.jar
(30 KB at 60.0 KB/sec)
Downloading: http://repo1.maven.org/maven2/org/apache/maven/plugins/maven-jar-plugin/2.3.2/maven-jar-plugin-2.3.2.pom
Downloaded: http://repo1.maven.org/maven2/org/apache/maven/plugins/maven-jar-plugin/2.3.2/maven-jar-plugin-2.3.2.pom
(6 KB at 10.2 KB/sec)
Downloading: http://repo1.maven.org/maven2/org/apache/maven/plugins/maven-plugins/21/maven-plugins-21.pom
Downloaded: http://repo1.maven.org/maven2/org/apache/maven/plugins/maven-plugins/21/maven-plugins-21.pom
(13 KB at 29.2 KB/sec)
Downloading: http://repo1.maven.org/maven2/org/apache/maven/plugins/maven-jar-plugin/2.3.2/maven-jar-plugin-2.3.2.jar
Downloaded: http://repo1.maven.org/maven2/org/apache/maven/plugins/maven-jar-plugin/2.3.2/maven-jar-plugin-2.3.2.jar
(32 KB at 65.3 KB/sec)
Downloading: file://F:\hudson\hudson-slave\workspace\dir-studio-jdk16-win\trunk\libraries\org.slf4j.api/org/slf4j/slf4j-api/1.6.4/slf4j-api-1.6.4.pom
Downloading: http://repo1.maven.org/maven2/org/slf4j/slf4j-api/1.6.4/slf4j-api-1.6.4.pom
Downloaded: http://repo1.maven.org/maven2/org/slf4j/slf4j-api/1.6.4/slf4j-api-1.6.4.pom (3
KB at 5.4 KB/sec)
Downloading: file://F:\hudson\hudson-slave\workspace\dir-studio-jdk16-win\trunk\libraries\org.slf4j.api/org/slf4j/slf4j-parent/1.6.4/slf4j-parent-1.6.4.pom
Downloading: http://repo1.maven.org/maven2/org/slf4j/slf4j-parent/1.6.4/slf4j-parent-1.6.4.pom
Downloaded: http://repo1.maven.org/maven2/org/slf4j/slf4j-parent/1.6.4/slf4j-parent-1.6.4.pom
(12 KB at 24.3 KB/sec)
Downloading: file://F:\hudson\hudson-slave\workspace\dir-studio-jdk16-win\trunk\libraries\org.slf4j.api/org/slf4j/slf4j-api/1.6.4/slf4j-api-1.6.4.jar
Downloading: http://repo1.maven.org/maven2/org/slf4j/slf4j-api/1.6.4/slf4j-api-1.6.4.jar
Downloaded: http://repo1.maven.org/maven2/org/slf4j/slf4j-api/1.6.4/slf4j-api-1.6.4.jar (26
KB at 52.6 KB/sec)
[INFO] 
[INFO] --- maven-clean-plugin:2.4.1:clean (default-clean) @ org.slf4j.api ---
[INFO] Deleting F:\hudson\hudson-slave\workspace\dir-studio-jdk16-win\trunk\libraries\org.slf4j.api\target
[INFO] 
[INFO] --- maven-remote-resources-plugin:1.2.1:process (default) @ org.slf4j.api ---
[INFO] 
[INFO] --- maven-resources-plugin:2.5:resources (default-resources) @ org.slf4j.api ---
Downloading: http://repo1.maven.org/maven2/org/codehaus/plexus/plexus-interpolation/1.13/plexus-interpolation-1.13.pom
Downloaded: http://repo1.maven.org/maven2/org/codehaus/plexus/plexus-interpolation/1.13/plexus-interpolation-1.13.pom
(890 B at 2.9 KB/sec)
Downloading: http://repo1.maven.org/maven2/org/codehaus/plexus/plexus-interpolation/1.13/plexus-interpolation-1.13.jar
Downloaded: http://repo1.maven.org/maven2/org/codehaus/plexus/plexus-interpolation/1.13/plexus-interpolation-1.13.jar
(60 KB at 124.7 KB/sec)
[debug] execute contextualize
[INFO] Using 'UTF-8' encoding to copy filtered resources.
[INFO] skip non existing resourceDirectory F:\hudson\hudson-slave\workspace\dir-studio-jdk16-win\trunk\libraries\org.slf4j.api\src\main\resources
[INFO] Copying 3 resources
Downloading: file://F:\hudson\hudson-slave\workspace\dir-studio-jdk16-win\trunk\libraries\net.sf.ehcache.core/net/sf/ehcache/ehcache-core/2.4.4/ehcache-core-2.4.4.pom
Downloading: http://repo1.maven.org/maven2/net/sf/ehcache/ehcache-core/2.4.4/ehcache-core-2.4.4.pom
Downloaded: http://repo1.maven.org/maven2/net/sf/ehcache/ehcache-core/2.4.4/ehcache-core-2.4.4.pom
(36 KB at 115.0 KB/sec)
Downloading: file://F:\hudson\hudson-slave\workspace\dir-studio-jdk16-win\trunk\libraries\net.sf.ehcache.core/net/sf/ehcache/ehcache-parent/2.2/ehcache-parent-2.2.pom
Downloading: http://repo1.maven.org/maven2/net/sf/ehcache/ehcache-parent/2.2/ehcache-parent-2.2.pom
Downloaded: http://repo1.maven.org/maven2/net/sf/ehcache/ehcache-parent/2.2/ehcache-parent-2.2.pom
(20 KB at 40.8 KB/sec)
Downloading: file://F:\hudson\hudson-slave\workspace\dir-studio-jdk16-win\trunk\libraries\net.sf.ehcache.core/org/apache/directory/studio/org.slf4j.api/2.0.0-SNAPSHOT/maven-metadata.xml
Downloading: http://repository.apache.org/snapshots/org/apache/directory/studio/org.slf4j.api/2.0.0-SNAPSHOT/maven-metadata.xml
Downloading: file://F:\hudson\hudson-slave\workspace\dir-studio-jdk16-win\trunk\libraries\net.sf.ehcache.core/org/apache/directory/studio/org.slf4j.api/2.0.0-SNAPSHOT/org.slf4j.api-2.0.0-SNAPSHOT.jar
Downloading: file://F:\hudson\hudson-slave\workspace\dir-studio-jdk16-win\trunk\libraries\net.sf.ehcache.core/net/sf/ehcache/ehcache-core/2.4.4/ehcache-core-2.4.4.jar
Downloading: http://repo1.maven.org/maven2/net/sf/ehcache/ehcache-core/2.4.4/ehcache-core-2.4.4.jar
Downloaded: http://repo1.maven.org/maven2/net/sf/ehcache/ehcache-core/2.4.4/ehcache-core-2.4.4.jar
(986 KB at 727.0 KB/sec)
Downloading: http://repository.apache.org/snapshots/org/apache/directory/studio/org.slf4j.api/2.0.0-SNAPSHOT/org.slf4j.api-2.0.0-SNAPSHOT.jar
[WARNING] The following dependencies could not be resolved at this point of the build but
seem to be part of the reactor:
[WARNING] o org.apache.directory.studio:org.slf4j.api:jar:2.0.0-SNAPSHOT (provided)
[WARNING] Try running the build up to the lifecycle phase "package"
Downloading: file://F:\hudson\hudson-slave\workspace\dir-studio-jdk16-win\trunk\libraries\org.apache.commons.codec/commons-codec/commons-codec/1.6/commons-codec-1.6.pom
Downloading: http://repo1.maven.org/maven2/commons-codec/commons-codec/1.6/commons-codec-1.6.pom
Downloaded: http://repo1.maven.org/maven2/commons-codec/commons-codec/1.6/commons-codec-1.6.pom
(11 KB at 23.5 KB/sec)
Downloading: file://F:\hudson\hudson-slave\workspace\dir-studio-jdk16-win\trunk\libraries\org.apache.commons.codec/org/apache/commons/commons-parent/22/commons-parent-22.pom
Downloading: http://repo1.maven.org/maven2/org/apache/commons/commons-parent/22/commons-parent-22.pom
Downloaded: http://repo1.maven.org/maven2/org/apache/commons/commons-parent/22/commons-parent-22.pom
(41 KB at 84.1 KB/sec)
Downloading: file://F:\hudson\hudson-slave\workspace\dir-studio-jdk16-win\trunk\libraries\org.apache.commons.codec/commons-codec/commons-codec/1.6/commons-codec-1.6.jar
Downloading: http://repo1.maven.org/maven2/commons-codec/commons-codec/1.6/commons-codec-1.6.jar
Downloaded: http://repo1.maven.org/maven2/commons-codec/commons-codec/1.6/commons-codec-1.6.jar
(228 KB at 473.6 KB/sec)
Downloading: file://F:\hudson\hudson-slave\workspace\dir-studio-jdk16-win\trunk\libraries\org.apache.commons.io/commons-io/commons-io/2.1/commons-io-2.1.pom
Downloading: http://repo1.maven.org/maven2/commons-io/commons-io/2.1/commons-io-2.1.pom
Downloaded: http://repo1.maven.org/maven2/commons-io/commons-io/2.1/commons-io-2.1.pom (11
KB at 24.3 KB/sec)
Downloading: file://F:\hudson\hudson-slave\workspace\dir-studio-jdk16-win\trunk\libraries\org.apache.commons.io/commons-io/commons-io/2.1/commons-io-2.1.jar
Downloading: http://repo1.maven.org/maven2/commons-io/commons-io/2.1/commons-io-2.1.jar
Downloaded: http://repo1.maven.org/maven2/commons-io/commons-io/2.1/commons-io-2.1.jar (160
KB at 326.5 KB/sec)
Downloading: file://F:\hudson\hudson-slave\workspace\dir-studio-jdk16-win\trunk\libraries\org.apache.directory.server.core.constants/org/apache/directory/server/apacheds-core-constants/2.0.0-M6/apacheds-core-constants-2.0.0-M6.pom
Downloading: http://repo1.maven.org/maven2/org/apache/directory/server/apacheds-core-constants/2.0.0-M6/apacheds-core-constants-2.0.0-M6.pom
[WARNING] The POM for org.apache.directory.server:apacheds-core-constants:jar:2.0.0-M6 is
missing, no dependency information available
Downloading: file://F:\hudson\hudson-slave\workspace\dir-studio-jdk16-win\trunk\libraries\org.apache.directory.server.core.constants/org/apache/directory/server/apacheds-core-constants/2.0.0-M6/apacheds-core-constants-2.0.0-M6.jar
Downloading: file://F:\hudson\hudson-slave\workspace\dir-studio-jdk16-win\trunk\libraries\org.apache.directory.server.core.constants/org/apache/directory/studio/org.slf4j.api/2.0.0-SNAPSHOT/org.slf4j.api-2.0.0-SNAPSHOT.jar
Downloading: http://repo1.maven.org/maven2/org/apache/directory/server/apacheds-core-constants/2.0.0-M6/apacheds-core-constants-2.0.0-M6.jar
Downloading: http://repository.apache.org/snapshots/org/apache/directory/studio/org.slf4j.api/2.0.0-SNAPSHOT/org.slf4j.api-2.0.0-SNAPSHOT.jar
[JENKINS] Archiving disabled - not archiving F:\hudson\hudson-slave\workspace\dir-studio-jdk16-win\trunk\libraries\org.slf4j.api\pom.xml
[INFO] ------------------------------------------------------------------------
[INFO] Reactor Summary:
[INFO] 
[INFO] Apache Directory Studio ........................... SUCCESS [1:10.763s]
[INFO] Apache Directory Studio Repository ................ SUCCESS [4.073s]
[INFO] Apache Directory Studio Libraries Plugins ......... SUCCESS [0.157s]
[INFO] SLF4J API Module (for Apache Directory Studio) .... FAILURE [15.248s]
[INFO] Ehcache Core (for Apache Directory Studio) ........ SKIPPED
[INFO] Apache Commons Codec (for Apache Directory Studio)  SKIPPED
[INFO] Apache Commons IO (for Apache Directory Studio) ... SKIPPED
[INFO] ApacheDS Core Constants (for Apache Directory Studio)  SKIPPED
[INFO] ApacheDS I18n (for Apache Directory Studio) ....... SKIPPED
[INFO] ApacheDS Core API (for Apache Directory Studio) ... SKIPPED
[INFO] ApacheDS Core AVL (for Apache Directory Studio) ... SKIPPED
[INFO] ApacheDS Generalized (X) DBM Partition (for Apache Directory Studio)  SKIPPED
[INFO] ApacheDS Server Config (for Apache Directory Studio)  SKIPPED
[INFO] ApacheDS Core (for Apache Directory Studio) ....... SKIPPED
[INFO] ApacheDS LDIF Partition (for Apache Directory Studio)  SKIPPED
[INFO] Apache HttpComponents Core (for Apache Directory Studio)  SKIPPED
[INFO] Apache HttpComponents Client (for Apache Directory Studio)  SKIPPED
[INFO] Log4j (for Apache Directory Studio) ............... SKIPPED
[INFO] SLF4J LOG4J-12 Binding (for Apache Directory Studio)  SKIPPED
[INFO] XPP3 (for Apache Directory Studio) ................ SKIPPED
[INFO] Apache Directory Studio Plugins ................... SKIPPED
[INFO] Apache Directory Studio Common UI ................. SKIPPED
[INFO] Apache Directory Studio Common Core ............... SKIPPED
[INFO] Apache Directory Studio LDIF Parser ............... SKIPPED
[INFO] Apache Directory Studio Connection Core ........... SKIPPED
[INFO] Apache Directory Studio Connection UI ............. SKIPPED
[INFO] Apache Directory Studio LDAP Browser Core ......... SKIPPED
[INFO] Apache Directory Studio LDAP Browser Common ....... SKIPPED
[INFO] Apache Directory Studio Value Editors ............. SKIPPED
[INFO] Apache Directory Studio ACI Item Editor ........... SKIPPED
[INFO] Apache Directory Studio ApacheDS Launcher ......... SKIPPED
[INFO] Apache Directory Studio ApacheDS Configuration .... SKIPPED
[INFO] Apache Directory Studio ApacheDS 2.0 Configuration  SKIPPED
[INFO] Apache Directory Studio LDIF Editor ............... SKIPPED
[INFO] Apache Directory Studio LDAP Browser UI ........... SKIPPED
[INFO] Apache Directory Studio LDAP Servers .............. SKIPPED
[INFO] Apache Directory Studio ApacheDS 1.5.3 LDAP Server Adapter  SKIPPED
[INFO] Apache Directory Studio ApacheDS 1.5.4 LDAP Server Adapter  SKIPPED
[INFO] Apache Directory Studio ApacheDS 1.5.5 LDAP Server Adapter  SKIPPED
[INFO] Apache Directory Studio ApacheDS 1.5.6 LDAP Server Adapter  SKIPPED
[INFO] Apache Directory Studio ApacheDS 1.5.7 LDAP Server Adapter  SKIPPED
[INFO] Apache Directory Studio ApacheDS 2.0.0 LDAP Server Adapter  SKIPPED
[INFO] Apache Directory Studio RCP ....................... SKIPPED
[INFO] Apache Directory Studio RCP Fullscreen for OS X Lion  SKIPPED
[INFO] Apache Directory Studio Schema Editor ............. SKIPPED
[INFO] Apache Directory Studio Help Plugins .............. SKIPPED
[INFO] Apache Directory Studio Apache DS Help ............ SKIPPED
[INFO] Apache Directory Studio Apache DS Configuration Help  SKIPPED
[INFO] Apache Directory Studio LDAP Browser Help ......... SKIPPED
[INFO] Apache Directory Studio LDIF Editor Help .......... SKIPPED
[INFO] Apache Directory Studio RCP Help .................. SKIPPED
[INFO] Apache Directory Studio Schema Editor Help ........ SKIPPED
[INFO] Apache Directory Studio Feature Plugins ........... SKIPPED
[INFO] Apache Directory Studio ApacheDS Configuration Feature  SKIPPED
[INFO] Apache Directory Studio ApacheDS 2.0 Configuration Feature  SKIPPED
[INFO] Apache Directory Studio ApacheDS Feature .......... SKIPPED
[INFO] Apache Directory Studio LDAP Browser Feature ...... SKIPPED
[INFO] Apache Directory Studio LDAP Servers Feature ...... SKIPPED
[INFO] Apache Directory Studio LDIF Editor Feature ....... SKIPPED
[INFO] Apache Directory Studio RCP Feature ............... SKIPPED
[INFO] Apache Directory Studio Schema Editor Feature ..... SKIPPED
[INFO] ------------------------------------------------------------------------
[INFO] BUILD FAILURE
[INFO] ------------------------------------------------------------------------
[INFO] Total time: 2:14.511s
[INFO] Finished at: Sun Feb 26 09:20:43 GMT 2012
[INFO] Final Memory: 40M/217M
[INFO] ------------------------------------------------------------------------
mavenExecutionResult exceptions not empty
message : Failed to execute goal on project org.apache.directory.server.core.constants: Could
not resolve dependencies for project org.apache.directory.studio:org.apache.directory.server.core.constants:jar:2.0.0-SNAPSHOT:
The following artifacts could not be resolved: org.apache.directory.server:apacheds-core-constants:jar:2.0.0-M6,
org.apache.directory.studio:org.slf4j.api:jar:2.0.0-SNAPSHOT: Could not find artifact org.apache.directory.server:apacheds-core-constants:jar:2.0.0-M6
in studio.repository (file://F:\hudson\hudson-slave\workspace\dir-studio-jdk16-win\trunk\libraries\org.apache.directory.server.core.constants)
cause : Could not resolve dependencies for project org.apache.directory.studio:org.apache.directory.server.core.constants:jar:2.0.0-SNAPSHOT:
The following artifacts could not be resolved: org.apache.directory.server:apacheds-core-constants:jar:2.0.0-M6,
org.apache.directory.studio:org.slf4j.api:jar:2.0.0-SNAPSHOT: Could not find artifact org.apache.directory.server:apacheds-core-constants:jar:2.0.0-M6
in studio.repository (file://F:\hudson\hudson-slave\workspace\dir-studio-jdk16-win\trunk\libraries\org.apache.directory.server.core.constants)
Stack trace : 
org.apache.maven.lifecycle.LifecycleExecutionException: Failed to execute goal on project
org.apache.directory.server.core.constants: Could not resolve dependencies for project org.apache.directory.studio:org.apache.directory.server.core.constants:jar:2.0.0-SNAPSHOT:
The following artifacts could not be resolved: org.apache.directory.server:apacheds-core-constants:jar:2.0.0-M6,
org.apache.directory.studio:org.slf4j.api:jar:2.0.0-SNAPSHOT: Could not find artifact org.apache.directory.server:apacheds-core-constants:jar:2.0.0-M6
in studio.repository (file://F:\hudson\hudson-slave\workspace\dir-studio-jdk16-win\trunk\libraries\org.apache.directory.server.core.constants)
	at org.apache.maven.lifecycle.internal.LifecycleDependencyResolver.getDependencies(LifecycleDependencyResolver.java:190)
	at org.apache.maven.lifecycle.internal.LifecycleDependencyResolver.resolveProjectDependencies(LifecycleDependencyResolver.java:104)
	at org.apache.maven.lifecycle.internal.MojoExecutor.ensureDependenciesAreResolved(MojoExecutor.java:275)
	at org.apache.maven.lifecycle.internal.MojoExecutor.execute(MojoExecutor.java:201)
	at org.apache.maven.lifecycle.internal.MojoExecutor.execute(MojoExecutor.java:153)
	at org.apache.maven.lifecycle.internal.MojoExecutor.execute(MojoExecutor.java:145)
	at org.apache.maven.lifecycle.internal.LifecycleModuleBuilder.buildProject(LifecycleModuleBuilder.java:84)
	at org.apache.maven.lifecycle.internal.LifecycleModuleBuilder.buildProject(LifecycleModuleBuilder.java:59)
	at org.apache.maven.lifecycle.internal.LifecycleStarter.singleThreadedBuild(LifecycleStarter.java:183)
	at org.apache.maven.lifecycle.internal.LifecycleStarter.execute(LifecycleStarter.java:161)
	at org.apache.maven.DefaultMaven.doExecute(DefaultMaven.java:319)
	at org.apache.maven.DefaultMaven.execute(DefaultMaven.java:156)
	at org.jvnet.hudson.maven3.launcher.Maven3Launcher.main(Maven3Launcher.java:79)
	at sun.reflect.NativeMethodAccessorImpl.invoke0(Native Method)
	at sun.reflect.NativeMethodAccessorImpl.invoke(NativeMethodAccessorImpl.java:39)
	at sun.reflect.DelegatingMethodAccessorImpl.invoke(DelegatingMethodAccessorImpl.java:25)
	at java.lang.reflect.Method.invoke(Method.java:597)
	at org.codehaus.plexus.classworlds.launcher.Launcher.launchStandard(Launcher.java:329)
	at org.codehaus.plexus.classworlds.launcher.Launcher.launch(Launcher.java:239)
	at org.jvnet.hudson.maven3.agent.Maven3Main.launch(Maven3Main.java:158)
	at hudson.maven.Maven3Builder.call(Maven3Builder.java:104)
	at hudson.maven.Maven3Builder.call(Maven3Builder.java:70)
	at hudson.remoting.UserRequest.perform(UserRequest.java:118)
	at hudson.remoting.UserRequest.perform(UserRequest.java:48)
	at hudson.remoting.Request$2.run(Request.java:287)
	at hudson.remoting.InterceptingExecutorService$1.call(InterceptingExecutorService.java:72)
	at java.util.concurrent.FutureTask$Sync.innerRun(FutureTask.java:303)
	at java.util.concurrent.FutureTask.run(FutureTask.java:138)
	at java.util.concurrent.ThreadPoolExecutor$Worker.runTask(ThreadPoolExecutor.java:886)
	at java.util.concurrent.ThreadPoolExecutor$Worker.run(ThreadPoolExecutor.java:908)
	at java.lang.Thread.run(Thread.java:662)
Caused by: org.apache.maven.project.DependencyResolutionException: Could not resolve dependencies
for project org.apache.directory.studio:org.apache.directory.server.core.constants:jar:2.0.0-SNAPSHOT:
The following artifacts could not be resolved: org.apache.directory.server:apacheds-core-constants:jar:2.0.0-M6,
org.apache.directory.studio:org.slf4j.api:jar:2.0.0-SNAPSHOT: Could not find artifact org.apache.directory.server:apacheds-core-constants:jar:2.0.0-M6
in studio.repository (file://F:\hudson\hudson-slave\workspace\dir-studio-jdk16-win\trunk\libraries\org.apache.directory.server.core.constants)
	at org.apache.maven.project.DefaultProjectDependenciesResolver.resolve(DefaultProjectDependenciesResolver.java:156)
	at org.apache.maven.lifecycle.internal.LifecycleDependencyResolver.getDependencies(LifecycleDependencyResolver.java:165)
	... 30 more
Caused by: org.sonatype.aether.resolution.ArtifactResolutionException: The following artifacts
could not be resolved: org.apache.directory.server:apacheds-core-constants:jar:2.0.0-M6, org.apache.directory.studio:org.slf4j.api:jar:2.0.0-SNAPSHOT:
Could not find artifact org.apache.directory.server:apacheds-core-constants:jar:2.0.0-M6 in
studio.repository (file://F:\hudson\hudson-slave\workspace\dir-studio-jdk16-win\trunk\libraries\org.apache.directory.server.core.constants)
	at org.sonatype.aether.impl.internal.DefaultArtifactResolver.resolveArtifacts(DefaultArtifactResolver.java:526)
	at org.sonatype.aether.impl.internal.DefaultRepositorySystem.resolveArtifacts(DefaultRepositorySystem.java:304)
	at org.sonatype.aether.impl.internal.DefaultRepositorySystem.resolveDependencies(DefaultRepositorySystem.java:334)
	at org.apache.maven.project.DefaultProjectDependenciesResolver.resolve(DefaultProjectDependenciesResolver.java:150)
	... 31 more
Caused by: org.sonatype.aether.transfer.ArtifactNotFoundException: Could not find artifact
org.apache.directory.server:apacheds-core-constants:jar:2.0.0-M6 in studio.repository (file://F:\hudson\hudson-slave\workspace\dir-studio-jdk16-win\trunk\libraries\org.apache.directory.server.core.constants)
	at org.sonatype.aether.connector.wagon.WagonRepositoryConnector$4.wrap(WagonRepositoryConnector.java:945)
	at org.sonatype.aether.connector.wagon.WagonRepositoryConnector$4.wrap(WagonRepositoryConnector.java:940)
	at org.sonatype.aether.connector.wagon.WagonRepositoryConnector$GetTask.flush(WagonRepositoryConnector.java:696)
	at org.sonatype.aether.connector.wagon.WagonRepositoryConnector$GetTask.flush(WagonRepositoryConnector.java:690)
	at org.sonatype.aether.connector.wagon.WagonRepositoryConnector.get(WagonRepositoryConnector.java:435)
	at org.sonatype.aether.impl.internal.DefaultArtifactResolver.resolveArtifacts(DefaultArtifactResolver.java:438)
	... 34 more
channel stopped


Mime
View raw message