directory-notifications mailing list archives

Site index · List index
Message view « Date » · « Thread »
Top « Date » · « Thread »
From Apache Jenkins Server <jenk...@builds.apache.org>
Subject Build failed in Jenkins: dir-apacheds-jdk16-ubuntu-deploy #533
Date Sat, 11 Feb 2012 04:43:46 GMT
See <https://builds.apache.org/job/dir-apacheds-jdk16-ubuntu-deploy/533/changes>

Changes:

[elecharny] Used the constants created in LdapDecoder for the dapSession's attribute

------------------------------------------
[...truncated 3589 lines...]
[INFO] 
[INFO] --- maven-remote-resources-plugin:1.2.1:process (default) @ apacheds-protocol-kerberos
---
[debug] execute contextualize
[INFO] [INFO] Using 'UTF-8' encoding to copy filtered resources.
[INFO] Copying 0 resource
[INFO] Copying 3 resources

[INFO] --- maven-resources-plugin:2.5:resources (default-resources) @ apacheds-protocol-kerberos
---
[INFO] [INFO] Compiling 17 source files to <https://builds.apache.org/job/dir-apacheds-jdk16-ubuntu-deploy/ws/trunk/protocol-kerberos/target/classes>

[INFO] --- maven-compiler-plugin:2.3.2:compile (default-compile) @ apacheds-protocol-kerberos
---
[debug] execute contextualize
[INFO] [INFO] Using 'UTF-8' encoding to copy filtered resources.
[INFO] Copying 2 resources
[INFO] Copying 3 resources

[INFO] --- maven-resources-plugin:2.5:testResources (default-testResources) @ apacheds-protocol-kerberos
---
[INFO] 
[INFO] --- maven-compiler-plugin:2.3.2:testCompile (default-testCompile) @ apacheds-protocol-kerberos
---
[INFO] Compiling 11 source files to <https://builds.apache.org/job/dir-apacheds-jdk16-ubuntu-deploy/ws/trunk/protocol-kerberos/target/test-classes>
[INFO] Surefire report directory: <https://builds.apache.org/job/dir-apacheds-jdk16-ubuntu-deploy/ws/trunk/protocol-kerberos/target/surefire-reports>
[INFO] 
-------------------------------------------------------
 T E S T S
-------------------------------------------------------

[INFO] --- maven-surefire-plugin:2.10:test (default-test) @ apacheds-protocol-kerberos ---
Running org.apache.directory.server.kerberos.protocol.TicketGrantingServiceTest
Tests run: 37, Failures: 0, Errors: 0, Skipped: 1, Time elapsed: 1.489 sec
Running org.apache.directory.server.kerberos.protocol.AuthenticationPolicyTest
Tests run: 7, Failures: 0, Errors: 0, Skipped: 0, Time elapsed: 0.013 sec
Running org.apache.directory.server.kerberos.protocol.TicketGrantingEncryptionTypeTest
Tests run: 6, Failures: 0, Errors: 0, Skipped: 0, Time elapsed: 0.088 sec
Running org.apache.directory.server.kerberos.protocol.EncTktInSkeyTest
Tests run: 1, Failures: 0, Errors: 0, Skipped: 0, Time elapsed: 0.014 sec
Running org.apache.directory.server.kerberos.protocol.AuthenticationEncryptionTypeTest
Tests run: 4, Failures: 0, Errors: 0, Skipped: 1, Time elapsed: 0.041 sec
Running org.apache.directory.server.kerberos.protocol.TicketGrantingPolicyTest
Tests run: 12, Failures: 0, Errors: 0, Skipped: 0, Time elapsed: 0.164 sec
Running org.apache.directory.server.kerberos.protocol.PreAuthenticationTest
Tests run: 4, Failures: 0, Errors: 0, Skipped: 0, Time elapsed: 0.036 sec
Running org.apache.directory.server.kerberos.protocol.AuthenticationServiceTest
Tests run: 30, Failures: 0, Errors: 0, Skipped: 0, Time elapsed: 0.304 sec

Results :

Tests run: 101, Failures: 0, Errors: 0, Skipped: 2

[JENKINS] Recording test results
[INFO] 
[INFO] --- maven-bundle-plugin:2.3.4:bundle (default-bundle) @ apacheds-protocol-kerberos
---
[INFO] 
[INFO] --- maven-site-plugin:3.0:attach-descriptor (attach-descriptor) @ apacheds-protocol-kerberos
---
[INFO] [INFO] Checking legal files in: apacheds-protocol-kerberos-2.0.0-M6-SNAPSHOT.jar

[INFO] --- tools-maven-plugin:1.4:verify-legal-files (verify-legal-files) @ apacheds-protocol-kerberos
---
Feb 11, 2012 4:43:03 AM hudson.maven.ExecutedMojo <init>
WARNING: Failed to getClass for org.apache.maven.plugin.source.SourceJarMojo
[INFO] 
[INFO] --- maven-source-plugin:2.1.2:jar (attach-sources) @ apacheds-protocol-kerberos ---
[INFO] META-INF already added, skipping
[INFO] META-INF already added, skipping
[INFO] META-INF/NOTICE already added, skipping
[INFO] META-INF/DEPENDENCIES already added, skipping
[INFO] META-INF/LICENSE already added, skipping
[INFO] Building jar: <https://builds.apache.org/job/dir-apacheds-jdk16-ubuntu-deploy/ws/trunk/protocol-kerberos/target/apacheds-protocol-kerberos-2.0.0-M6-SNAPSHOT-sources.jar>
[INFO] META-INF already added, skipping
[INFO] META-INF already added, skipping
[INFO] META-INF/NOTICE already added, skipping
[INFO] META-INF/DEPENDENCIES already added, skipping
[INFO] META-INF/LICENSE already added, skipping
[INFO] [INFO] Installing <https://builds.apache.org/job/dir-apacheds-jdk16-ubuntu-deploy/ws/trunk/protocol-kerberos/target/apacheds-protocol-kerberos-2.0.0-M6-SNAPSHOT.jar>
to /home/jenkins/.m2/repository/org/apache/directory/server/apacheds-protocol-kerberos/2.0.0-M6-SNAPSHOT/apacheds-protocol-kerberos-2.0.0-M6-SNAPSHOT.jar
[INFO] Installing <https://builds.apache.org/job/dir-apacheds-jdk16-ubuntu-deploy/ws/trunk/protocol-kerberos/pom.xml>
to /home/jenkins/.m2/repository/org/apache/directory/server/apacheds-protocol-kerberos/2.0.0-M6-SNAPSHOT/apacheds-protocol-kerberos-2.0.0-M6-SNAPSHOT.pom

[INFO] --- maven-install-plugin:2.3.1:install (default-install) @ apacheds-protocol-kerberos
---
[INFO] Installing <https://builds.apache.org/job/dir-apacheds-jdk16-ubuntu-deploy/ws/trunk/protocol-kerberos/target/apacheds-protocol-kerberos-2.0.0-M6-SNAPSHOT-sources.jar>
to /home/jenkins/.m2/repository/org/apache/directory/server/apacheds-protocol-kerberos/2.0.0-M6-SNAPSHOT/apacheds-protocol-kerberos-2.0.0-M6-SNAPSHOT-sources.jar
[INFO] 
[INFO] --- maven-bundle-plugin:2.3.4:install (default-install) @ apacheds-protocol-kerberos
---
[INFO] Installing org/apache/directory/server/apacheds-protocol-kerberos/2.0.0-M6-SNAPSHOT/apacheds-protocol-kerberos-2.0.0-M6-SNAPSHOT.jar
[INFO] Writing OBR metadata
[INFO] Downloading: https://repository.apache.org/content/repositories/snapshots/org/apache/directory/server/apacheds-protocol-kerberos/2.0.0-M6-SNAPSHOT/maven-metadata.xml

[INFO] --- maven-deploy-plugin:2.7:deploy (default-deploy) @ apacheds-protocol-kerberos ---
Downloaded: https://repository.apache.org/content/repositories/snapshots/org/apache/directory/server/apacheds-protocol-kerberos/2.0.0-M6-SNAPSHOT/maven-metadata.xml
(2 KB at 3.3 KB/sec)
Uploading: https://repository.apache.org/content/repositories/snapshots/org/apache/directory/server/apacheds-protocol-kerberos/2.0.0-M6-SNAPSHOT/apacheds-protocol-kerberos-2.0.0-M6-20120211.044312-12.jar
Uploaded: https://repository.apache.org/content/repositories/snapshots/org/apache/directory/server/apacheds-protocol-kerberos/2.0.0-M6-SNAPSHOT/apacheds-protocol-kerberos-2.0.0-M6-20120211.044312-12.jar
(49 KB at 82.9 KB/sec)
Uploading: https://repository.apache.org/content/repositories/snapshots/org/apache/directory/server/apacheds-protocol-kerberos/2.0.0-M6-SNAPSHOT/apacheds-protocol-kerberos-2.0.0-M6-20120211.044312-12.pom
Uploaded: https://repository.apache.org/content/repositories/snapshots/org/apache/directory/server/apacheds-protocol-kerberos/2.0.0-M6-SNAPSHOT/apacheds-protocol-kerberos-2.0.0-M6-20120211.044312-12.pom
(5 KB at 20.9 KB/sec)
Downloading: https://repository.apache.org/content/repositories/snapshots/org/apache/directory/server/apacheds-protocol-kerberos/maven-metadata.xml
Downloaded: https://repository.apache.org/content/repositories/snapshots/org/apache/directory/server/apacheds-protocol-kerberos/maven-metadata.xml
(440 B at 1.9 KB/sec)
Uploading: https://repository.apache.org/content/repositories/snapshots/org/apache/directory/server/apacheds-protocol-kerberos/2.0.0-M6-SNAPSHOT/maven-metadata.xml
Uploaded: https://repository.apache.org/content/repositories/snapshots/org/apache/directory/server/apacheds-protocol-kerberos/2.0.0-M6-SNAPSHOT/maven-metadata.xml
(2 KB at 3.0 KB/sec)
Uploading: https://repository.apache.org/content/repositories/snapshots/org/apache/directory/server/apacheds-protocol-kerberos/maven-metadata.xml
Uploaded: https://repository.apache.org/content/repositories/snapshots/org/apache/directory/server/apacheds-protocol-kerberos/maven-metadata.xml
(419 B at 1.9 KB/sec)
Uploading: https://repository.apache.org/content/repositories/snapshots/org/apache/directory/server/apacheds-protocol-kerberos/2.0.0-M6-SNAPSHOT/apacheds-protocol-kerberos-2.0.0-M6-20120211.044312-12-sources.jar
Uploaded: https://repository.apache.org/content/repositories/snapshots/org/apache/directory/server/apacheds-protocol-kerberos/2.0.0-M6-SNAPSHOT/apacheds-protocol-kerberos-2.0.0-M6-20120211.044312-12-sources.jar
(44 KB at 197.9 KB/sec)
Uploading: https://repository.apache.org/content/repositories/snapshots/org/apache/directory/server/apacheds-protocol-kerberos/2.0.0-M6-SNAPSHOT/maven-metadata.xml
Uploaded: https://repository.apache.org/content/repositories/snapshots/org/apache/directory/server/apacheds-protocol-kerberos/2.0.0-M6-SNAPSHOT/maven-metadata.xml
(2 KB at 5.3 KB/sec)
[INFO] [INFO] Remote OBR update disabled (enable with -DremoteOBR)

[INFO] --- maven-bundle-plugin:2.3.4:deploy (default-deploy) @ apacheds-protocol-kerberos
---
[JENKINS] Archiving <https://builds.apache.org/job/dir-apacheds-jdk16-ubuntu-deploy/ws/trunk/protocol-kerberos/pom.xml>
to /home/hudson/hudson/jobs/dir-apacheds-jdk16-ubuntu-deploy/modules/org.apache.directory.server$apacheds-protocol-kerberos/builds/2012-02-11_04-01-51/archive/org.apache.directory.server/apacheds-protocol-kerberos/2.0.0-M6-SNAPSHOT/apacheds-protocol-kerberos-2.0.0-M6-SNAPSHOT.pom
[JENKINS] Archiving <https://builds.apache.org/job/dir-apacheds-jdk16-ubuntu-deploy/ws/trunk/protocol-kerberos/target/apacheds-protocol-kerberos-2.0.0-M6-SNAPSHOT.jar>
to /home/hudson/hudson/jobs/dir-apacheds-jdk16-ubuntu-deploy/modules/org.apache.directory.server$apacheds-protocol-kerberos/builds/2012-02-11_04-01-51/archive/org.apache.directory.server/apacheds-protocol-kerberos/2.0.0-M6-20120211.044312-12/apacheds-protocol-kerberos-2.0.0-M6-20120211.044312-12.jar
[JENKINS] Archiving <https://builds.apache.org/job/dir-apacheds-jdk16-ubuntu-deploy/ws/trunk/protocol-kerberos/target/apacheds-protocol-kerberos-2.0.0-M6-SNAPSHOT-sources.jar>
to /home/hudson/hudson/jobs/dir-apacheds-jdk16-ubuntu-deploy/modules/org.apache.directory.server$apacheds-protocol-kerberos/builds/2012-02-11_04-01-51/archive/org.apache.directory.server/apacheds-protocol-kerberos/2.0.0-M6-20120211.044312-12/apacheds-protocol-kerberos-2.0.0-M6-20120211.044312-12-sources.jar
[INFO] Downloading: http://repository.apache.org/snapshots/org/apache/directory/shared/shared-ldap-extras-sp/1.0.0-M11-SNAPSHOT/maven-metadata.xml
                                                                        
[INFO] ------------------------------------------------------------------------
[INFO] Building ApacheDS Protocol Ldap 2.0.0-M6-SNAPSHOT
[INFO] ------------------------------------------------------------------------
Downloaded: http://repository.apache.org/snapshots/org/apache/directory/shared/shared-ldap-extras-sp/1.0.0-M11-SNAPSHOT/maven-metadata.xml
(2 KB at 6.1 KB/sec)
Downloading: http://repository.apache.org/snapshots/org/apache/directory/shared/shared-ldap-extras-sp/1.0.0-M11-SNAPSHOT/shared-ldap-extras-sp-1.0.0-M11-20120210.030811-10.pom
Downloaded: http://repository.apache.org/snapshots/org/apache/directory/shared/shared-ldap-extras-sp/1.0.0-M11-SNAPSHOT/shared-ldap-extras-sp-1.0.0-M11-20120210.030811-10.pom
(4 KB at 33.3 KB/sec)
Downloading: http://repository.apache.org/snapshots/org/apache/directory/shared/shared-ldap-extras-sp/1.0.0-M11-SNAPSHOT/shared-ldap-extras-sp-1.0.0-M11-20120210.030811-10.jar
Downloaded: http://repository.apache.org/snapshots/org/apache/directory/shared/shared-ldap-extras-sp/1.0.0-M11-SNAPSHOT/shared-ldap-extras-sp-1.0.0-M11-20120210.030811-10.jar
(13 KB at 69.9 KB/sec)
[INFO] [INFO] Deleting <https://builds.apache.org/job/dir-apacheds-jdk16-ubuntu-deploy/ws/trunk/protocol-ldap/target>

[INFO] --- maven-clean-plugin:2.4.1:clean (default-clean) @ apacheds-protocol-ldap ---
[INFO] 
[INFO] --- maven-remote-resources-plugin:1.2.1:process (default) @ apacheds-protocol-ldap
---
Downloading: http://repository.apache.org/snapshots/org/apache/directory/shared/shared-ldap-extras-sp/1.0.0-M11-SNAPSHOT/maven-metadata.xml
Downloaded: http://repository.apache.org/snapshots/org/apache/directory/shared/shared-ldap-extras-sp/1.0.0-M11-SNAPSHOT/maven-metadata.xml
(2 KB at 9.3 KB/sec)
[INFO] [debug] execute contextualize
[INFO] Using 'UTF-8' encoding to copy filtered resources.

[INFO] --- maven-resources-plugin:2.5:resources (default-resources) @ apacheds-protocol-ldap
---[INFO] Copying 0 resource
[INFO] Copying 3 resources

[INFO] 
[INFO] --- maven-compiler-plugin:2.3.2:compile (default-compile) @ apacheds-protocol-ldap
---
[INFO] Compiling 64 source files to <https://builds.apache.org/job/dir-apacheds-jdk16-ubuntu-deploy/ws/trunk/protocol-ldap/target/classes>
[INFO] -------------------------------------------------------------
[ERROR] COMPILATION ERROR : 
[INFO] -------------------------------------------------------------
[ERROR] <https://builds.apache.org/job/dir-apacheds-jdk16-ubuntu-deploy/ws/trunk/protocol-ldap/src/main/java/org/apache/directory/server/ldap/LdapProtocolHandler.java>:[87,41]
cannot find symbol
symbol  : variable MAX_PDU_SIZE_ATTR
location: class org.apache.directory.shared.ldap.codec.api.LdapDecoder
[ERROR] <https://builds.apache.org/job/dir-apacheds-jdk16-ubuntu-deploy/ws/trunk/protocol-ldap/src/main/java/org/apache/directory/server/ldap/LdapProtocolHandler.java>:[96,41]
cannot find symbol
symbol  : variable MESSAGE_CONTAINER_ATTR
location: class org.apache.directory.shared.ldap.codec.api.LdapDecoder
[INFO] 2 errors 
[INFO] -------------------------------------------------------------
[JENKINS] Archiving <https://builds.apache.org/job/dir-apacheds-jdk16-ubuntu-deploy/ws/trunk/protocol-ldap/pom.xml>
to /home/hudson/hudson/jobs/dir-apacheds-jdk16-ubuntu-deploy/modules/org.apache.directory.server$apacheds-protocol-ldap/builds/2012-02-11_04-01-51/archive/org.apache.directory.server/apacheds-protocol-ldap/2.0.0-M6-SNAPSHOT/apacheds-protocol-ldap-2.0.0-M6-SNAPSHOT.pom
[INFO] ------------------------------------------------------------------------
[INFO] Reactor Summary:
[INFO] 
[INFO] ApacheDS .......................................... SUCCESS [8:17.769s]
[INFO] ApacheDS I18n ..................................... SUCCESS [21.174s]
[INFO] ApacheDS Core Constants ........................... SUCCESS [17.890s]
[INFO] ApacheDS Core API ................................. SUCCESS [1:17.051s]
[INFO] ApacheDS Core Shared .............................. SUCCESS [20.600s]
[INFO] ApacheDS Interceptors ............................. SUCCESS [8.848s]
[INFO] ApacheDS AdministrativePoint Interceptor .......... SUCCESS [13.348s]
[INFO] ApacheDS Authentication Interceptor ............... SUCCESS [29.898s]
[INFO] ApacheDS Authorization Interceptor ................ SUCCESS [34.993s]
[INFO] ApacheDS ChangeLog Interceptor .................... SUCCESS [20.348s]
[INFO] ApacheDS Collective Attribute Interceptor ......... SUCCESS [21.033s]
[INFO] ApacheDS Event Interceptor ........................ SUCCESS [31.818s]
[INFO] ApacheDS Exception Interceptor .................... SUCCESS [28.513s]
[INFO] ApacheDS Journal Interceptor ...................... SUCCESS [34.224s]
[INFO] ApacheDS Normalization Interceptor ................ SUCCESS [42.778s]
[INFO] ApacheDS Operational Attribute Interceptor ........ SUCCESS [34.358s]
[INFO] ApacheDS Referral Interceptor ..................... SUCCESS [33.847s]
[INFO] ApacheDS Schema Interceptor ....................... SUCCESS [53.510s]
[INFO] ApacheDS Subtree Interceptor ...................... SUCCESS [1:12.168s]
[INFO] ApacheDS Triggers Interceptor ..................... SUCCESS [26.317s]
[INFO] ApacheDS Core ..................................... SUCCESS [31.382s]
[INFO] ApacheDS Core AVL ................................. SUCCESS [19.609s]
[INFO] ApacheDS Generalized (X) DBM Partition ............ SUCCESS [50.457s]
[INFO] ApacheDS LDIF Partition ........................... SUCCESS [42.757s]
[INFO] ApacheDS JDBM implementation ...................... SUCCESS [4:10.666s]
[INFO] ApacheDS JDBM Partition ........................... SUCCESS [55.245s]
[INFO] ApacheDS Core Annotations ......................... SUCCESS [1:22.957s]
[INFO] ApacheDS Core JNDI ................................ SUCCESS [39.060s]
[INFO] ApacheDS Protocol Shared .......................... SUCCESS [26.273s]
[INFO] ApacheDS Protocol Kerberos Codec .................. SUCCESS [1:13.485s]
[INFO] ApacheDS Interceptors for Kerberos ................ SUCCESS [34.001s]
[INFO] ApacheDS Protocol Dhcp ............................ SUCCESS [26.150s]
[INFO] ApacheDS Protocol Dns ............................. SUCCESS [43.450s]
[INFO] ApacheDS Protocol Kerberos ........................ SUCCESS [42.320s]
[INFO] ApacheDS Protocol Ldap ............................ FAILURE [15.661s]
[INFO] ApacheDS Protocol Ntp ............................. SKIPPED
[INFO] Apacheds Server Annotations ....................... SKIPPED
[INFO] ApacheDS Server Config ............................ SKIPPED
[INFO] ApacheDS Server JNDI .............................. SKIPPED
[INFO] ApacheDS Server Replication Service ............... SKIPPED
[INFO] ApacheDS Test Framework ........................... SKIPPED
[INFO] ApacheDS Generalized (X) DBM Tools ................ SKIPPED
[INFO] ApacheDS All ...................................... SKIPPED
[INFO] ApacheDS JDBM implementation ...................... SKIPPED
[INFO] ApacheDS Logger Interceptor ....................... SKIPPED
[INFO] ApacheDS Password Hashing Interceptor ............. SKIPPED
[INFO] ApacheDS Core Integration ......................... SKIPPED
[INFO] ApacheDS Server Integration ....................... SKIPPED
[INFO] ApacheDS DirectoryService-WebApp bridge ........... SKIPPED
[INFO] ApacheDS Jetty HTTP Server Integration ............ SKIPPED
[INFO] ApacheDS Service Builder .......................... SKIPPED
[INFO] ApacheDS Protocol Kerberos Test ................... SKIPPED
[INFO] Apache Directory LDAP Client API test ............. SKIPPED
[INFO] ApacheDS Service .................................. SKIPPED
[INFO] ApacheDS Wrapper .................................. SKIPPED
[INFO] ApacheDS Installers Maven Plugin .................. SKIPPED
[INFO] ApacheDS Installers ............................... SKIPPED
[INFO] ------------------------------------------------------------------------
[INFO] BUILD FAILURE
[INFO] ------------------------------------------------------------------------
[INFO] Total time: 37:06.808s
[INFO] Finished at: Sat Feb 11 04:43:37 UTC 2012
[INFO] Final Memory: 129M/367M
[INFO] ------------------------------------------------------------------------
mavenExecutionResult exceptions not empty
message : Failed to execute goal org.apache.maven.plugins:maven-compiler-plugin:2.3.2:compile
(default-compile) on project apacheds-protocol-ldap: Compilation failure
cause : Compilation failure
Stack trace : 
org.apache.maven.lifecycle.LifecycleExecutionException: Failed to execute goal org.apache.maven.plugins:maven-compiler-plugin:2.3.2:compile
(default-compile) on project apacheds-protocol-ldap: Compilation failure
	at org.apache.maven.lifecycle.internal.MojoExecutor.execute(MojoExecutor.java:213)
	at org.apache.maven.lifecycle.internal.MojoExecutor.execute(MojoExecutor.java:153)
	at org.apache.maven.lifecycle.internal.MojoExecutor.execute(MojoExecutor.java:145)
	at org.apache.maven.lifecycle.internal.LifecycleModuleBuilder.buildProject(LifecycleModuleBuilder.java:84)
	at org.apache.maven.lifecycle.internal.LifecycleModuleBuilder.buildProject(LifecycleModuleBuilder.java:59)
	at org.apache.maven.lifecycle.internal.LifecycleStarter.singleThreadedBuild(LifecycleStarter.java:183)
	at org.apache.maven.lifecycle.internal.LifecycleStarter.execute(LifecycleStarter.java:161)
	at org.apache.maven.DefaultMaven.doExecute(DefaultMaven.java:319)
	at org.apache.maven.DefaultMaven.execute(DefaultMaven.java:156)
	at org.jvnet.hudson.maven3.launcher.Maven3Launcher.main(Maven3Launcher.java:79)
	at sun.reflect.NativeMethodAccessorImpl.invoke0(Native Method)
	at sun.reflect.NativeMethodAccessorImpl.invoke(NativeMethodAccessorImpl.java:39)
	at sun.reflect.DelegatingMethodAccessorImpl.invoke(DelegatingMethodAccessorImpl.java:25)
	at java.lang.reflect.Method.invoke(Method.java:597)
	at org.codehaus.plexus.classworlds.launcher.Launcher.launchStandard(Launcher.java:329)
	at org.codehaus.plexus.classworlds.launcher.Launcher.launch(Launcher.java:239)
	at org.jvnet.hudson.maven3.agent.Maven3Main.launch(Maven3Main.java:158)
	at hudson.maven.Maven3Builder.call(Maven3Builder.java:104)
	at hudson.maven.Maven3Builder.call(Maven3Builder.java:70)
	at hudson.remoting.UserRequest.perform(UserRequest.java:118)
	at hudson.remoting.UserRequest.perform(UserRequest.java:48)
	at hudson.remoting.Request$2.run(Request.java:287)
	at java.util.concurrent.Executors$RunnableAdapter.call(Executors.java:441)
	at java.util.concurrent.FutureTask$Sync.innerRun(FutureTask.java:303)
	at java.util.concurrent.FutureTask.run(FutureTask.java:138)
	at java.util.concurrent.ThreadPoolExecutor$Worker.runTask(ThreadPoolExecutor.java:886)
	at java.util.concurrent.ThreadPoolExecutor$Worker.run(ThreadPoolExecutor.java:908)
	at java.lang.Thread.run(Thread.java:619)
Caused by: org.apache.maven.plugin.CompilationFailureException: Compilation failure
	at org.apache.maven.plugin.AbstractCompilerMojo.execute(AbstractCompilerMojo.java:656)
	at org.apache.maven.plugin.CompilerMojo.execute(CompilerMojo.java:128)
	at org.apache.maven.plugin.DefaultBuildPluginManager.executeMojo(DefaultBuildPluginManager.java:101)
	at org.apache.maven.lifecycle.internal.MojoExecutor.execute(MojoExecutor.java:209)
	... 27 more
channel stopped


Mime
View raw message