directory-notifications mailing list archives

Site index · List index
Message view « Date » · « Thread »
Top « Date » · « Thread »
From Apache Jenkins Server <jenk...@builds.apache.org>
Subject Build failed in Jenkins: dir-apacheds-jdk16-ubuntu-deploy #536
Date Thu, 16 Feb 2012 04:02:42 GMT
See <https://builds.apache.org/job/dir-apacheds-jdk16-ubuntu-deploy/536/changes>

Changes:

[elecharny] Some more Camel Casing...

[elecharny] Some more camel-cased classes renaming

[elecharny] 

[elecharny] Second step in the renaming of DITCOntentRule to DitContentRule. We can thanks
Apple for his stupid case insensitive/case preserving FS !

[elecharny] o Renamed DITContentRule to DContentRule (fist step toward the rename of this
class to DitContentRule, as all the other camel cased classes)

[elecharny] o Moved the addToRegistries() method out of ObjectClass to a dedicated helper
class (ObjectClassHelper)
o Create a sub-package helper in registries for the helper classes
o Removed a useless import
o Fixed a test

[elecharny] Reverted the previous change : we can't get rid of the registries here, this is
the place where we modify an existing SchemaManager by changing a copy of its internal Registries.
Trying to modify the SchemaManager instead will lead to very painful potential schema breakage
!

[elecharny] o get rid of direct references to the Registries class, we now use teh SchemaManager
instead.

------------------------------------------
[...truncated 294 lines...]
Downloaded: http://repository.apache.org/snapshots/org/apache/directory/shared/shared-ldap-client-parent/1.0.0-M11-SNAPSHOT/maven-metadata.xml
(639 B at 5.8 KB/sec)
Downloading: http://repository.apache.org/snapshots/org/apache/directory/shared/shared-ldap-parent/1.0.0-M11-SNAPSHOT/maven-metadata.xml
Downloaded: http://repository.apache.org/snapshots/org/apache/directory/shared/shared-ldap-parent/1.0.0-M11-SNAPSHOT/maven-metadata.xml
(632 B at 7.0 KB/sec)
Downloading: http://repository.apache.org/snapshots/org/apache/directory/shared/shared-ldap-schema-data/1.0.0-M11-SNAPSHOT/maven-metadata.xml
Downloaded: http://repository.apache.org/snapshots/org/apache/directory/shared/shared-ldap-schema-data/1.0.0-M11-SNAPSHOT/maven-metadata.xml
(2 KB at 8.5 KB/sec)
Downloading: http://repository.apache.org/snapshots/org/apache/directory/shared/shared-ldap-schema-parent/1.0.0-M11-SNAPSHOT/maven-metadata.xml
Downloaded: http://repository.apache.org/snapshots/org/apache/directory/shared/shared-ldap-schema-parent/1.0.0-M11-SNAPSHOT/maven-metadata.xml
(639 B at 6.4 KB/sec)
Downloading: http://repository.apache.org/snapshots/org/apache/directory/shared/shared-ldap-model/1.0.0-M11-SNAPSHOT/maven-metadata.xml
Downloaded: http://repository.apache.org/snapshots/org/apache/directory/shared/shared-ldap-model/1.0.0-M11-SNAPSHOT/maven-metadata.xml
(2 KB at 9.3 KB/sec)
Downloading: http://repository.apache.org/snapshots/org/apache/directory/shared/shared-util/1.0.0-M11-SNAPSHOT/maven-metadata.xml
Downloaded: http://repository.apache.org/snapshots/org/apache/directory/shared/shared-util/1.0.0-M11-SNAPSHOT/maven-metadata.xml
(1022 B at 8.7 KB/sec)
Downloading: http://repository.apache.org/snapshots/org/apache/directory/shared/shared-asn1-ber/1.0.0-M11-SNAPSHOT/maven-metadata.xml
Downloaded: http://repository.apache.org/snapshots/org/apache/directory/shared/shared-asn1-ber/1.0.0-M11-SNAPSHOT/maven-metadata.xml
(2 KB at 9.0 KB/sec)
Downloading: http://repository.apache.org/snapshots/org/apache/directory/shared/shared-ldap-codec-core/1.0.0-M11-SNAPSHOT/maven-metadata.xml
Downloaded: http://repository.apache.org/snapshots/org/apache/directory/shared/shared-ldap-codec-core/1.0.0-M11-SNAPSHOT/maven-metadata.xml
(2 KB at 8.2 KB/sec)
Downloading: http://repository.apache.org/snapshots/org/apache/directory/shared/shared-ldap-codec-parent/1.0.0-M11-SNAPSHOT/maven-metadata.xml
Downloaded: http://repository.apache.org/snapshots/org/apache/directory/shared/shared-ldap-codec-parent/1.0.0-M11-SNAPSHOT/maven-metadata.xml
(638 B at 7.0 KB/sec)
Downloading: http://repository.apache.org/snapshots/org/apache/directory/shared/shared-ldap-extras-aci/1.0.0-M11-SNAPSHOT/maven-metadata.xml
Downloaded: http://repository.apache.org/snapshots/org/apache/directory/shared/shared-ldap-extras-aci/1.0.0-M11-SNAPSHOT/maven-metadata.xml
(2 KB at 11.7 KB/sec)
Downloading: http://repository.apache.org/snapshots/org/apache/directory/shared/shared-ldap-extras-parent/1.0.0-M11-SNAPSHOT/maven-metadata.xml
Downloaded: http://repository.apache.org/snapshots/org/apache/directory/shared/shared-ldap-extras-parent/1.0.0-M11-SNAPSHOT/maven-metadata.xml
(639 B at 4.8 KB/sec)
Downloading: http://repository.apache.org/snapshots/org/apache/directory/shared/shared-ldap-extras-util/1.0.0-M11-SNAPSHOT/maven-metadata.xml
Downloaded: http://repository.apache.org/snapshots/org/apache/directory/shared/shared-ldap-extras-util/1.0.0-M11-SNAPSHOT/maven-metadata.xml
(2 KB at 8.6 KB/sec)
[INFO] [INFO] Deleting <https://builds.apache.org/job/dir-apacheds-jdk16-ubuntu-deploy/ws/trunk/core-api/target>

[INFO] --- maven-clean-plugin:2.4.1:clean (default-clean) @ apacheds-core-api ---
[INFO] 
[INFO] --- maven-remote-resources-plugin:1.2.1:process (default) @ apacheds-core-api ---
Downloading: http://repository.apache.org/snapshots/org/apache/directory/shared/shared-i18n/1.0.0-M11-SNAPSHOT/maven-metadata.xml
Downloaded: http://repository.apache.org/snapshots/org/apache/directory/shared/shared-i18n/1.0.0-M11-SNAPSHOT/maven-metadata.xml
(1022 B at 2.3 KB/sec)
Downloading: http://repository.apache.org/snapshots/org/apache/directory/shared/shared-ldap-schema-data/1.0.0-M11-SNAPSHOT/maven-metadata.xml
Downloaded: http://repository.apache.org/snapshots/org/apache/directory/shared/shared-ldap-schema-data/1.0.0-M11-SNAPSHOT/maven-metadata.xml
(2 KB at 2.8 KB/sec)
Downloading: http://repository.apache.org/snapshots/org/apache/directory/shared/shared-ldap-model/1.0.0-M11-SNAPSHOT/maven-metadata.xml
Downloaded: http://repository.apache.org/snapshots/org/apache/directory/shared/shared-ldap-model/1.0.0-M11-SNAPSHOT/maven-metadata.xml
(2 KB at 4.0 KB/sec)
Downloading: http://repository.apache.org/snapshots/org/apache/directory/shared/shared-util/1.0.0-M11-SNAPSHOT/maven-metadata.xml
Downloaded: http://repository.apache.org/snapshots/org/apache/directory/shared/shared-util/1.0.0-M11-SNAPSHOT/maven-metadata.xml
(1022 B at 9.8 KB/sec)
Downloading: http://repository.apache.org/snapshots/org/apache/directory/shared/shared-asn1-api/1.0.0-M11-SNAPSHOT/maven-metadata.xml
Downloaded: http://repository.apache.org/snapshots/org/apache/directory/shared/shared-asn1-api/1.0.0-M11-SNAPSHOT/maven-metadata.xml
(2 KB at 11.3 KB/sec)
Downloading: http://repository.apache.org/snapshots/org/apache/directory/shared/shared-asn1-ber/1.0.0-M11-SNAPSHOT/maven-metadata.xml
Downloaded: http://repository.apache.org/snapshots/org/apache/directory/shared/shared-asn1-ber/1.0.0-M11-SNAPSHOT/maven-metadata.xml
(2 KB at 12.1 KB/sec)
Downloading: http://repository.apache.org/snapshots/org/apache/directory/shared/shared-ldap-codec-core/1.0.0-M11-SNAPSHOT/maven-metadata.xml
Downloaded: http://repository.apache.org/snapshots/org/apache/directory/shared/shared-ldap-codec-core/1.0.0-M11-SNAPSHOT/maven-metadata.xml
(2 KB at 4.2 KB/sec)
Downloading: http://repository.apache.org/snapshots/org/apache/directory/shared/shared-ldap-client-api/1.0.0-M11-SNAPSHOT/maven-metadata.xml
Downloaded: http://repository.apache.org/snapshots/org/apache/directory/shared/shared-ldap-client-api/1.0.0-M11-SNAPSHOT/maven-metadata.xml
(2 KB at 11.7 KB/sec)
Downloading: http://repository.apache.org/snapshots/org/apache/directory/shared/shared-ldap-extras-util/1.0.0-M11-SNAPSHOT/maven-metadata.xml
Downloaded: http://repository.apache.org/snapshots/org/apache/directory/shared/shared-ldap-extras-util/1.0.0-M11-SNAPSHOT/maven-metadata.xml
(2 KB at 12.8 KB/sec)
Downloading: http://repository.apache.org/snapshots/org/apache/directory/shared/shared-ldap-extras-aci/1.0.0-M11-SNAPSHOT/maven-metadata.xml
Downloaded: http://repository.apache.org/snapshots/org/apache/directory/shared/shared-ldap-extras-aci/1.0.0-M11-SNAPSHOT/maven-metadata.xml
(2 KB at 12.9 KB/sec)
[debug] execute contextualize
[INFO] [INFO] Using 'UTF-8' encoding to copy filtered resources.
[INFO] Copying 1 resource
[INFO] Copying 3 resources

[INFO] --- maven-resources-plugin:2.5:resources (default-resources) @ apacheds-core-api ---
[INFO] 
[INFO] --- maven-compiler-plugin:2.3.2:compile (default-compile) @ apacheds-core-api ---
[INFO] Compiling 133 source files to <https://builds.apache.org/job/dir-apacheds-jdk16-ubuntu-deploy/ws/trunk/core-api/target/classes>
[INFO] -------------------------------------------------------------
[ERROR] COMPILATION ERROR : 
[INFO] -------------------------------------------------------------
[ERROR] <https://builds.apache.org/job/dir-apacheds-jdk16-ubuntu-deploy/ws/trunk/core-api/src/main/java/org/apache/directory/server/core/api/schema/registries/synchronizers/DitContentRuleSynchronizer.java>:[28,52]
cannot find symbol
symbol  : class DitContentRule
location: package org.apache.directory.shared.ldap.model.schema
[ERROR] <https://builds.apache.org/job/dir-apacheds-jdk16-ubuntu-deploy/ws/trunk/core-api/src/main/java/org/apache/directory/server/core/api/schema/registries/synchronizers/DitContentRuleSynchronizer.java>:[112,21]
cannot find symbol
symbol  : class DitContentRule
location: class org.apache.directory.server.core.api.schema.registries.synchronizers.DitContentRuleSynchronizer
[ERROR] <https://builds.apache.org/job/dir-apacheds-jdk16-ubuntu-deploy/ws/trunk/core-api/src/main/java/org/apache/directory/server/core/api/schema/registries/synchronizers/DitContentRuleSynchronizer.java>:[118,24]
cannot find symbol
symbol  : class DitContentRule
location: class org.apache.directory.server.core.api.schema.registries.synchronizers.DitContentRuleSynchronizer
[ERROR] <https://builds.apache.org/job/dir-apacheds-jdk16-ubuntu-deploy/ws/trunk/core-api/src/main/java/org/apache/directory/server/core/api/schema/DescriptionParsers.java>:[33,52]
cannot find symbol
symbol  : class DitContentRule
location: package org.apache.directory.shared.ldap.model.schema
[ERROR] <https://builds.apache.org/job/dir-apacheds-jdk16-ubuntu-deploy/ws/trunk/core-api/src/main/java/org/apache/directory/server/core/api/schema/DescriptionParsers.java>:[34,52]
cannot find symbol
symbol  : class DitStructureRule
location: package org.apache.directory.shared.ldap.model.schema
[ERROR] <https://builds.apache.org/job/dir-apacheds-jdk16-ubuntu-deploy/ws/trunk/core-api/src/main/java/org/apache/directory/server/core/api/schema/DescriptionParsers.java>:[42,60]
cannot find symbol
symbol  : class DitContentRuleDescriptionSchemaParser
location: package org.apache.directory.shared.ldap.model.schema.parsers
[ERROR] <https://builds.apache.org/job/dir-apacheds-jdk16-ubuntu-deploy/ws/trunk/core-api/src/main/java/org/apache/directory/server/core/api/schema/DescriptionParsers.java>:[43,60]
cannot find symbol
symbol  : class DitStructureRuleDescriptionSchemaParser
location: package org.apache.directory.shared.ldap.model.schema.parsers
[ERROR] <https://builds.apache.org/job/dir-apacheds-jdk16-ubuntu-deploy/ws/trunk/core-api/src/main/java/org/apache/directory/server/core/api/schema/DescriptionParsers.java>:[77,25]
cannot find symbol
symbol  : class DitStructureRule
location: class org.apache.directory.server.core.api.schema.DescriptionParsers
[ERROR] <https://builds.apache.org/job/dir-apacheds-jdk16-ubuntu-deploy/ws/trunk/core-api/src/main/java/org/apache/directory/server/core/api/schema/DescriptionParsers.java>:[78,25]
cannot find symbol
symbol  : class DitContentRule
location: class org.apache.directory.server.core.api.schema.DescriptionParsers
[ERROR] <https://builds.apache.org/job/dir-apacheds-jdk16-ubuntu-deploy/ws/trunk/core-api/src/main/java/org/apache/directory/server/core/api/schema/DescriptionParsers.java>:[90,18]
cannot find symbol
symbol  : class DitStructureRuleDescriptionSchemaParser
location: class org.apache.directory.server.core.api.schema.DescriptionParsers
[ERROR] <https://builds.apache.org/job/dir-apacheds-jdk16-ubuntu-deploy/ws/trunk/core-api/src/main/java/org/apache/directory/server/core/api/schema/DescriptionParsers.java>:[91,18]
cannot find symbol
symbol  : class DitContentRuleDescriptionSchemaParser
location: class org.apache.directory.server.core.api.schema.DescriptionParsers
[ERROR] <https://builds.apache.org/job/dir-apacheds-jdk16-ubuntu-deploy/ws/trunk/core-api/src/main/java/org/apache/directory/server/core/api/schema/DescriptionParsers.java>:[538,11]
cannot find symbol
symbol  : class DitStructureRule
location: class org.apache.directory.server.core.api.schema.DescriptionParsers
[ERROR] <https://builds.apache.org/job/dir-apacheds-jdk16-ubuntu-deploy/ws/trunk/core-api/src/main/java/org/apache/directory/server/core/api/schema/DescriptionParsers.java>:[582,11]
cannot find symbol
symbol  : class DitContentRule
location: class org.apache.directory.server.core.api.schema.DescriptionParsers
[ERROR] <https://builds.apache.org/job/dir-apacheds-jdk16-ubuntu-deploy/ws/trunk/core-api/src/main/java/org/apache/directory/server/core/api/schema/registries/synchronizers/DitStructureRuleSynchronizer.java>:[28,52]
cannot find symbol
symbol  : class DitStructureRule
location: package org.apache.directory.shared.ldap.model.schema
[ERROR] <https://builds.apache.org/job/dir-apacheds-jdk16-ubuntu-deploy/ws/trunk/core-api/src/main/java/org/apache/directory/server/core/api/schema/registries/synchronizers/DitStructureRuleSynchronizer.java>:[117,21]
cannot find symbol
symbol  : class DitStructureRule
location: class org.apache.directory.server.core.api.schema.registries.synchronizers.DitStructureRuleSynchronizer
[ERROR] <https://builds.apache.org/job/dir-apacheds-jdk16-ubuntu-deploy/ws/trunk/core-api/src/main/java/org/apache/directory/server/core/api/schema/registries/synchronizers/DitStructureRuleSynchronizer.java>:[123,24]
cannot find symbol
symbol  : class DitStructureRule
location: class org.apache.directory.server.core.api.schema.registries.synchronizers.DitStructureRuleSynchronizer
[ERROR] <https://builds.apache.org/job/dir-apacheds-jdk16-ubuntu-deploy/ws/trunk/core-api/src/main/java/org/apache/directory/server/core/api/LdapCoreSessionConnection.java>:[102,7]
org.apache.directory.server.core.api.LdapCoreSessionConnection is not abstract and does not
override abstract method loadDefaultSchema() in org.apache.directory.ldap.client.api.LdapConnection
[ERROR] <https://builds.apache.org/job/dir-apacheds-jdk16-ubuntu-deploy/ws/trunk/core-api/src/main/java/org/apache/directory/server/core/api/schema/DescriptionParsers.java>:[77,76]
cannot find symbol
symbol  : class DitStructureRule
location: class org.apache.directory.server.core.api.schema.DescriptionParsers
[ERROR] <https://builds.apache.org/job/dir-apacheds-jdk16-ubuntu-deploy/ws/trunk/core-api/src/main/java/org/apache/directory/server/core/api/schema/DescriptionParsers.java>:[78,72]
cannot find symbol
symbol  : class DitContentRule
location: class org.apache.directory.server.core.api.schema.DescriptionParsers
[ERROR] <https://builds.apache.org/job/dir-apacheds-jdk16-ubuntu-deploy/ws/trunk/core-api/src/main/java/org/apache/directory/server/core/api/schema/DescriptionParsers.java>:[90,87]
cannot find symbol
symbol  : class DitStructureRuleDescriptionSchemaParser
location: class org.apache.directory.server.core.api.schema.DescriptionParsers
[ERROR] <https://builds.apache.org/job/dir-apacheds-jdk16-ubuntu-deploy/ws/trunk/core-api/src/main/java/org/apache/directory/server/core/api/schema/DescriptionParsers.java>:[91,83]
cannot find symbol
symbol  : class DitContentRuleDescriptionSchemaParser
location: class org.apache.directory.server.core.api.schema.DescriptionParsers
[ERROR] <https://builds.apache.org/job/dir-apacheds-jdk16-ubuntu-deploy/ws/trunk/core-api/src/main/java/org/apache/directory/server/core/api/schema/DescriptionParsers.java>:[545,8]
cannot find symbol
symbol  : class DitStructureRule
location: class org.apache.directory.server.core.api.schema.DescriptionParsers
[ERROR] <https://builds.apache.org/job/dir-apacheds-jdk16-ubuntu-deploy/ws/trunk/core-api/src/main/java/org/apache/directory/server/core/api/schema/DescriptionParsers.java>:[545,51]
cannot find symbol
symbol  : class DitStructureRule
location: class org.apache.directory.server.core.api.schema.DescriptionParsers
[ERROR] <https://builds.apache.org/job/dir-apacheds-jdk16-ubuntu-deploy/ws/trunk/core-api/src/main/java/org/apache/directory/server/core/api/schema/DescriptionParsers.java>:[551,12]
cannot find symbol
symbol  : class DitStructureRule
location: class org.apache.directory.server.core.api.schema.DescriptionParsers
[ERROR] <https://builds.apache.org/job/dir-apacheds-jdk16-ubuntu-deploy/ws/trunk/core-api/src/main/java/org/apache/directory/server/core/api/schema/DescriptionParsers.java>:[589,8]
cannot find symbol
symbol  : class DitContentRule
location: class org.apache.directory.server.core.api.schema.DescriptionParsers
[ERROR] <https://builds.apache.org/job/dir-apacheds-jdk16-ubuntu-deploy/ws/trunk/core-api/src/main/java/org/apache/directory/server/core/api/schema/DescriptionParsers.java>:[589,47]
cannot find symbol
symbol  : class DitContentRule
location: class org.apache.directory.server.core.api.schema.DescriptionParsers
[ERROR] <https://builds.apache.org/job/dir-apacheds-jdk16-ubuntu-deploy/ws/trunk/core-api/src/main/java/org/apache/directory/server/core/api/schema/DescriptionParsers.java>:[595,12]
cannot find symbol
symbol  : class DitContentRule
location: class org.apache.directory.server.core.api.schema.DescriptionParsers
[INFO] 27 errors 
[INFO] -------------------------------------------------------------
[JENKINS] Archiving <https://builds.apache.org/job/dir-apacheds-jdk16-ubuntu-deploy/ws/trunk/core-api/pom.xml>
to /home/hudson/hudson/jobs/dir-apacheds-jdk16-ubuntu-deploy/modules/org.apache.directory.server$apacheds-core-api/builds/2012-02-16_04-01-20/archive/org.apache.directory.server/apacheds-core-api/2.0.0-M6-SNAPSHOT/apacheds-core-api-2.0.0-M6-SNAPSHOT.pom
[INFO] ------------------------------------------------------------------------
[INFO] Reactor Summary:
[INFO] 
[INFO] ApacheDS .......................................... SUCCESS [34.388s]
[INFO] ApacheDS I18n ..................................... SUCCESS [10.104s]
[INFO] ApacheDS Core Constants ........................... SUCCESS [6.363s]
[INFO] ApacheDS Core API ................................. FAILURE [8.475s]
[INFO] ApacheDS Core Shared .............................. SKIPPED
[INFO] ApacheDS Interceptors ............................. SKIPPED
[INFO] ApacheDS AdministrativePoint Interceptor .......... SKIPPED
[INFO] ApacheDS Authentication Interceptor ............... SKIPPED
[INFO] ApacheDS Authorization Interceptor ................ SKIPPED
[INFO] ApacheDS ChangeLog Interceptor .................... SKIPPED
[INFO] ApacheDS Collective Attribute Interceptor ......... SKIPPED
[INFO] ApacheDS Event Interceptor ........................ SKIPPED
[INFO] ApacheDS Exception Interceptor .................... SKIPPED
[INFO] ApacheDS Journal Interceptor ...................... SKIPPED
[INFO] ApacheDS Normalization Interceptor ................ SKIPPED
[INFO] ApacheDS Operational Attribute Interceptor ........ SKIPPED
[INFO] ApacheDS Referral Interceptor ..................... SKIPPED
[INFO] ApacheDS Schema Interceptor ....................... SKIPPED
[INFO] ApacheDS Subtree Interceptor ...................... SKIPPED
[INFO] ApacheDS Triggers Interceptor ..................... SKIPPED
[INFO] ApacheDS Core ..................................... SKIPPED
[INFO] ApacheDS Core AVL ................................. SKIPPED
[INFO] ApacheDS Generalized (X) DBM Partition ............ SKIPPED
[INFO] ApacheDS LDIF Partition ........................... SKIPPED
[INFO] ApacheDS JDBM implementation ...................... SKIPPED
[INFO] ApacheDS JDBM Partition ........................... SKIPPED
[INFO] ApacheDS Core Annotations ......................... SKIPPED
[INFO] ApacheDS Core JNDI ................................ SKIPPED
[INFO] ApacheDS Protocol Shared .......................... SKIPPED
[INFO] ApacheDS Protocol Kerberos Codec .................. SKIPPED
[INFO] ApacheDS Interceptors for Kerberos ................ SKIPPED
[INFO] ApacheDS Protocol Dhcp ............................ SKIPPED
[INFO] ApacheDS Protocol Dns ............................. SKIPPED
[INFO] ApacheDS Protocol Kerberos ........................ SKIPPED
[INFO] ApacheDS Protocol Ldap ............................ SKIPPED
[INFO] ApacheDS Protocol Ntp ............................. SKIPPED
[INFO] Apacheds Server Annotations ....................... SKIPPED
[INFO] ApacheDS Server Config ............................ SKIPPED
[INFO] ApacheDS Server JNDI .............................. SKIPPED
[INFO] ApacheDS Server Replication Service ............... SKIPPED
[INFO] ApacheDS Test Framework ........................... SKIPPED
[INFO] ApacheDS Generalized (X) DBM Tools ................ SKIPPED
[INFO] ApacheDS All ...................................... SKIPPED
[INFO] ApacheDS JDBM implementation ...................... SKIPPED
[INFO] ApacheDS Logger Interceptor ....................... SKIPPED
[INFO] ApacheDS Password Hashing Interceptor ............. SKIPPED
[INFO] ApacheDS Core Integration ......................... SKIPPED
[INFO] ApacheDS Server Integration ....................... SKIPPED
[INFO] ApacheDS DirectoryService-WebApp bridge ........... SKIPPED
[INFO] ApacheDS Jetty HTTP Server Integration ............ SKIPPED
[INFO] ApacheDS Service Builder .......................... SKIPPED
[INFO] ApacheDS Protocol Kerberos Test ................... SKIPPED
[INFO] Apache Directory LDAP Client API test ............. SKIPPED
[INFO] ApacheDS Service .................................. SKIPPED
[INFO] ApacheDS Wrapper .................................. SKIPPED
[INFO] ApacheDS Installers Maven Plugin .................. SKIPPED
[INFO] ApacheDS Installers ............................... SKIPPED
[INFO] ------------------------------------------------------------------------
[INFO] BUILD FAILURE
[INFO] ------------------------------------------------------------------------
[INFO] Total time: 1:06.880s
[INFO] Finished at: Thu Feb 16 04:02:40 UTC 2012
[INFO] Final Memory: 48M/237M
[INFO] ------------------------------------------------------------------------
mavenExecutionResult exceptions not empty
message : Failed to execute goal org.apache.maven.plugins:maven-compiler-plugin:2.3.2:compile
(default-compile) on project apacheds-core-api: Compilation failure
cause : Compilation failure
Stack trace : 
org.apache.maven.lifecycle.LifecycleExecutionException: Failed to execute goal org.apache.maven.plugins:maven-compiler-plugin:2.3.2:compile
(default-compile) on project apacheds-core-api: Compilation failure
	at org.apache.maven.lifecycle.internal.MojoExecutor.execute(MojoExecutor.java:213)
	at org.apache.maven.lifecycle.internal.MojoExecutor.execute(MojoExecutor.java:153)
	at org.apache.maven.lifecycle.internal.MojoExecutor.execute(MojoExecutor.java:145)
	at org.apache.maven.lifecycle.internal.LifecycleModuleBuilder.buildProject(LifecycleModuleBuilder.java:84)
	at org.apache.maven.lifecycle.internal.LifecycleModuleBuilder.buildProject(LifecycleModuleBuilder.java:59)
	at org.apache.maven.lifecycle.internal.LifecycleStarter.singleThreadedBuild(LifecycleStarter.java:183)
	at org.apache.maven.lifecycle.internal.LifecycleStarter.execute(LifecycleStarter.java:161)
	at org.apache.maven.DefaultMaven.doExecute(DefaultMaven.java:319)
	at org.apache.maven.DefaultMaven.execute(DefaultMaven.java:156)
	at org.jvnet.hudson.maven3.launcher.Maven3Launcher.main(Maven3Launcher.java:79)
	at sun.reflect.NativeMethodAccessorImpl.invoke0(Native Method)
	at sun.reflect.NativeMethodAccessorImpl.invoke(NativeMethodAccessorImpl.java:39)
	at sun.reflect.DelegatingMethodAccessorImpl.invoke(DelegatingMethodAccessorImpl.java:25)
	at java.lang.reflect.Method.invoke(Method.java:597)
	at org.codehaus.plexus.classworlds.launcher.Launcher.launchStandard(Launcher.java:329)
	at org.codehaus.plexus.classworlds.launcher.Launcher.launch(Launcher.java:239)
	at org.jvnet.hudson.maven3.agent.Maven3Main.launch(Maven3Main.java:158)
	at hudson.maven.Maven3Builder.call(Maven3Builder.java:104)
	at hudson.maven.Maven3Builder.call(Maven3Builder.java:70)
	at hudson.remoting.UserRequest.perform(UserRequest.java:118)
	at hudson.remoting.UserRequest.perform(UserRequest.java:48)
	at hudson.remoting.Request$2.run(Request.java:287)
	at hudson.remoting.InterceptingExecutorService$1.call(InterceptingExecutorService.java:72)
	at java.util.concurrent.FutureTask$Sync.innerRun(FutureTask.java:303)
	at java.util.concurrent.FutureTask.run(FutureTask.java:138)
	at java.util.concurrent.ThreadPoolExecutor$Worker.runTask(ThreadPoolExecutor.java:886)
	at java.util.concurrent.ThreadPoolExecutor$Worker.run(ThreadPoolExecutor.java:908)
	at java.lang.Thread.run(Thread.java:619)
Caused by: org.apache.maven.plugin.CompilationFailureException: Compilation failure
	at org.apache.maven.plugin.AbstractCompilerMojo.execute(AbstractCompilerMojo.java:656)
	at org.apache.maven.plugin.CompilerMojo.execute(CompilerMojo.java:128)
	at org.apache.maven.plugin.DefaultBuildPluginManager.executeMojo(DefaultBuildPluginManager.java:101)
	at org.apache.maven.lifecycle.internal.MojoExecutor.execute(MojoExecutor.java:209)
	... 27 more
channel stopped


Mime
View raw message