directory-notifications mailing list archives

Site index · List index
Message view « Date » · « Thread »
Top « Date » · « Thread »
From Apache Jenkins Server <jenk...@builds.apache.org>
Subject Build failed in Jenkins: dir-apacheds-jdk16-ubuntu-deploy #494
Date Mon, 02 Jan 2012 04:02:11 GMT
See <https://builds.apache.org/job/dir-apacheds-jdk16-ubuntu-deploy/494/>

------------------------------------------
[...truncated 252 lines...]
Uploading: https://repository.apache.org/content/repositories/snapshots/org/apache/directory/server/apacheds-core-constants/2.0.0-M4-SNAPSHOT/apacheds-core-constants-2.0.0-M4-20120102.040154-117.pom
Uploaded: https://repository.apache.org/content/repositories/snapshots/org/apache/directory/server/apacheds-core-constants/2.0.0-M4-SNAPSHOT/apacheds-core-constants-2.0.0-M4-20120102.040154-117.pom
(3 KB at 23.5 KB/sec)
Downloading: https://repository.apache.org/content/repositories/snapshots/org/apache/directory/server/apacheds-core-constants/maven-metadata.xml
Downloaded: https://repository.apache.org/content/repositories/snapshots/org/apache/directory/server/apacheds-core-constants/maven-metadata.xml
(416 B at 4.9 KB/sec)
Uploading: https://repository.apache.org/content/repositories/snapshots/org/apache/directory/server/apacheds-core-constants/2.0.0-M4-SNAPSHOT/maven-metadata.xml
Uploaded: https://repository.apache.org/content/repositories/snapshots/org/apache/directory/server/apacheds-core-constants/2.0.0-M4-SNAPSHOT/maven-metadata.xml
(815 B at 8.9 KB/sec)
Uploading: https://repository.apache.org/content/repositories/snapshots/org/apache/directory/server/apacheds-core-constants/maven-metadata.xml
Uploaded: https://repository.apache.org/content/repositories/snapshots/org/apache/directory/server/apacheds-core-constants/maven-metadata.xml
(416 B at 3.1 KB/sec)
[INFO] [INFO] Remote OBR update disabled (enable with -DremoteOBR)

[INFO] --- maven-bundle-plugin:2.3.4:deploy (default-deploy) @ apacheds-core-constants ---
[JENKINS] Archiving <https://builds.apache.org/job/dir-apacheds-jdk16-ubuntu-deploy/ws/trunk/core-constants/pom.xml>
to /home/hudson/hudson/jobs/dir-apacheds-jdk16-ubuntu-deploy/modules/org.apache.directory.server$apacheds-core-constants/builds/2012-01-02_04-01-26/archive/org.apache.directory.server/apacheds-core-constants/2.0.0-M4-SNAPSHOT/apacheds-core-constants-2.0.0-M4-SNAPSHOT.pom
[JENKINS] Archiving <https://builds.apache.org/job/dir-apacheds-jdk16-ubuntu-deploy/ws/trunk/core-constants/target/apacheds-core-constants-2.0.0-M4-SNAPSHOT.jar>
to /home/hudson/hudson/jobs/dir-apacheds-jdk16-ubuntu-deploy/modules/org.apache.directory.server$apacheds-core-constants/builds/2012-01-02_04-01-26/archive/org.apache.directory.server/apacheds-core-constants/2.0.0-M4-20120102.040154-117/apacheds-core-constants-2.0.0-M4-20120102.040154-117.jar
[INFO]                                                                         
[INFO] ------------------------------------------------------------------------
[INFO] Building ApacheDS Core API 2.0.0-M4-SNAPSHOT
[INFO] ------------------------------------------------------------------------
Downloading: http://repository.apache.org/snapshots/org/apache/directory/shared/shared-i18n/1.0.0-M9-SNAPSHOT/maven-metadata.xml
Downloaded: http://repository.apache.org/snapshots/org/apache/directory/shared/shared-i18n/1.0.0-M9-SNAPSHOT/maven-metadata.xml
(1022 B at 3.0 KB/sec)
Downloading: http://repository.apache.org/snapshots/org/apache/directory/shared/shared-parent/1.0.0-M9-SNAPSHOT/maven-metadata.xml
Downloaded: http://repository.apache.org/snapshots/org/apache/directory/shared/shared-parent/1.0.0-M9-SNAPSHOT/maven-metadata.xml
(627 B at 3.3 KB/sec)
Downloading: http://repository.apache.org/snapshots/org/apache/directory/shared/shared-asn1-api/1.0.0-M9-SNAPSHOT/maven-metadata.xml
Downloaded: http://repository.apache.org/snapshots/org/apache/directory/shared/shared-asn1-api/1.0.0-M9-SNAPSHOT/maven-metadata.xml
(2 KB at 3.5 KB/sec)
Downloading: http://repository.apache.org/snapshots/org/apache/directory/shared/shared-asn1-parent/1.0.0-M9-SNAPSHOT/maven-metadata.xml
Downloaded: http://repository.apache.org/snapshots/org/apache/directory/shared/shared-asn1-parent/1.0.0-M9-SNAPSHOT/maven-metadata.xml
(632 B at 3.8 KB/sec)
Downloading: http://repository.apache.org/snapshots/org/apache/directory/shared/shared-ldap-client-api/1.0.0-M9-SNAPSHOT/maven-metadata.xml
Downloaded: http://repository.apache.org/snapshots/org/apache/directory/shared/shared-ldap-client-api/1.0.0-M9-SNAPSHOT/maven-metadata.xml
(2 KB at 9.1 KB/sec)
Downloading: http://repository.apache.org/snapshots/org/apache/directory/shared/shared-ldap-client-parent/1.0.0-M9-SNAPSHOT/maven-metadata.xml
Downloaded: http://repository.apache.org/snapshots/org/apache/directory/shared/shared-ldap-client-parent/1.0.0-M9-SNAPSHOT/maven-metadata.xml
(637 B at 4.7 KB/sec)
Downloading: http://repository.apache.org/snapshots/org/apache/directory/shared/shared-ldap-parent/1.0.0-M9-SNAPSHOT/maven-metadata.xml
Downloaded: http://repository.apache.org/snapshots/org/apache/directory/shared/shared-ldap-parent/1.0.0-M9-SNAPSHOT/maven-metadata.xml
(632 B at 2.2 KB/sec)
Downloading: http://repository.apache.org/snapshots/org/apache/directory/shared/shared-ldap-schema-data/1.0.0-M9-SNAPSHOT/maven-metadata.xml
Downloaded: http://repository.apache.org/snapshots/org/apache/directory/shared/shared-ldap-schema-data/1.0.0-M9-SNAPSHOT/maven-metadata.xml
(2 KB at 9.1 KB/sec)
Downloading: http://repository.apache.org/snapshots/org/apache/directory/shared/shared-ldap-schema-parent/1.0.0-M9-SNAPSHOT/maven-metadata.xml
Downloaded: http://repository.apache.org/snapshots/org/apache/directory/shared/shared-ldap-schema-parent/1.0.0-M9-SNAPSHOT/maven-metadata.xml
(637 B at 5.9 KB/sec)
Downloading: http://repository.apache.org/snapshots/org/apache/directory/shared/shared-ldap-model/1.0.0-M9-SNAPSHOT/maven-metadata.xml
Downloaded: http://repository.apache.org/snapshots/org/apache/directory/shared/shared-ldap-model/1.0.0-M9-SNAPSHOT/maven-metadata.xml
(2 KB at 8.4 KB/sec)
Downloading: http://repository.apache.org/snapshots/org/apache/directory/shared/shared-util/1.0.0-M9-SNAPSHOT/maven-metadata.xml
Downloaded: http://repository.apache.org/snapshots/org/apache/directory/shared/shared-util/1.0.0-M9-SNAPSHOT/maven-metadata.xml
(1022 B at 7.2 KB/sec)
Downloading: http://repository.apache.org/snapshots/org/apache/directory/shared/shared-asn1-ber/1.0.0-M9-SNAPSHOT/maven-metadata.xml
Downloaded: http://repository.apache.org/snapshots/org/apache/directory/shared/shared-asn1-ber/1.0.0-M9-SNAPSHOT/maven-metadata.xml
(2 KB at 6.5 KB/sec)
Downloading: http://repository.apache.org/snapshots/org/apache/directory/shared/shared-ldap-codec-core/1.0.0-M9-SNAPSHOT/maven-metadata.xml
Downloaded: http://repository.apache.org/snapshots/org/apache/directory/shared/shared-ldap-codec-core/1.0.0-M9-SNAPSHOT/maven-metadata.xml
(2 KB at 12.5 KB/sec)
Downloading: http://repository.apache.org/snapshots/org/apache/directory/shared/shared-ldap-codec-parent/1.0.0-M9-SNAPSHOT/maven-metadata.xml
Downloaded: http://repository.apache.org/snapshots/org/apache/directory/shared/shared-ldap-codec-parent/1.0.0-M9-SNAPSHOT/maven-metadata.xml
(638 B at 4.7 KB/sec)
Downloading: http://repository.apache.org/snapshots/org/apache/directory/shared/shared-ldap-extras-aci/1.0.0-M9-SNAPSHOT/maven-metadata.xml
Downloaded: http://repository.apache.org/snapshots/org/apache/directory/shared/shared-ldap-extras-aci/1.0.0-M9-SNAPSHOT/maven-metadata.xml
(2 KB at 9.0 KB/sec)
Downloading: http://repository.apache.org/snapshots/org/apache/directory/shared/shared-ldap-extras-parent/1.0.0-M9-SNAPSHOT/maven-metadata.xml
Downloaded: http://repository.apache.org/snapshots/org/apache/directory/shared/shared-ldap-extras-parent/1.0.0-M9-SNAPSHOT/maven-metadata.xml
(637 B at 5.2 KB/sec)
Downloading: http://repository.apache.org/snapshots/org/apache/directory/shared/shared-ldap-extras-util/1.0.0-M9-SNAPSHOT/maven-metadata.xml
Downloaded: http://repository.apache.org/snapshots/org/apache/directory/shared/shared-ldap-extras-util/1.0.0-M9-SNAPSHOT/maven-metadata.xml
(2 KB at 4.5 KB/sec)
[INFO] [INFO] Deleting <https://builds.apache.org/job/dir-apacheds-jdk16-ubuntu-deploy/ws/trunk/core-api/target>

[INFO] --- maven-clean-plugin:2.4.1:clean (default-clean) @ apacheds-core-api ---
[INFO] 
[INFO] --- maven-remote-resources-plugin:1.2.1:process (default) @ apacheds-core-api ---
Downloading: http://repository.apache.org/snapshots/org/apache/directory/shared/shared-i18n/1.0.0-M9-SNAPSHOT/maven-metadata.xml
Downloaded: http://repository.apache.org/snapshots/org/apache/directory/shared/shared-i18n/1.0.0-M9-SNAPSHOT/maven-metadata.xml
(1022 B at 29.4 KB/sec)
Downloading: http://repository.apache.org/snapshots/org/apache/directory/shared/shared-ldap-schema-data/1.0.0-M9-SNAPSHOT/maven-metadata.xml
Downloaded: http://repository.apache.org/snapshots/org/apache/directory/shared/shared-ldap-schema-data/1.0.0-M9-SNAPSHOT/maven-metadata.xml
(2 KB at 31.4 KB/sec)
Downloading: http://repository.apache.org/snapshots/org/apache/directory/shared/shared-ldap-model/1.0.0-M9-SNAPSHOT/maven-metadata.xml
Downloaded: http://repository.apache.org/snapshots/org/apache/directory/shared/shared-ldap-model/1.0.0-M9-SNAPSHOT/maven-metadata.xml
(2 KB at 29.5 KB/sec)
Downloading: http://repository.apache.org/snapshots/org/apache/directory/shared/shared-util/1.0.0-M9-SNAPSHOT/maven-metadata.xml
Downloaded: http://repository.apache.org/snapshots/org/apache/directory/shared/shared-util/1.0.0-M9-SNAPSHOT/maven-metadata.xml
(1022 B at 28.5 KB/sec)
Downloading: http://repository.apache.org/snapshots/org/apache/directory/shared/shared-asn1-api/1.0.0-M9-SNAPSHOT/maven-metadata.xml
Downloaded: http://repository.apache.org/snapshots/org/apache/directory/shared/shared-asn1-api/1.0.0-M9-SNAPSHOT/maven-metadata.xml
(2 KB at 28.6 KB/sec)
Downloading: http://repository.apache.org/snapshots/org/apache/directory/shared/shared-asn1-ber/1.0.0-M9-SNAPSHOT/maven-metadata.xml
Downloaded: http://repository.apache.org/snapshots/org/apache/directory/shared/shared-asn1-ber/1.0.0-M9-SNAPSHOT/maven-metadata.xml
(2 KB at 25.7 KB/sec)
Downloading: http://repository.apache.org/snapshots/org/apache/directory/shared/shared-ldap-codec-core/1.0.0-M9-SNAPSHOT/maven-metadata.xml
Downloaded: http://repository.apache.org/snapshots/org/apache/directory/shared/shared-ldap-codec-core/1.0.0-M9-SNAPSHOT/maven-metadata.xml
(2 KB at 1.6 KB/sec)
Downloading: http://repository.apache.org/snapshots/org/apache/directory/shared/shared-ldap-extras-util/1.0.0-M9-SNAPSHOT/maven-metadata.xml
Downloaded: http://repository.apache.org/snapshots/org/apache/directory/shared/shared-ldap-extras-util/1.0.0-M9-SNAPSHOT/maven-metadata.xml
(2 KB at 22.9 KB/sec)
Downloading: http://repository.apache.org/snapshots/org/apache/directory/shared/shared-ldap-extras-aci/1.0.0-M9-SNAPSHOT/maven-metadata.xml
Downloaded: http://repository.apache.org/snapshots/org/apache/directory/shared/shared-ldap-extras-aci/1.0.0-M9-SNAPSHOT/maven-metadata.xml
(2 KB at 23.9 KB/sec)
Downloading: http://repository.apache.org/snapshots/org/apache/directory/shared/shared-ldap-client-api/1.0.0-M9-SNAPSHOT/maven-metadata.xml
Downloaded: http://repository.apache.org/snapshots/org/apache/directory/shared/shared-ldap-client-api/1.0.0-M9-SNAPSHOT/maven-metadata.xml
(2 KB at 8.5 KB/sec)
[debug] execute contextualize
[INFO] [INFO] Using 'UTF-8' encoding to copy filtered resources.

[INFO] --- maven-resources-plugin:2.5:resources (default-resources) @ apacheds-core-api ---
[INFO] Copying 1 resource
[INFO] Copying 3 resources
[INFO] 
[INFO] --- maven-compiler-plugin:2.3.2:compile (default-compile) @ apacheds-core-api ---
[INFO] Compiling 133 source files to <https://builds.apache.org/job/dir-apacheds-jdk16-ubuntu-deploy/ws/trunk/core-api/target/classes>
[debug] execute contextualize
[INFO] [INFO] Using 'UTF-8' encoding to copy filtered resources.
[INFO] Copying 1 resource

[INFO] --- maven-resources-plugin:2.5:testResources (default-testResources) @ apacheds-core-api
---
[INFO] Copying 3 resources
[INFO] 
[INFO] --- maven-compiler-plugin:2.3.2:testCompile (default-testCompile) @ apacheds-core-api
---
[INFO] Compiling 11 source files to <https://builds.apache.org/job/dir-apacheds-jdk16-ubuntu-deploy/ws/trunk/core-api/target/test-classes>
[INFO] [INFO] Surefire report directory: <https://builds.apache.org/job/dir-apacheds-jdk16-ubuntu-deploy/ws/trunk/core-api/target/surefire-reports>

[INFO] --- maven-surefire-plugin:2.10:test (default-test) @ apacheds-core-api ---

-------------------------------------------------------
 T E S T S
-------------------------------------------------------
Running org.apache.directory.server.core.api.sp.StoredProcUtilsTest
Tests run: 1, Failures: 0, Errors: 0, Skipped: 0, Time elapsed: 0.066 sec
Running org.apache.directory.server.core.api.entry.SchemaAwareEntryTest
Tests run: 81, Failures: 0, Errors: 0, Skipped: 0, Time elapsed: 1.096 sec
Running org.apache.directory.server.core.api.entry.SchemaAwareModificationTest
Tests run: 7, Failures: 0, Errors: 0, Skipped: 0, Time elapsed: 0.462 sec
Running org.apache.directory.server.core.api.entry.ClonedServerEntryTest
Tests run: 8, Failures: 0, Errors: 0, Skipped: 0, Time elapsed: 0.003 sec
Running org.apache.directory.server.core.api.changelog.TagTest
Tests run: 8, Failures: 0, Errors: 0, Skipped: 0, Time elapsed: 0.002 sec

Results :

Tests run: 105, Failures: 0, Errors: 0, Skipped: 0

[JENKINS] Recording test results
[INFO] 
[INFO] --- maven-bundle-plugin:2.3.4:bundle (default-bundle) @ apacheds-core-api ---
[INFO] 
[INFO] --- maven-site-plugin:3.0:attach-descriptor (attach-descriptor) @ apacheds-core-api
---
[INFO] 
[INFO] --- maven-jar-plugin:2.3.2:test-jar (attach-tests) @ apacheds-core-api ---
[INFO] Building jar: <https://builds.apache.org/job/dir-apacheds-jdk16-ubuntu-deploy/ws/trunk/core-api/target/apacheds-core-api-2.0.0-M4-SNAPSHOT-tests.jar>
[INFO] 
[INFO] [INFO] Checking legal files in: apacheds-core-api-2.0.0-M4-SNAPSHOT.jar
--- tools-maven-plugin:1.4:verify-legal-files (verify-legal-files) @ apacheds-core-api ---
[INFO] Checking legal files in: apacheds-core-api-2.0.0-M4-SNAPSHOT-tests.jar
[JENKINS] Archiving <https://builds.apache.org/job/dir-apacheds-jdk16-ubuntu-deploy/ws/trunk/core-api/pom.xml>
to /home/hudson/hudson/jobs/dir-apacheds-jdk16-ubuntu-deploy/modules/org.apache.directory.server$apacheds-core-api/builds/2012-01-02_04-01-26/archive/org.apache.directory.server/apacheds-core-api/2.0.0-M4-SNAPSHOT/apacheds-core-api-2.0.0-M4-SNAPSHOT.pom
[JENKINS] Archiving <https://builds.apache.org/job/dir-apacheds-jdk16-ubuntu-deploy/ws/trunk/core-api/target/apacheds-core-api-2.0.0-M4-SNAPSHOT.jar>
to /home/hudson/hudson/jobs/dir-apacheds-jdk16-ubuntu-deploy/modules/org.apache.directory.server$apacheds-core-api/builds/2012-01-02_04-01-26/archive/org.apache.directory.server/apacheds-core-api/2.0.0-M4-SNAPSHOT/apacheds-core-api-2.0.0-M4-SNAPSHOT.jar
[JENKINS] Archiving <https://builds.apache.org/job/dir-apacheds-jdk16-ubuntu-deploy/ws/trunk/core-api/target/apacheds-core-api-2.0.0-M4-SNAPSHOT-tests.jar>
to /home/hudson/hudson/jobs/dir-apacheds-jdk16-ubuntu-deploy/modules/org.apache.directory.server$apacheds-core-api/builds/2012-01-02_04-01-26/archive/org.apache.directory.server/apacheds-core-api/2.0.0-M4-SNAPSHOT/apacheds-core-api-2.0.0-M4-SNAPSHOT-tests.jar
[INFO] ------------------------------------------------------------------------
[INFO] Reactor Summary:
[INFO] 
[INFO] ApacheDS .......................................... SUCCESS [9.933s]
[INFO] ApacheDS I18n ..................................... SUCCESS [6.900s]
[INFO] ApacheDS Core Constants ........................... SUCCESS [3.000s]
[INFO] ApacheDS Core API ................................. FAILURE [15.021s]
[INFO] ApacheDS Core Shared .............................. SKIPPED
[INFO] ApacheDS Interceptors ............................. SKIPPED
[INFO] ApacheDS AdministrativePoint Interceptor .......... SKIPPED
[INFO] ApacheDS Authentication Interceptor ............... SKIPPED
[INFO] ApacheDS Authorization Interceptor ................ SKIPPED
[INFO] ApacheDS ChangeLog Interceptor .................... SKIPPED
[INFO] ApacheDS Collective Attribute Interceptor ......... SKIPPED
[INFO] ApacheDS Event Interceptor ........................ SKIPPED
[INFO] ApacheDS Exception Interceptor .................... SKIPPED
[INFO] ApacheDS Journal Interceptor ...................... SKIPPED
[INFO] ApacheDS Normalization Interceptor ................ SKIPPED
[INFO] ApacheDS Operational Attribute Interceptor ........ SKIPPED
[INFO] ApacheDS Referral Interceptor ..................... SKIPPED
[INFO] ApacheDS Schema Interceptor ....................... SKIPPED
[INFO] ApacheDS Subtree Interceptor ...................... SKIPPED
[INFO] ApacheDS Triggers Interceptor ..................... SKIPPED
[INFO] ApacheDS Core ..................................... SKIPPED
[INFO] ApacheDS Core AVL ................................. SKIPPED
[INFO] ApacheDS Generalized (X) DBM Partition ............ SKIPPED
[INFO] ApacheDS LDIF Partition ........................... SKIPPED
[INFO] ApacheDS JDBM implementation ...................... SKIPPED
[INFO] ApacheDS JDBM Partition ........................... SKIPPED
[INFO] ApacheDS Core Annotations ......................... SKIPPED
[INFO] ApacheDS Core JNDI ................................ SKIPPED
[INFO] ApacheDS Protocol Shared .......................... SKIPPED
[INFO] ApacheDS Protocol Kerberos Codec .................. SKIPPED
[INFO] ApacheDS Interceptors for Kerberos ................ SKIPPED
[INFO] ApacheDS Protocol Dhcp ............................ SKIPPED
[INFO] ApacheDS Protocol Dns ............................. SKIPPED
[INFO] ApacheDS Protocol Kerberos ........................ SKIPPED
[INFO] ApacheDS Protocol Ldap ............................ SKIPPED
[INFO] ApacheDS Protocol Ntp ............................. SKIPPED
[INFO] Apacheds Server Annotations ....................... SKIPPED
[INFO] ApacheDS Server Config ............................ SKIPPED
[INFO] ApacheDS Server JNDI .............................. SKIPPED
[INFO] ApacheDS Server Replication Service ............... SKIPPED
[INFO] ApacheDS Test Framework ........................... SKIPPED
[INFO] ApacheDS Generalized (X) DBM Tools ................ SKIPPED
[INFO] ApacheDS All ...................................... SKIPPED
[INFO] ApacheDS Logger Interceptor ....................... SKIPPED
[INFO] ApacheDS Password Hashing Interceptor ............. SKIPPED
[INFO] ApacheDS Core Integration ......................... SKIPPED
[INFO] ApacheDS Server Integration ....................... SKIPPED
[INFO] ApacheDS DirectoryService-WebApp bridge ........... SKIPPED
[INFO] ApacheDS Jetty HTTP Server Integration ............ SKIPPED
[INFO] ApacheDS Service Builder .......................... SKIPPED
[INFO] ApacheDS Protocol Kerberos Test ................... SKIPPED
[INFO] Apache Directory LDAP Client API test ............. SKIPPED
[INFO] ApacheDS Service .................................. SKIPPED
[INFO] ApacheDS Wrapper .................................. SKIPPED
[INFO] ApacheDS Installers Maven Plugin .................. SKIPPED
[INFO] ApacheDS Installers ............................... SKIPPED
[INFO] Preconfigured Apache Felix ........................ SKIPPED
[INFO] ApacheDS NonOSGI Dependencies ..................... SKIPPED
[INFO] ApacheDS OSGI Deployer ............................ SKIPPED
[INFO] ApacheDS Component Hub ............................ SKIPPED
[INFO] ------------------------------------------------------------------------
[INFO] BUILD FAILURE
[INFO] ------------------------------------------------------------------------
[INFO] Total time: 38.268s
[INFO] Finished at: Mon Jan 02 04:02:10 UTC 2012
[INFO] Final Memory: 53M/244M
[INFO] ------------------------------------------------------------------------
Waiting for Jenkins to finish collecting data
mavenExecutionResult exceptions not empty
message : Internal error: java.lang.NullPointerException
cause : null
Stack trace : 
org.apache.maven.InternalErrorException: Internal error: java.lang.NullPointerException
	at org.apache.maven.lifecycle.internal.BuilderCommon.handleBuildError(BuilderCommon.java:128)
	at org.apache.maven.lifecycle.internal.LifecycleModuleBuilder.buildProject(LifecycleModuleBuilder.java:95)
	at org.apache.maven.lifecycle.internal.LifecycleModuleBuilder.buildProject(LifecycleModuleBuilder.java:59)
	at org.apache.maven.lifecycle.internal.LifecycleStarter.singleThreadedBuild(LifecycleStarter.java:183)
	at org.apache.maven.lifecycle.internal.LifecycleStarter.execute(LifecycleStarter.java:161)
	at org.apache.maven.DefaultMaven.doExecute(DefaultMaven.java:319)
	at org.apache.maven.DefaultMaven.execute(DefaultMaven.java:156)
	at org.jvnet.hudson.maven3.launcher.Maven3Launcher.main(Maven3Launcher.java:79)
	at sun.reflect.NativeMethodAccessorImpl.invoke0(Native Method)
	at sun.reflect.NativeMethodAccessorImpl.invoke(NativeMethodAccessorImpl.java:39)
	at sun.reflect.DelegatingMethodAccessorImpl.invoke(DelegatingMethodAccessorImpl.java:25)
	at java.lang.reflect.Method.invoke(Method.java:597)
	at org.codehaus.plexus.classworlds.launcher.Launcher.launchStandard(Launcher.java:329)
	at org.codehaus.plexus.classworlds.launcher.Launcher.launch(Launcher.java:239)
	at org.jvnet.hudson.maven3.agent.Maven3Main.launch(Maven3Main.java:158)
	at hudson.maven.Maven3Builder.call(Maven3Builder.java:112)
	at hudson.maven.Maven3Builder.call(Maven3Builder.java:70)
	at hudson.remoting.UserRequest.perform(UserRequest.java:118)
	at hudson.remoting.UserRequest.perform(UserRequest.java:48)
	at hudson.remoting.Request$2.run(Request.java:287)
	at java.util.concurrent.Executors$RunnableAdapter.call(Executors.java:441)
	at java.util.concurrent.FutureTask$Sync.innerRun(FutureTask.java:303)
	at java.util.concurrent.FutureTask.run(FutureTask.java:138)
	at java.util.concurrent.ThreadPoolExecutor$Worker.runTask(ThreadPoolExecutor.java:886)
	at java.util.concurrent.ThreadPoolExecutor$Worker.run(ThreadPoolExecutor.java:908)
	at java.lang.Thread.run(Thread.java:619)
Caused by: java.lang.NullPointerException
	at hudson.maven.ExecutedMojo.getMojoClass(ExecutedMojo.java:114)
	at hudson.maven.ExecutedMojo.<init>(ExecutedMojo.java:99)
	at hudson.maven.Maven3Builder$MavenExecutionListener.recordExecutionTime(Maven3Builder.java:524)
	at hudson.maven.Maven3Builder$MavenExecutionListener.recordMojoSucceeded(Maven3Builder.java:493)
	at hudson.maven.Maven3Builder$MavenExecutionListener.forkSucceeded(Maven3Builder.java:601)
	at org.apache.maven.lifecycle.internal.DefaultExecutionEventCatapult.fire(DefaultExecutionEventCatapult.java:97)
	at org.apache.maven.lifecycle.internal.DefaultExecutionEventCatapult.fire(DefaultExecutionEventCatapult.java:42)
	at org.apache.maven.lifecycle.internal.MojoExecutor.executeForkedExecutions(MojoExecutor.java:383)
	at org.apache.maven.lifecycle.internal.MojoExecutor.execute(MojoExecutor.java:199)
	at org.apache.maven.lifecycle.internal.MojoExecutor.execute(MojoExecutor.java:153)
	at org.apache.maven.lifecycle.internal.MojoExecutor.execute(MojoExecutor.java:145)
	at org.apache.maven.lifecycle.internal.LifecycleModuleBuilder.buildProject(LifecycleModuleBuilder.java:84)
	... 24 more
Sending e-mails to: notifications@directory.apache.org
channel stopped


Mime
View raw message