directory-notifications mailing list archives

Site index · List index
Message view « Date » · « Thread »
Top « Date » · « Thread »
From Apache Jenkins Server <jenk...@builds.apache.org>
Subject Build failed in Jenkins: dir-apacheds-jdk16-ubuntu-deploy #504
Date Thu, 12 Jan 2012 04:02:45 GMT
See <https://builds.apache.org/job/dir-apacheds-jdk16-ubuntu-deploy/504/>

------------------------------------------
[...truncated 168 lines...]
[INFO] Downloading: https://repository.apache.org/content/repositories/snapshots/org/apache/directory/server/apacheds-i18n/2.0.0-M5-SNAPSHOT/maven-metadata.xml

[INFO] --- maven-deploy-plugin:2.7:deploy (default-deploy) @ apacheds-i18n ---
Downloaded: https://repository.apache.org/content/repositories/snapshots/org/apache/directory/server/apacheds-i18n/2.0.0-M5-SNAPSHOT/maven-metadata.xml
(799 B at 3.7 KB/sec)
Uploading: https://repository.apache.org/content/repositories/snapshots/org/apache/directory/server/apacheds-i18n/2.0.0-M5-SNAPSHOT/apacheds-i18n-2.0.0-M5-20120112.040227-3.jar
Uploaded: https://repository.apache.org/content/repositories/snapshots/org/apache/directory/server/apacheds-i18n/2.0.0-M5-SNAPSHOT/apacheds-i18n-2.0.0-M5-20120112.040227-3.jar
(44 KB at 75.5 KB/sec)
Uploading: https://repository.apache.org/content/repositories/snapshots/org/apache/directory/server/apacheds-i18n/2.0.0-M5-SNAPSHOT/apacheds-i18n-2.0.0-M5-20120112.040227-3.pom
Uploaded: https://repository.apache.org/content/repositories/snapshots/org/apache/directory/server/apacheds-i18n/2.0.0-M5-SNAPSHOT/apacheds-i18n-2.0.0-M5-20120112.040227-3.pom
(3 KB at 12.2 KB/sec)
Downloading: https://repository.apache.org/content/repositories/snapshots/org/apache/directory/server/apacheds-i18n/maven-metadata.xml
Downloaded: https://repository.apache.org/content/repositories/snapshots/org/apache/directory/server/apacheds-i18n/maven-metadata.xml
(449 B at 2.8 KB/sec)
Uploading: https://repository.apache.org/content/repositories/snapshots/org/apache/directory/server/apacheds-i18n/2.0.0-M5-SNAPSHOT/maven-metadata.xml
Uploaded: https://repository.apache.org/content/repositories/snapshots/org/apache/directory/server/apacheds-i18n/2.0.0-M5-SNAPSHOT/maven-metadata.xml
(799 B at 3.5 KB/sec)
Uploading: https://repository.apache.org/content/repositories/snapshots/org/apache/directory/server/apacheds-i18n/maven-metadata.xml
Uploaded: https://repository.apache.org/content/repositories/snapshots/org/apache/directory/server/apacheds-i18n/maven-metadata.xml
(449 B at 2.3 KB/sec)
[INFO] [INFO] Remote OBR update disabled (enable with -DremoteOBR)

[INFO] --- maven-bundle-plugin:2.3.4:deploy (default-deploy) @ apacheds-i18n ---
[JENKINS] Archiving <https://builds.apache.org/job/dir-apacheds-jdk16-ubuntu-deploy/ws/trunk/i18n/pom.xml>
to /home/hudson/hudson/jobs/dir-apacheds-jdk16-ubuntu-deploy/modules/org.apache.directory.server$apacheds-i18n/builds/2012-01-12_04-01-22/archive/org.apache.directory.server/apacheds-i18n/2.0.0-M5-SNAPSHOT/apacheds-i18n-2.0.0-M5-SNAPSHOT.pom
[JENKINS] Archiving <https://builds.apache.org/job/dir-apacheds-jdk16-ubuntu-deploy/ws/trunk/i18n/target/apacheds-i18n-2.0.0-M5-SNAPSHOT.jar>
to /home/hudson/hudson/jobs/dir-apacheds-jdk16-ubuntu-deploy/modules/org.apache.directory.server$apacheds-i18n/builds/2012-01-12_04-01-22/archive/org.apache.directory.server/apacheds-i18n/2.0.0-M5-20120112.040227-3/apacheds-i18n-2.0.0-M5-20120112.040227-3.jar
[INFO] [INFO] Deleting <https://builds.apache.org/job/dir-apacheds-jdk16-ubuntu-deploy/ws/trunk/core-constants/target>
                                                                        
[INFO] ------------------------------------------------------------------------
[INFO] Building ApacheDS Core Constants 2.0.0-M5-SNAPSHOT
[INFO] ------------------------------------------------------------------------
[INFO] 
[INFO] --- maven-clean-plugin:2.4.1:clean (default-clean) @ apacheds-core-constants ---
[INFO] 
[INFO] --- maven-remote-resources-plugin:1.2.1:process (default) @ apacheds-core-constants
---
[debug] execute contextualize
[INFO] [INFO] Using 'UTF-8' encoding to copy filtered resources.
[INFO] Copying 0 resource
[INFO] Copying 3 resources

[INFO] --- maven-resources-plugin:2.5:resources (default-resources) @ apacheds-core-constants
---
[INFO] 
[INFO] --- maven-compiler-plugin:2.3.2:compile (default-compile) @ apacheds-core-constants
---
[INFO] Compiling 4 source files to <https://builds.apache.org/job/dir-apacheds-jdk16-ubuntu-deploy/ws/trunk/core-constants/target/classes>
[debug] execute contextualize
[INFO] [INFO] Using 'UTF-8' encoding to copy filtered resources.
[INFO] skip non existing resourceDirectory <https://builds.apache.org/job/dir-apacheds-jdk16-ubuntu-deploy/ws/trunk/core-constants/src/test/resources>
[INFO] Copying 3 resources

[INFO] --- maven-resources-plugin:2.5:testResources (default-testResources) @ apacheds-core-constants
---
[INFO] [INFO] No sources to compile

[INFO] --- maven-compiler-plugin:2.3.2:testCompile (default-testCompile) @ apacheds-core-constants
---
[INFO] [INFO] Surefire report directory: <https://builds.apache.org/job/dir-apacheds-jdk16-ubuntu-deploy/ws/trunk/core-constants/target/surefire-reports>

-------------------------------------------------------
 T E S T S
-------------------------------------------------------

[INFO] --- maven-surefire-plugin:2.10:test (default-test) @ apacheds-core-constants ---

Results :

Tests run: 0, Failures: 0, Errors: 0, Skipped: 0

[JENKINS] Recording test results
[INFO] 
[INFO] --- maven-bundle-plugin:2.3.4:bundle (default-bundle) @ apacheds-core-constants ---
[INFO] 
[INFO] --- maven-site-plugin:3.0:attach-descriptor (attach-descriptor) @ apacheds-core-constants
---
[INFO] [INFO] Checking legal files in: apacheds-core-constants-2.0.0-M5-SNAPSHOT.jar

[INFO] --- tools-maven-plugin:1.4:verify-legal-files (verify-legal-files) @ apacheds-core-constants
---
[INFO] [INFO] Installing <https://builds.apache.org/job/dir-apacheds-jdk16-ubuntu-deploy/ws/trunk/core-constants/target/apacheds-core-constants-2.0.0-M5-SNAPSHOT.jar>
to /home/jenkins/.m2/repository/org/apache/directory/server/apacheds-core-constants/2.0.0-M5-SNAPSHOT/apacheds-core-constants-2.0.0-M5-SNAPSHOT.jar
[INFO] Installing <https://builds.apache.org/job/dir-apacheds-jdk16-ubuntu-deploy/ws/trunk/core-constants/pom.xml>
to /home/jenkins/.m2/repository/org/apache/directory/server/apacheds-core-constants/2.0.0-M5-SNAPSHOT/apacheds-core-constants-2.0.0-M5-SNAPSHOT.pom

[INFO] --- maven-install-plugin:2.3.1:install (default-install) @ apacheds-core-constants
---
[INFO] 
[INFO] --- maven-bundle-plugin:2.3.4:install (default-install) @ apacheds-core-constants ---
[INFO] Installing org/apache/directory/server/apacheds-core-constants/2.0.0-M5-SNAPSHOT/apacheds-core-constants-2.0.0-M5-SNAPSHOT.jar
[INFO] Writing OBR metadata
[INFO] Downloading: https://repository.apache.org/content/repositories/snapshots/org/apache/directory/server/apacheds-core-constants/2.0.0-M5-SNAPSHOT/maven-metadata.xml

[INFO] --- maven-deploy-plugin:2.7:deploy (default-deploy) @ apacheds-core-constants ---
Downloaded: https://repository.apache.org/content/repositories/snapshots/org/apache/directory/server/apacheds-core-constants/2.0.0-M5-SNAPSHOT/maven-metadata.xml
(809 B at 0.5 KB/sec)
Uploading: https://repository.apache.org/content/repositories/snapshots/org/apache/directory/server/apacheds-core-constants/2.0.0-M5-SNAPSHOT/apacheds-core-constants-2.0.0-M5-20120112.040235-3.jar
Uploaded: https://repository.apache.org/content/repositories/snapshots/org/apache/directory/server/apacheds-core-constants/2.0.0-M5-SNAPSHOT/apacheds-core-constants-2.0.0-M5-20120112.040235-3.jar
(10 KB at 36.3 KB/sec)
Uploading: https://repository.apache.org/content/repositories/snapshots/org/apache/directory/server/apacheds-core-constants/2.0.0-M5-SNAPSHOT/apacheds-core-constants-2.0.0-M5-20120112.040235-3.pom
Uploaded: https://repository.apache.org/content/repositories/snapshots/org/apache/directory/server/apacheds-core-constants/2.0.0-M5-SNAPSHOT/apacheds-core-constants-2.0.0-M5-20120112.040235-3.pom
(3 KB at 8.0 KB/sec)
Downloading: https://repository.apache.org/content/repositories/snapshots/org/apache/directory/server/apacheds-core-constants/maven-metadata.xml
Downloaded: https://repository.apache.org/content/repositories/snapshots/org/apache/directory/server/apacheds-core-constants/maven-metadata.xml
(459 B at 0.8 KB/sec)
Uploading: https://repository.apache.org/content/repositories/snapshots/org/apache/directory/server/apacheds-core-constants/2.0.0-M5-SNAPSHOT/maven-metadata.xml
Uploaded: https://repository.apache.org/content/repositories/snapshots/org/apache/directory/server/apacheds-core-constants/2.0.0-M5-SNAPSHOT/maven-metadata.xml
(809 B at 2.3 KB/sec)
Uploading: https://repository.apache.org/content/repositories/snapshots/org/apache/directory/server/apacheds-core-constants/maven-metadata.xml
Uploaded: https://repository.apache.org/content/repositories/snapshots/org/apache/directory/server/apacheds-core-constants/maven-metadata.xml
(459 B at 0.9 KB/sec)
[INFO] Remote OBR update disabled (enable with -DremoteOBR)
[INFO] 
[INFO] --- maven-bundle-plugin:2.3.4:deploy (default-deploy) @ apacheds-core-constants ---
[JENKINS] Archiving <https://builds.apache.org/job/dir-apacheds-jdk16-ubuntu-deploy/ws/trunk/core-constants/pom.xml>
to /home/hudson/hudson/jobs/dir-apacheds-jdk16-ubuntu-deploy/modules/org.apache.directory.server$apacheds-core-constants/builds/2012-01-12_04-01-22/archive/org.apache.directory.server/apacheds-core-constants/2.0.0-M5-SNAPSHOT/apacheds-core-constants-2.0.0-M5-SNAPSHOT.pom
[JENKINS] Archiving <https://builds.apache.org/job/dir-apacheds-jdk16-ubuntu-deploy/ws/trunk/core-constants/target/apacheds-core-constants-2.0.0-M5-SNAPSHOT.jar>
to /home/hudson/hudson/jobs/dir-apacheds-jdk16-ubuntu-deploy/modules/org.apache.directory.server$apacheds-core-constants/builds/2012-01-12_04-01-22/archive/org.apache.directory.server/apacheds-core-constants/2.0.0-M5-20120112.040235-3/apacheds-core-constants-2.0.0-M5-20120112.040235-3.jar
[INFO]                                                                         
[INFO] ------------------------------------------------------------------------
[INFO] Building ApacheDS Core API 2.0.0-M5-SNAPSHOT
[INFO] ------------------------------------------------------------------------
Downloading: http://repo1.maven.org/maven2/org/apache/directory/shared/shared-i18n/1.0.0-M9/shared-i18n-1.0.0-M9.pom
[WARNING] The POM for org.apache.directory.shared:shared-i18n:jar:1.0.0-M9 is missing, no
dependency information available
Downloading: http://repo1.maven.org/maven2/org/apache/directory/shared/shared-asn1-api/1.0.0-M9/shared-asn1-api-1.0.0-M9.pom
[WARNING] The POM for org.apache.directory.shared:shared-asn1-api:jar:1.0.0-M9 is missing,
no dependency information available
Downloading: http://repo1.maven.org/maven2/org/apache/directory/shared/shared-ldap-client-api/1.0.0-M9/shared-ldap-client-api-1.0.0-M9.pom
[WARNING] The POM for org.apache.directory.shared:shared-ldap-client-api:jar:1.0.0-M9 is missing,
no dependency information available
Downloading: http://repo1.maven.org/maven2/org/apache/directory/shared/shared-ldap-codec-core/1.0.0-M9/shared-ldap-codec-core-1.0.0-M9.pom
[WARNING] The POM for org.apache.directory.shared:shared-ldap-codec-core:jar:1.0.0-M9 is missing,
no dependency information available
Downloading: http://repo1.maven.org/maven2/org/apache/directory/shared/shared-ldap-extras-aci/1.0.0-M9/shared-ldap-extras-aci-1.0.0-M9.pom
[WARNING] The POM for org.apache.directory.shared:shared-ldap-extras-aci:jar:1.0.0-M9 is missing,
no dependency information available
Downloading: http://repo1.maven.org/maven2/org/apache/directory/shared/shared-ldap-extras-util/1.0.0-M9/shared-ldap-extras-util-1.0.0-M9.pom
[WARNING] The POM for org.apache.directory.shared:shared-ldap-extras-util:jar:1.0.0-M9 is
missing, no dependency information available
Downloading: http://repo1.maven.org/maven2/org/apache/directory/shared/shared-ldap-model/1.0.0-M9/shared-ldap-model-1.0.0-M9.pom
[WARNING] The POM for org.apache.directory.shared:shared-ldap-model:jar:1.0.0-M9 is missing,
no dependency information available
Downloading: http://repo1.maven.org/maven2/org/apache/directory/shared/shared-ldap-schema-data/1.0.0-M9/shared-ldap-schema-data-1.0.0-M9.pom
[WARNING] The POM for org.apache.directory.shared:shared-ldap-schema-data:jar:1.0.0-M9 is
missing, no dependency information available
Downloading: http://repo1.maven.org/maven2/org/apache/directory/shared/shared-util/1.0.0-M9/shared-util-1.0.0-M9.pom
[WARNING] The POM for org.apache.directory.shared:shared-util:jar:1.0.0-M9 is missing, no
dependency information available
Downloading: http://repo1.maven.org/maven2/org/apache/directory/shared/shared-i18n/1.0.0-M9/shared-i18n-1.0.0-M9.jar
Downloading: http://repo1.maven.org/maven2/org/apache/directory/shared/shared-asn1-api/1.0.0-M9/shared-asn1-api-1.0.0-M9.jar
Downloading: http://repo1.maven.org/maven2/org/apache/directory/shared/shared-ldap-client-api/1.0.0-M9/shared-ldap-client-api-1.0.0-M9.jar
Downloading: http://repo1.maven.org/maven2/org/apache/directory/shared/shared-ldap-codec-core/1.0.0-M9/shared-ldap-codec-core-1.0.0-M9.jar
Downloading: http://repo1.maven.org/maven2/org/apache/directory/shared/shared-ldap-extras-aci/1.0.0-M9/shared-ldap-extras-aci-1.0.0-M9.jar
Downloading: http://repo1.maven.org/maven2/org/apache/directory/shared/shared-ldap-extras-util/1.0.0-M9/shared-ldap-extras-util-1.0.0-M9.jar
Downloading: http://repo1.maven.org/maven2/org/apache/directory/shared/shared-ldap-model/1.0.0-M9/shared-ldap-model-1.0.0-M9.jar
Downloading: http://repo1.maven.org/maven2/org/apache/directory/shared/shared-ldap-schema-data/1.0.0-M9/shared-ldap-schema-data-1.0.0-M9.jar
Downloading: http://repo1.maven.org/maven2/org/apache/directory/shared/shared-util/1.0.0-M9/shared-util-1.0.0-M9.jar
[JENKINS] Archiving <https://builds.apache.org/job/dir-apacheds-jdk16-ubuntu-deploy/ws/trunk/core-api/pom.xml>
to /home/hudson/hudson/jobs/dir-apacheds-jdk16-ubuntu-deploy/modules/org.apache.directory.server$apacheds-core-api/builds/2012-01-12_04-01-22/archive/org.apache.directory.server/apacheds-core-api/2.0.0-M5-SNAPSHOT/apacheds-core-api-2.0.0-M5-SNAPSHOT.pom
[INFO] ------------------------------------------------------------------------
[INFO] Reactor Summary:
[INFO] 
[INFO] ApacheDS .......................................... SUCCESS [39.446s]
[INFO] ApacheDS I18n ..................................... SUCCESS [9.290s]
[INFO] ApacheDS Core Constants ........................... SUCCESS [7.443s]
[INFO] ApacheDS Core API ................................. FAILURE [4.579s]
[INFO] ApacheDS Core Shared .............................. SKIPPED
[INFO] ApacheDS Interceptors ............................. SKIPPED
[INFO] ApacheDS AdministrativePoint Interceptor .......... SKIPPED
[INFO] ApacheDS Authentication Interceptor ............... SKIPPED
[INFO] ApacheDS Authorization Interceptor ................ SKIPPED
[INFO] ApacheDS ChangeLog Interceptor .................... SKIPPED
[INFO] ApacheDS Collective Attribute Interceptor ......... SKIPPED
[INFO] ApacheDS Event Interceptor ........................ SKIPPED
[INFO] ApacheDS Exception Interceptor .................... SKIPPED
[INFO] ApacheDS Journal Interceptor ...................... SKIPPED
[INFO] ApacheDS Normalization Interceptor ................ SKIPPED
[INFO] ApacheDS Operational Attribute Interceptor ........ SKIPPED
[INFO] ApacheDS Referral Interceptor ..................... SKIPPED
[INFO] ApacheDS Schema Interceptor ....................... SKIPPED
[INFO] ApacheDS Subtree Interceptor ...................... SKIPPED
[INFO] ApacheDS Triggers Interceptor ..................... SKIPPED
[INFO] ApacheDS Core ..................................... SKIPPED
[INFO] ApacheDS Core AVL ................................. SKIPPED
[INFO] ApacheDS Generalized (X) DBM Partition ............ SKIPPED
[INFO] ApacheDS LDIF Partition ........................... SKIPPED
[INFO] ApacheDS JDBM implementation ...................... SKIPPED
[INFO] ApacheDS JDBM Partition ........................... SKIPPED
[INFO] ApacheDS Core Annotations ......................... SKIPPED
[INFO] ApacheDS Core JNDI ................................ SKIPPED
[INFO] ApacheDS Protocol Shared .......................... SKIPPED
[INFO] ApacheDS Protocol Kerberos Codec .................. SKIPPED
[INFO] ApacheDS Interceptors for Kerberos ................ SKIPPED
[INFO] ApacheDS Protocol Dhcp ............................ SKIPPED
[INFO] ApacheDS Protocol Dns ............................. SKIPPED
[INFO] ApacheDS Protocol Kerberos ........................ SKIPPED
[INFO] ApacheDS Protocol Ldap ............................ SKIPPED
[INFO] ApacheDS Protocol Ntp ............................. SKIPPED
[INFO] Apacheds Server Annotations ....................... SKIPPED
[INFO] ApacheDS Server Config ............................ SKIPPED
[INFO] ApacheDS Server JNDI .............................. SKIPPED
[INFO] ApacheDS Server Replication Service ............... SKIPPED
[INFO] ApacheDS Test Framework ........................... SKIPPED
[INFO] ApacheDS Generalized (X) DBM Tools ................ SKIPPED
[INFO] ApacheDS All ...................................... SKIPPED
[INFO] ApacheDS Logger Interceptor ....................... SKIPPED
[INFO] ApacheDS Password Hashing Interceptor ............. SKIPPED
[INFO] ApacheDS Core Integration ......................... SKIPPED
[INFO] ApacheDS Server Integration ....................... SKIPPED
[INFO] ApacheDS DirectoryService-WebApp bridge ........... SKIPPED
[INFO] ApacheDS Jetty HTTP Server Integration ............ SKIPPED
[INFO] ApacheDS Service Builder .......................... SKIPPED
[INFO] ApacheDS Protocol Kerberos Test ................... SKIPPED
[INFO] Apache Directory LDAP Client API test ............. SKIPPED
[INFO] ApacheDS Service .................................. SKIPPED
[INFO] ApacheDS Wrapper .................................. SKIPPED
[INFO] ApacheDS Installers Maven Plugin .................. SKIPPED
[INFO] ApacheDS Installers ............................... SKIPPED
[INFO] ------------------------------------------------------------------------
[INFO] BUILD FAILURE
[INFO] ------------------------------------------------------------------------
[INFO] Total time: 1:09.472s
[INFO] Finished at: Thu Jan 12 04:02:44 UTC 2012
[INFO] Final Memory: 44M/227M
[INFO] ------------------------------------------------------------------------
mavenExecutionResult exceptions not empty
message : Failed to execute goal on project apacheds-core-api: Could not resolve dependencies
for project org.apache.directory.server:apacheds-core-api:bundle:2.0.0-M5-SNAPSHOT: The following
artifacts could not be resolved: org.apache.directory.shared:shared-i18n:jar:1.0.0-M9, org.apache.directory.shared:shared-asn1-api:jar:1.0.0-M9,
org.apache.directory.shared:shared-ldap-client-api:jar:1.0.0-M9, org.apache.directory.shared:shared-ldap-codec-core:jar:1.0.0-M9,
org.apache.directory.shared:shared-ldap-extras-aci:jar:1.0.0-M9, org.apache.directory.shared:shared-ldap-extras-util:jar:1.0.0-M9,
org.apache.directory.shared:shared-ldap-model:jar:1.0.0-M9, org.apache.directory.shared:shared-ldap-schema-data:jar:1.0.0-M9,
org.apache.directory.shared:shared-util:jar:1.0.0-M9: Could not find artifact org.apache.directory.shared:shared-i18n:jar:1.0.0-M9
in central (http://repo1.maven.org/maven2)
cause : Could not resolve dependencies for project org.apache.directory.server:apacheds-core-api:bundle:2.0.0-M5-SNAPSHOT:
The following artifacts could not be resolved: org.apache.directory.shared:shared-i18n:jar:1.0.0-M9,
org.apache.directory.shared:shared-asn1-api:jar:1.0.0-M9, org.apache.directory.shared:shared-ldap-client-api:jar:1.0.0-M9,
org.apache.directory.shared:shared-ldap-codec-core:jar:1.0.0-M9, org.apache.directory.shared:shared-ldap-extras-aci:jar:1.0.0-M9,
org.apache.directory.shared:shared-ldap-extras-util:jar:1.0.0-M9, org.apache.directory.shared:shared-ldap-model:jar:1.0.0-M9,
org.apache.directory.shared:shared-ldap-schema-data:jar:1.0.0-M9, org.apache.directory.shared:shared-util:jar:1.0.0-M9:
Could not find artifact org.apache.directory.shared:shared-i18n:jar:1.0.0-M9 in central (http://repo1.maven.org/maven2)
Stack trace : 
org.apache.maven.lifecycle.LifecycleExecutionException: Failed to execute goal on project
apacheds-core-api: Could not resolve dependencies for project org.apache.directory.server:apacheds-core-api:bundle:2.0.0-M5-SNAPSHOT:
The following artifacts could not be resolved: org.apache.directory.shared:shared-i18n:jar:1.0.0-M9,
org.apache.directory.shared:shared-asn1-api:jar:1.0.0-M9, org.apache.directory.shared:shared-ldap-client-api:jar:1.0.0-M9,
org.apache.directory.shared:shared-ldap-codec-core:jar:1.0.0-M9, org.apache.directory.shared:shared-ldap-extras-aci:jar:1.0.0-M9,
org.apache.directory.shared:shared-ldap-extras-util:jar:1.0.0-M9, org.apache.directory.shared:shared-ldap-model:jar:1.0.0-M9,
org.apache.directory.shared:shared-ldap-schema-data:jar:1.0.0-M9, org.apache.directory.shared:shared-util:jar:1.0.0-M9:
Could not find artifact org.apache.directory.shared:shared-i18n:jar:1.0.0-M9 in central (http://repo1.maven.org/maven2)
	at org.apache.maven.lifecycle.internal.LifecycleDependencyResolver.getDependencies(LifecycleDependencyResolver.java:196)
	at org.apache.maven.lifecycle.internal.LifecycleDependencyResolver.resolveProjectDependencies(LifecycleDependencyResolver.java:108)
	at org.apache.maven.lifecycle.internal.MojoExecutor.ensureDependenciesAreResolved(MojoExecutor.java:258)
	at org.apache.maven.lifecycle.internal.MojoExecutor.execute(MojoExecutor.java:201)
	at org.apache.maven.lifecycle.internal.MojoExecutor.execute(MojoExecutor.java:153)
	at org.apache.maven.lifecycle.internal.MojoExecutor.execute(MojoExecutor.java:145)
	at org.apache.maven.lifecycle.internal.LifecycleModuleBuilder.buildProject(LifecycleModuleBuilder.java:84)
	at org.apache.maven.lifecycle.internal.LifecycleModuleBuilder.buildProject(LifecycleModuleBuilder.java:59)
	at org.apache.maven.lifecycle.internal.LifecycleStarter.singleThreadedBuild(LifecycleStarter.java:183)
	at org.apache.maven.lifecycle.internal.LifecycleStarter.execute(LifecycleStarter.java:161)
	at org.apache.maven.DefaultMaven.doExecute(DefaultMaven.java:319)
	at org.apache.maven.DefaultMaven.execute(DefaultMaven.java:156)
	at org.jvnet.hudson.maven3.launcher.Maven3Launcher.main(Maven3Launcher.java:79)
	at sun.reflect.NativeMethodAccessorImpl.invoke0(Native Method)
	at sun.reflect.NativeMethodAccessorImpl.invoke(NativeMethodAccessorImpl.java:39)
	at sun.reflect.DelegatingMethodAccessorImpl.invoke(DelegatingMethodAccessorImpl.java:25)
	at java.lang.reflect.Method.invoke(Method.java:597)
	at org.codehaus.plexus.classworlds.launcher.Launcher.launchStandard(Launcher.java:329)
	at org.codehaus.plexus.classworlds.launcher.Launcher.launch(Launcher.java:239)
	at org.jvnet.hudson.maven3.agent.Maven3Main.launch(Maven3Main.java:158)
	at hudson.maven.Maven3Builder.call(Maven3Builder.java:104)
	at hudson.maven.Maven3Builder.call(Maven3Builder.java:70)
	at hudson.remoting.UserRequest.perform(UserRequest.java:118)
	at hudson.remoting.UserRequest.perform(UserRequest.java:48)
	at hudson.remoting.Request$2.run(Request.java:287)
	at java.util.concurrent.Executors$RunnableAdapter.call(Executors.java:441)
	at java.util.concurrent.FutureTask$Sync.innerRun(FutureTask.java:303)
	at java.util.concurrent.FutureTask.run(FutureTask.java:138)
	at java.util.concurrent.ThreadPoolExecutor$Worker.runTask(ThreadPoolExecutor.java:886)
	at java.util.concurrent.ThreadPoolExecutor$Worker.run(ThreadPoolExecutor.java:908)
	at java.lang.Thread.run(Thread.java:619)
Caused by: org.apache.maven.project.DependencyResolutionException: Could not resolve dependencies
for project org.apache.directory.server:apacheds-core-api:bundle:2.0.0-M5-SNAPSHOT: The following
artifacts could not be resolved: org.apache.directory.shared:shared-i18n:jar:1.0.0-M9, org.apache.directory.shared:shared-asn1-api:jar:1.0.0-M9,
org.apache.directory.shared:shared-ldap-client-api:jar:1.0.0-M9, org.apache.directory.shared:shared-ldap-codec-core:jar:1.0.0-M9,
org.apache.directory.shared:shared-ldap-extras-aci:jar:1.0.0-M9, org.apache.directory.shared:shared-ldap-extras-util:jar:1.0.0-M9,
org.apache.directory.shared:shared-ldap-model:jar:1.0.0-M9, org.apache.directory.shared:shared-ldap-schema-data:jar:1.0.0-M9,
org.apache.directory.shared:shared-util:jar:1.0.0-M9: Could not find artifact org.apache.directory.shared:shared-i18n:jar:1.0.0-M9
in central (http://repo1.maven.org/maven2)
	at org.apache.maven.project.DefaultProjectDependenciesResolver.resolve(DefaultProjectDependenciesResolver.java:170)
	at org.apache.maven.lifecycle.internal.LifecycleDependencyResolver.getDependencies(LifecycleDependencyResolver.java:171)
	... 30 more
Caused by: org.sonatype.aether.resolution.DependencyResolutionException: The following artifacts
could not be resolved: org.apache.directory.shared:shared-i18n:jar:1.0.0-M9, org.apache.directory.shared:shared-asn1-api:jar:1.0.0-M9,
org.apache.directory.shared:shared-ldap-client-api:jar:1.0.0-M9, org.apache.directory.shared:shared-ldap-codec-core:jar:1.0.0-M9,
org.apache.directory.shared:shared-ldap-extras-aci:jar:1.0.0-M9, org.apache.directory.shared:shared-ldap-extras-util:jar:1.0.0-M9,
org.apache.directory.shared:shared-ldap-model:jar:1.0.0-M9, org.apache.directory.shared:shared-ldap-schema-data:jar:1.0.0-M9,
org.apache.directory.shared:shared-util:jar:1.0.0-M9: Could not find artifact org.apache.directory.shared:shared-i18n:jar:1.0.0-M9
in central (http://repo1.maven.org/maven2)
	at org.sonatype.aether.impl.internal.DefaultRepositorySystem.resolveDependencies(DefaultRepositorySystem.java:412)
	at org.apache.maven.project.DefaultProjectDependenciesResolver.resolve(DefaultProjectDependenciesResolver.java:164)
	... 31 more
Caused by: org.sonatype.aether.resolution.ArtifactResolutionException: The following artifacts
could not be resolved: org.apache.directory.shared:shared-i18n:jar:1.0.0-M9, org.apache.directory.shared:shared-asn1-api:jar:1.0.0-M9,
org.apache.directory.shared:shared-ldap-client-api:jar:1.0.0-M9, org.apache.directory.shared:shared-ldap-codec-core:jar:1.0.0-M9,
org.apache.directory.shared:shared-ldap-extras-aci:jar:1.0.0-M9, org.apache.directory.shared:shared-ldap-extras-util:jar:1.0.0-M9,
org.apache.directory.shared:shared-ldap-model:jar:1.0.0-M9, org.apache.directory.shared:shared-ldap-schema-data:jar:1.0.0-M9,
org.apache.directory.shared:shared-util:jar:1.0.0-M9: Could not find artifact org.apache.directory.shared:shared-i18n:jar:1.0.0-M9
in central (http://repo1.maven.org/maven2)
	at org.sonatype.aether.impl.internal.DefaultArtifactResolver.resolve(DefaultArtifactResolver.java:541)
	at org.sonatype.aether.impl.internal.DefaultArtifactResolver.resolveArtifacts(DefaultArtifactResolver.java:220)
	at org.sonatype.aether.impl.internal.DefaultRepositorySystem.resolveDependencies(DefaultRepositorySystem.java:395)
	... 32 more
Caused by: org.sonatype.aether.transfer.ArtifactNotFoundException: Could not find artifact
org.apache.directory.shared:shared-i18n:jar:1.0.0-M9 in central (http://repo1.maven.org/maven2)
	at org.sonatype.aether.connector.wagon.WagonRepositoryConnector$4.wrap(WagonRepositoryConnector.java:945)
	at org.sonatype.aether.connector.wagon.WagonRepositoryConnector$4.wrap(WagonRepositoryConnector.java:940)
	at org.sonatype.aether.connector.wagon.WagonRepositoryConnector$GetTask.flush(WagonRepositoryConnector.java:695)
	at org.sonatype.aether.connector.wagon.WagonRepositoryConnector$GetTask.flush(WagonRepositoryConnector.java:689)
	at org.sonatype.aether.connector.wagon.WagonRepositoryConnector.get(WagonRepositoryConnector.java:445)
	at org.sonatype.aether.impl.internal.DefaultArtifactResolver.resolve(DefaultArtifactResolver.java:460)
	... 34 more
channel stopped


Mime
View raw message