directory-notifications mailing list archives

Site index · List index
Message view « Date » · « Thread »
Top « Date » · « Thread »
From Apache Jenkins Server <jenk...@builds.apache.org>
Subject Build failed in Jenkins: dir-apacheds-jdk16-ubuntu-deploy #519
Date Sat, 28 Jan 2012 04:04:02 GMT
See <https://builds.apache.org/job/dir-apacheds-jdk16-ubuntu-deploy/519/changes>

Changes:

[pamarcelot] Moved to the next snapshot of Shared.

[pamarcelot] [maven-release-plugin] prepare for next development iteration

[pamarcelot] [maven-release-plugin] prepare release 2.0.0-M5

[pamarcelot] Removed SNAPSHOT version.

------------------------------------------
[...truncated 1463 lines...]
[INFO] 
[INFO] --- maven-site-plugin:3.0:attach-descriptor (attach-descriptor) @ apacheds-core-constants
---
[INFO] [INFO] Checking legal files in: apacheds-core-constants-2.0.0-M6-SNAPSHOT.jar

[INFO] --- tools-maven-plugin:1.4:verify-legal-files (verify-legal-files) @ apacheds-core-constants
---
[INFO] [INFO] Installing <https://builds.apache.org/job/dir-apacheds-jdk16-ubuntu-deploy/ws/trunk/core-constants/target/apacheds-core-constants-2.0.0-M6-SNAPSHOT.jar>
to /home/hudson/.m2/repository/org/apache/directory/server/apacheds-core-constants/2.0.0-M6-SNAPSHOT/apacheds-core-constants-2.0.0-M6-SNAPSHOT.jar
[INFO] Installing <https://builds.apache.org/job/dir-apacheds-jdk16-ubuntu-deploy/ws/trunk/core-constants/pom.xml>
to /home/hudson/.m2/repository/org/apache/directory/server/apacheds-core-constants/2.0.0-M6-SNAPSHOT/apacheds-core-constants-2.0.0-M6-SNAPSHOT.pom

[INFO] --- maven-install-plugin:2.3.1:install (default-install) @ apacheds-core-constants
---
[INFO] [WARNING] Exception while updating local OBR: Unable to read repository xml: file:/home/hudson/.m2/repository/repository.xml
org.apache.maven.plugin.MojoExecutionException: Unable to read repository xml: file:/home/hudson/.m2/repository/repository.xml
	at org.apache.felix.obrplugin.ObrUpdate.parseRepositoryXml(ObrUpdate.java:295)
	at org.apache.felix.obrplugin.ObrInstall.execute(ObrInstall.java:140)
	at org.apache.maven.plugin.DefaultBuildPluginManager.executeMojo(DefaultBuildPluginManager.java:101)
	at org.apache.maven.lifecycle.internal.MojoExecutor.execute(MojoExecutor.java:209)
	at org.apache.maven.lifecycle.internal.MojoExecutor.execute(MojoExecutor.java:153)
	at org.apache.maven.lifecycle.internal.MojoExecutor.execute(MojoExecutor.java:145)
	at org.apache.maven.lifecycle.internal.LifecycleModuleBuilder.buildProject(LifecycleModuleBuilder.java:84)
	at org.apache.maven.lifecycle.internal.LifecycleModuleBuilder.buildProject(LifecycleModuleBuilder.java:59)
	at org.apache.maven.lifecycle.internal.LifecycleStarter.singleThreadedBuild(LifecycleStarter.java:183)
	at org.apache.maven.lifecycle.internal.LifecycleStarter.execute(LifecycleStarter.java:161)
	at org.apache.maven.DefaultMaven.doExecute(DefaultMaven.java:319)
	at org.apache.maven.DefaultMaven.execute(DefaultMaven.java:156)
	at org.jvnet.hudson.maven3.launcher.Maven3Launcher.main(Maven3Launcher.java:79)
	at sun.reflect.NativeMethodAccessorImpl.invoke0(Native Method)
	at sun.reflect.NativeMethodAccessorImpl.invoke(NativeMethodAccessorImpl.java:39)
	at sun.reflect.DelegatingMethodAccessorImpl.invoke(DelegatingMethodAccessorImpl.java:25)
	at java.lang.reflect.Method.invoke(Method.java:597)
	at org.codehaus.plexus.classworlds.launcher.Launcher.launchStandard(Launcher.java:329)
	at org.codehaus.plexus.classworlds.launcher.Launcher.launch(Launcher.java:239)
	at org.jvnet.hudson.maven3.agent.Maven3Main.launch(Maven3Main.java:158)
	at hudson.maven.Maven3Builder.call(Maven3Builder.java:104)
	at hudson.maven.Maven3Builder.call(Maven3Builder.java:70)
	at hudson.remoting.UserRequest.perform(UserRequest.java:118)
	at hudson.remoting.UserRequest.perform(UserRequest.java:48)
	at hudson.remoting.Request$2.run(Request.java:287)
	at java.util.concurrent.Executors$RunnableAdapter.call(Executors.java:441)
	at java.util.concurrent.FutureTask$Sync.innerRun(FutureTask.java:303)
	at java.util.concurrent.FutureTask.run(FutureTask.java:138)
	at java.util.concurrent.ThreadPoolExecutor$Worker.runTask(ThreadPoolExecutor.java:886)
	at java.util.concurrent.ThreadPoolExecutor$Worker.run(ThreadPoolExecutor.java:908)
	at java.lang.Thread.run(Thread.java:619)
Caused by: org.xmlpull.v1.XmlPullParserException: unexpected type (position:END_DOCUMENT null@3:1
in java.io.InputStreamReader@29d88c) 
	at org.kxml2.io.KXmlParser.exception(Unknown Source)
	at org.kxml2.io.KXmlParser.nextTag(Unknown Source)
	at org.apache.felix.bundlerepository.impl.PullParser.parseRepository(PullParser.java:43)
	at org.apache.felix.bundlerepository.impl.DataModelHelperImpl.repository(DataModelHelperImpl.java:147)

	at org.apache.felix.bundlerepository.impl.DataModelHelperImpl.repository(DataModelHelperImpl.java:118)
[INFO] --- maven-bundle-plugin:2.3.4:install (default-install) @ apacheds-core-constants ---
at org.apache.felix.obrplugin.ObrUpdate.parseRepositoryXml(ObrUpdate.java:291)
	... 30 more

[INFO] Downloading: https://repository.apache.org/content/repositories/snapshots/org/apache/directory/server/apacheds-core-constants/2.0.0-M6-SNAPSHOT/maven-metadata.xml

[INFO] --- maven-deploy-plugin:2.7:deploy (default-deploy) @ apacheds-core-constants ---
Uploading: https://repository.apache.org/content/repositories/snapshots/org/apache/directory/server/apacheds-core-constants/2.0.0-M6-SNAPSHOT/apacheds-core-constants-2.0.0-M6-20120128.040350-1.jar
Uploaded: https://repository.apache.org/content/repositories/snapshots/org/apache/directory/server/apacheds-core-constants/2.0.0-M6-SNAPSHOT/apacheds-core-constants-2.0.0-M6-20120128.040350-1.jar
(10 KB at 18.2 KB/sec)
Uploading: https://repository.apache.org/content/repositories/snapshots/org/apache/directory/server/apacheds-core-constants/2.0.0-M6-SNAPSHOT/apacheds-core-constants-2.0.0-M6-20120128.040350-1.pom
Uploaded: https://repository.apache.org/content/repositories/snapshots/org/apache/directory/server/apacheds-core-constants/2.0.0-M6-SNAPSHOT/apacheds-core-constants-2.0.0-M6-20120128.040350-1.pom
(3 KB at 14.5 KB/sec)
Downloading: https://repository.apache.org/content/repositories/snapshots/org/apache/directory/server/apacheds-core-constants/maven-metadata.xml
Downloaded: https://repository.apache.org/content/repositories/snapshots/org/apache/directory/server/apacheds-core-constants/maven-metadata.xml
(459 B at 2.6 KB/sec)
Uploading: https://repository.apache.org/content/repositories/snapshots/org/apache/directory/server/apacheds-core-constants/2.0.0-M6-SNAPSHOT/maven-metadata.xml
Uploaded: https://repository.apache.org/content/repositories/snapshots/org/apache/directory/server/apacheds-core-constants/2.0.0-M6-SNAPSHOT/maven-metadata.xml
(809 B at 4.5 KB/sec)
Uploading: https://repository.apache.org/content/repositories/snapshots/org/apache/directory/server/apacheds-core-constants/maven-metadata.xml
Uploaded: https://repository.apache.org/content/repositories/snapshots/org/apache/directory/server/apacheds-core-constants/maven-metadata.xml
(502 B at 2.3 KB/sec)
[INFO] [INFO] Remote OBR update disabled (enable with -DremoteOBR)

[INFO] --- maven-bundle-plugin:2.3.4:deploy (default-deploy) @ apacheds-core-constants ---
[JENKINS] Archiving <https://builds.apache.org/job/dir-apacheds-jdk16-ubuntu-deploy/ws/trunk/core-constants/pom.xml>
to /home/hudson/hudson/jobs/dir-apacheds-jdk16-ubuntu-deploy/modules/org.apache.directory.server$apacheds-core-constants/builds/2012-01-28_04-02-31/archive/org.apache.directory.server/apacheds-core-constants/2.0.0-M6-SNAPSHOT/apacheds-core-constants-2.0.0-M6-SNAPSHOT.pom
[JENKINS] Archiving <https://builds.apache.org/job/dir-apacheds-jdk16-ubuntu-deploy/ws/trunk/core-constants/target/apacheds-core-constants-2.0.0-M6-SNAPSHOT.jar>
to /home/hudson/hudson/jobs/dir-apacheds-jdk16-ubuntu-deploy/modules/org.apache.directory.server$apacheds-core-constants/builds/2012-01-28_04-02-31/archive/org.apache.directory.server/apacheds-core-constants/2.0.0-M6-20120128.040350-1/apacheds-core-constants-2.0.0-M6-20120128.040350-1.jar
[INFO]                                                                         
[INFO] ------------------------------------------------------------------------
[INFO] Building ApacheDS Core API 2.0.0-M6-SNAPSHOT
[INFO] ------------------------------------------------------------------------
Downloading: http://repository.apache.org/snapshots/org/apache/directory/shared/shared-i18n/1.0.0-M11-SNAPSHOT/maven-metadata.xml
Downloaded: http://repository.apache.org/snapshots/org/apache/directory/shared/shared-i18n/1.0.0-M11-SNAPSHOT/maven-metadata.xml
(1018 B at 5.5 KB/sec)
Downloading: http://repository.apache.org/snapshots/org/apache/directory/shared/shared-i18n/1.0.0-M11-SNAPSHOT/shared-i18n-1.0.0-M11-20120128.030235-1.pom
Downloaded: http://repository.apache.org/snapshots/org/apache/directory/shared/shared-i18n/1.0.0-M11-SNAPSHOT/shared-i18n-1.0.0-M11-20120128.030235-1.pom
(3 KB at 21.8 KB/sec)
Downloading: http://repository.apache.org/snapshots/org/apache/directory/shared/shared-parent/1.0.0-M11-SNAPSHOT/maven-metadata.xml
Downloaded: http://repository.apache.org/snapshots/org/apache/directory/shared/shared-parent/1.0.0-M11-SNAPSHOT/maven-metadata.xml
(625 B at 1.6 KB/sec)
Downloading: http://repository.apache.org/snapshots/org/apache/directory/shared/shared-parent/1.0.0-M11-SNAPSHOT/shared-parent-1.0.0-M11-20120128.030220-1.pom
Downloaded: http://repository.apache.org/snapshots/org/apache/directory/shared/shared-parent/1.0.0-M11-SNAPSHOT/shared-parent-1.0.0-M11-20120128.030220-1.pom
(27 KB at 124.2 KB/sec)
Downloading: http://repository.apache.org/snapshots/org/apache/directory/shared/shared-asn1-api/1.0.0-M11-SNAPSHOT/maven-metadata.xml
Downloading: http://repository.apache.org/snapshots/org/apache/directory/shared/shared-asn1-api/1.0.0-M11-SNAPSHOT/maven-metadata.xml
Downloading: http://repository.apache.org/snapshots/org/apache/directory/shared/shared-asn1-api/1.0.0-M11-SNAPSHOT/shared-asn1-api-1.0.0-M11-SNAPSHOT.pom
[WARNING] The POM for org.apache.directory.shared:shared-asn1-api:jar:1.0.0-M11-SNAPSHOT is
missing, no dependency information available
Downloading: http://repository.apache.org/snapshots/org/apache/directory/shared/shared-ldap-client-api/1.0.0-M11-SNAPSHOT/maven-metadata.xml
Downloading: http://repository.apache.org/snapshots/org/apache/directory/shared/shared-ldap-client-api/1.0.0-M11-SNAPSHOT/maven-metadata.xml
Downloading: http://repository.apache.org/snapshots/org/apache/directory/shared/shared-ldap-client-api/1.0.0-M11-SNAPSHOT/shared-ldap-client-api-1.0.0-M11-SNAPSHOT.pom
[WARNING] The POM for org.apache.directory.shared:shared-ldap-client-api:jar:1.0.0-M11-SNAPSHOT
is missing, no dependency information available
Downloading: http://repository.apache.org/snapshots/org/apache/directory/shared/shared-ldap-codec-core/1.0.0-M11-SNAPSHOT/maven-metadata.xml
Downloading: http://repository.apache.org/snapshots/org/apache/directory/shared/shared-ldap-codec-core/1.0.0-M11-SNAPSHOT/maven-metadata.xml
Downloading: http://repository.apache.org/snapshots/org/apache/directory/shared/shared-ldap-codec-core/1.0.0-M11-SNAPSHOT/shared-ldap-codec-core-1.0.0-M11-SNAPSHOT.pom
[WARNING] The POM for org.apache.directory.shared:shared-ldap-codec-core:jar:1.0.0-M11-SNAPSHOT
is missing, no dependency information available
Downloading: http://repository.apache.org/snapshots/org/apache/directory/shared/shared-ldap-extras-aci/1.0.0-M11-SNAPSHOT/maven-metadata.xml
Downloading: http://repository.apache.org/snapshots/org/apache/directory/shared/shared-ldap-extras-aci/1.0.0-M11-SNAPSHOT/maven-metadata.xml
Downloading: http://repository.apache.org/snapshots/org/apache/directory/shared/shared-ldap-extras-aci/1.0.0-M11-SNAPSHOT/shared-ldap-extras-aci-1.0.0-M11-SNAPSHOT.pom
[WARNING] The POM for org.apache.directory.shared:shared-ldap-extras-aci:jar:1.0.0-M11-SNAPSHOT
is missing, no dependency information available
Downloading: http://repository.apache.org/snapshots/org/apache/directory/shared/shared-ldap-extras-util/1.0.0-M11-SNAPSHOT/maven-metadata.xml
Downloading: http://repository.apache.org/snapshots/org/apache/directory/shared/shared-ldap-extras-util/1.0.0-M11-SNAPSHOT/maven-metadata.xml
Downloading: http://repository.apache.org/snapshots/org/apache/directory/shared/shared-ldap-extras-util/1.0.0-M11-SNAPSHOT/shared-ldap-extras-util-1.0.0-M11-SNAPSHOT.pom
[WARNING] The POM for org.apache.directory.shared:shared-ldap-extras-util:jar:1.0.0-M11-SNAPSHOT
is missing, no dependency information available
Downloading: http://repository.apache.org/snapshots/org/apache/directory/shared/shared-ldap-model/1.0.0-M11-SNAPSHOT/maven-metadata.xml
Downloading: http://repository.apache.org/snapshots/org/apache/directory/shared/shared-ldap-model/1.0.0-M11-SNAPSHOT/maven-metadata.xml
Downloading: http://repository.apache.org/snapshots/org/apache/directory/shared/shared-ldap-model/1.0.0-M11-SNAPSHOT/shared-ldap-model-1.0.0-M11-SNAPSHOT.pom
[WARNING] The POM for org.apache.directory.shared:shared-ldap-model:jar:1.0.0-M11-SNAPSHOT
is missing, no dependency information available
Downloading: http://repository.apache.org/snapshots/org/apache/directory/shared/shared-ldap-schema-data/1.0.0-M11-SNAPSHOT/maven-metadata.xml
Downloading: http://repository.apache.org/snapshots/org/apache/directory/shared/shared-ldap-schema-data/1.0.0-M11-SNAPSHOT/maven-metadata.xml
Downloading: http://repository.apache.org/snapshots/org/apache/directory/shared/shared-ldap-schema-data/1.0.0-M11-SNAPSHOT/shared-ldap-schema-data-1.0.0-M11-SNAPSHOT.pom
[WARNING] The POM for org.apache.directory.shared:shared-ldap-schema-data:jar:1.0.0-M11-SNAPSHOT
is missing, no dependency information available
Downloading: http://repository.apache.org/snapshots/org/apache/directory/shared/shared-util/1.0.0-M11-SNAPSHOT/maven-metadata.xml
Downloading: http://repository.apache.org/snapshots/org/apache/directory/shared/shared-util/1.0.0-M11-SNAPSHOT/maven-metadata.xml
Downloading: http://repository.apache.org/snapshots/org/apache/directory/shared/shared-util/1.0.0-M11-SNAPSHOT/shared-util-1.0.0-M11-SNAPSHOT.pom
[WARNING] The POM for org.apache.directory.shared:shared-util:jar:1.0.0-M11-SNAPSHOT is missing,
no dependency information available
Downloading: http://repository.apache.org/snapshots/org/apache/directory/shared/shared-i18n/1.0.0-M11-SNAPSHOT/shared-i18n-1.0.0-M11-20120128.030235-1.jar
Downloading: http://repository.apache.org/snapshots/org/apache/directory/shared/shared-asn1-api/1.0.0-M11-SNAPSHOT/shared-asn1-api-1.0.0-M11-SNAPSHOT.jar
Downloading: http://repository.apache.org/snapshots/org/apache/directory/shared/shared-ldap-client-api/1.0.0-M11-SNAPSHOT/shared-ldap-client-api-1.0.0-M11-SNAPSHOT.jar
Downloading: http://repository.apache.org/snapshots/org/apache/directory/shared/shared-ldap-codec-core/1.0.0-M11-SNAPSHOT/shared-ldap-codec-core-1.0.0-M11-SNAPSHOT.jar
Downloading: http://repository.apache.org/snapshots/org/apache/directory/shared/shared-ldap-extras-aci/1.0.0-M11-SNAPSHOT/shared-ldap-extras-aci-1.0.0-M11-SNAPSHOT.jar
Downloading: http://repository.apache.org/snapshots/org/apache/directory/shared/shared-ldap-extras-util/1.0.0-M11-SNAPSHOT/shared-ldap-extras-util-1.0.0-M11-SNAPSHOT.jar
Downloading: http://repository.apache.org/snapshots/org/apache/directory/shared/shared-ldap-model/1.0.0-M11-SNAPSHOT/shared-ldap-model-1.0.0-M11-SNAPSHOT.jar
Downloading: http://repository.apache.org/snapshots/org/apache/directory/shared/shared-ldap-schema-data/1.0.0-M11-SNAPSHOT/shared-ldap-schema-data-1.0.0-M11-SNAPSHOT.jar
Downloading: http://repository.apache.org/snapshots/org/apache/directory/shared/shared-util/1.0.0-M11-SNAPSHOT/shared-util-1.0.0-M11-SNAPSHOT.jar
Downloaded: http://repository.apache.org/snapshots/org/apache/directory/shared/shared-i18n/1.0.0-M11-SNAPSHOT/shared-i18n-1.0.0-M11-20120128.030235-1.jar
(44 KB at 98.5 KB/sec)
[JENKINS] Archiving <https://builds.apache.org/job/dir-apacheds-jdk16-ubuntu-deploy/ws/trunk/core-api/pom.xml>
to /home/hudson/hudson/jobs/dir-apacheds-jdk16-ubuntu-deploy/modules/org.apache.directory.server$apacheds-core-api/builds/2012-01-28_04-02-31/archive/org.apache.directory.server/apacheds-core-api/2.0.0-M6-SNAPSHOT/apacheds-core-api-2.0.0-M6-SNAPSHOT.pom
[INFO] ------------------------------------------------------------------------
[INFO] Reactor Summary:
[INFO] 
[INFO] ApacheDS .......................................... SUCCESS [46.040s]
[INFO] ApacheDS I18n ..................................... SUCCESS [11.482s]
[INFO] ApacheDS Core Constants ........................... SUCCESS [4.787s]
[INFO] ApacheDS Core API ................................. FAILURE [4.760s]
[INFO] ApacheDS Core Shared .............................. SKIPPED
[INFO] ApacheDS Interceptors ............................. SKIPPED
[INFO] ApacheDS AdministrativePoint Interceptor .......... SKIPPED
[INFO] ApacheDS Authentication Interceptor ............... SKIPPED
[INFO] ApacheDS Authorization Interceptor ................ SKIPPED
[INFO] ApacheDS ChangeLog Interceptor .................... SKIPPED
[INFO] ApacheDS Collective Attribute Interceptor ......... SKIPPED
[INFO] ApacheDS Event Interceptor ........................ SKIPPED
[INFO] ApacheDS Exception Interceptor .................... SKIPPED
[INFO] ApacheDS Journal Interceptor ...................... SKIPPED
[INFO] ApacheDS Normalization Interceptor ................ SKIPPED
[INFO] ApacheDS Operational Attribute Interceptor ........ SKIPPED
[INFO] ApacheDS Referral Interceptor ..................... SKIPPED
[INFO] ApacheDS Schema Interceptor ....................... SKIPPED
[INFO] ApacheDS Subtree Interceptor ...................... SKIPPED
[INFO] ApacheDS Triggers Interceptor ..................... SKIPPED
[INFO] ApacheDS Core ..................................... SKIPPED
[INFO] ApacheDS Core AVL ................................. SKIPPED
[INFO] ApacheDS Generalized (X) DBM Partition ............ SKIPPED
[INFO] ApacheDS LDIF Partition ........................... SKIPPED
[INFO] ApacheDS JDBM implementation ...................... SKIPPED
[INFO] ApacheDS JDBM Partition ........................... SKIPPED
[INFO] ApacheDS Core Annotations ......................... SKIPPED
[INFO] ApacheDS Core JNDI ................................ SKIPPED
[INFO] ApacheDS Protocol Shared .......................... SKIPPED
[INFO] ApacheDS Protocol Kerberos Codec .................. SKIPPED
[INFO] ApacheDS Interceptors for Kerberos ................ SKIPPED
[INFO] ApacheDS Protocol Dhcp ............................ SKIPPED
[INFO] ApacheDS Protocol Dns ............................. SKIPPED
[INFO] ApacheDS Protocol Kerberos ........................ SKIPPED
[INFO] ApacheDS Protocol Ldap ............................ SKIPPED
[INFO] ApacheDS Protocol Ntp ............................. SKIPPED
[INFO] Apacheds Server Annotations ....................... SKIPPED
[INFO] ApacheDS Server Config ............................ SKIPPED
[INFO] ApacheDS Server JNDI .............................. SKIPPED
[INFO] ApacheDS Server Replication Service ............... SKIPPED
[INFO] ApacheDS Test Framework ........................... SKIPPED
[INFO] ApacheDS Generalized (X) DBM Tools ................ SKIPPED
[INFO] ApacheDS All ...................................... SKIPPED
[INFO] ApacheDS Logger Interceptor ....................... SKIPPED
[INFO] ApacheDS Password Hashing Interceptor ............. SKIPPED
[INFO] ApacheDS Core Integration ......................... SKIPPED
[INFO] ApacheDS Server Integration ....................... SKIPPED
[INFO] ApacheDS DirectoryService-WebApp bridge ........... SKIPPED
[INFO] ApacheDS Jetty HTTP Server Integration ............ SKIPPED
[INFO] ApacheDS Service Builder .......................... SKIPPED
[INFO] ApacheDS Protocol Kerberos Test ................... SKIPPED
[INFO] Apache Directory LDAP Client API test ............. SKIPPED
[INFO] ApacheDS Service .................................. SKIPPED
[INFO] ApacheDS Wrapper .................................. SKIPPED
[INFO] ApacheDS Installers Maven Plugin .................. SKIPPED
[INFO] ApacheDS Installers ............................... SKIPPED
[INFO] ------------------------------------------------------------------------
[INFO] BUILD FAILURE
[INFO] ------------------------------------------------------------------------
[INFO] Total time: 1:14.825s
[INFO] Finished at: Sat Jan 28 04:03:58 UTC 2012
[INFO] Final Memory: 43M/216M
[INFO] ------------------------------------------------------------------------
mavenExecutionResult exceptions not empty
message : Failed to execute goal on project apacheds-core-api: Could not resolve dependencies
for project org.apache.directory.server:apacheds-core-api:bundle:2.0.0-M6-SNAPSHOT: The following
artifacts could not be resolved: org.apache.directory.shared:shared-asn1-api:jar:1.0.0-M11-SNAPSHOT,
org.apache.directory.shared:shared-ldap-client-api:jar:1.0.0-M11-SNAPSHOT, org.apache.directory.shared:shared-ldap-codec-core:jar:1.0.0-M11-SNAPSHOT,
org.apache.directory.shared:shared-ldap-extras-aci:jar:1.0.0-M11-SNAPSHOT, org.apache.directory.shared:shared-ldap-extras-util:jar:1.0.0-M11-SNAPSHOT,
org.apache.directory.shared:shared-ldap-model:jar:1.0.0-M11-SNAPSHOT, org.apache.directory.shared:shared-ldap-schema-data:jar:1.0.0-M11-SNAPSHOT,
org.apache.directory.shared:shared-util:jar:1.0.0-M11-SNAPSHOT: Could not find artifact org.apache.directory.shared:shared-asn1-api:jar:1.0.0-M11-SNAPSHOT
in Nexus (http://repository.apache.org/snapshots)
cause : Could not resolve dependencies for project org.apache.directory.server:apacheds-core-api:bundle:2.0.0-M6-SNAPSHOT:
The following artifacts could not be resolved: org.apache.directory.shared:shared-asn1-api:jar:1.0.0-M11-SNAPSHOT,
org.apache.directory.shared:shared-ldap-client-api:jar:1.0.0-M11-SNAPSHOT, org.apache.directory.shared:shared-ldap-codec-core:jar:1.0.0-M11-SNAPSHOT,
org.apache.directory.shared:shared-ldap-extras-aci:jar:1.0.0-M11-SNAPSHOT, org.apache.directory.shared:shared-ldap-extras-util:jar:1.0.0-M11-SNAPSHOT,
org.apache.directory.shared:shared-ldap-model:jar:1.0.0-M11-SNAPSHOT, org.apache.directory.shared:shared-ldap-schema-data:jar:1.0.0-M11-SNAPSHOT,
org.apache.directory.shared:shared-util:jar:1.0.0-M11-SNAPSHOT: Could not find artifact org.apache.directory.shared:shared-asn1-api:jar:1.0.0-M11-SNAPSHOT
in Nexus (http://repository.apache.org/snapshots)
Stack trace : 
org.apache.maven.lifecycle.LifecycleExecutionException: Failed to execute goal on project
apacheds-core-api: Could not resolve dependencies for project org.apache.directory.server:apacheds-core-api:bundle:2.0.0-M6-SNAPSHOT:
The following artifacts could not be resolved: org.apache.directory.shared:shared-asn1-api:jar:1.0.0-M11-SNAPSHOT,
org.apache.directory.shared:shared-ldap-client-api:jar:1.0.0-M11-SNAPSHOT, org.apache.directory.shared:shared-ldap-codec-core:jar:1.0.0-M11-SNAPSHOT,
org.apache.directory.shared:shared-ldap-extras-aci:jar:1.0.0-M11-SNAPSHOT, org.apache.directory.shared:shared-ldap-extras-util:jar:1.0.0-M11-SNAPSHOT,
org.apache.directory.shared:shared-ldap-model:jar:1.0.0-M11-SNAPSHOT, org.apache.directory.shared:shared-ldap-schema-data:jar:1.0.0-M11-SNAPSHOT,
org.apache.directory.shared:shared-util:jar:1.0.0-M11-SNAPSHOT: Could not find artifact org.apache.directory.shared:shared-asn1-api:jar:1.0.0-M11-SNAPSHOT
in Nexus (http://repository.apache.org/snapshots)
	at org.apache.maven.lifecycle.internal.LifecycleDependencyResolver.getDependencies(LifecycleDependencyResolver.java:196)
	at org.apache.maven.lifecycle.internal.LifecycleDependencyResolver.resolveProjectDependencies(LifecycleDependencyResolver.java:108)
	at org.apache.maven.lifecycle.internal.MojoExecutor.ensureDependenciesAreResolved(MojoExecutor.java:258)
	at org.apache.maven.lifecycle.internal.MojoExecutor.execute(MojoExecutor.java:201)
	at org.apache.maven.lifecycle.internal.MojoExecutor.execute(MojoExecutor.java:153)
	at org.apache.maven.lifecycle.internal.MojoExecutor.execute(MojoExecutor.java:145)
	at org.apache.maven.lifecycle.internal.LifecycleModuleBuilder.buildProject(LifecycleModuleBuilder.java:84)
	at org.apache.maven.lifecycle.internal.LifecycleModuleBuilder.buildProject(LifecycleModuleBuilder.java:59)
	at org.apache.maven.lifecycle.internal.LifecycleStarter.singleThreadedBuild(LifecycleStarter.java:183)
	at org.apache.maven.lifecycle.internal.LifecycleStarter.execute(LifecycleStarter.java:161)
	at org.apache.maven.DefaultMaven.doExecute(DefaultMaven.java:319)
	at org.apache.maven.DefaultMaven.execute(DefaultMaven.java:156)
	at org.jvnet.hudson.maven3.launcher.Maven3Launcher.main(Maven3Launcher.java:79)
	at sun.reflect.NativeMethodAccessorImpl.invoke0(Native Method)
	at sun.reflect.NativeMethodAccessorImpl.invoke(NativeMethodAccessorImpl.java:39)
	at sun.reflect.DelegatingMethodAccessorImpl.invoke(DelegatingMethodAccessorImpl.java:25)
	at java.lang.reflect.Method.invoke(Method.java:597)
	at org.codehaus.plexus.classworlds.launcher.Launcher.launchStandard(Launcher.java:329)
	at org.codehaus.plexus.classworlds.launcher.Launcher.launch(Launcher.java:239)
	at org.jvnet.hudson.maven3.agent.Maven3Main.launch(Maven3Main.java:158)
	at hudson.maven.Maven3Builder.call(Maven3Builder.java:104)
	at hudson.maven.Maven3Builder.call(Maven3Builder.java:70)
	at hudson.remoting.UserRequest.perform(UserRequest.java:118)
	at hudson.remoting.UserRequest.perform(UserRequest.java:48)
	at hudson.remoting.Request$2.run(Request.java:287)
	at java.util.concurrent.Executors$RunnableAdapter.call(Executors.java:441)
	at java.util.concurrent.FutureTask$Sync.innerRun(FutureTask.java:303)
	at java.util.concurrent.FutureTask.run(FutureTask.java:138)
	at java.util.concurrent.ThreadPoolExecutor$Worker.runTask(ThreadPoolExecutor.java:886)
	at java.util.concurrent.ThreadPoolExecutor$Worker.run(ThreadPoolExecutor.java:908)
	at java.lang.Thread.run(Thread.java:619)
Caused by: org.apache.maven.project.DependencyResolutionException: Could not resolve dependencies
for project org.apache.directory.server:apacheds-core-api:bundle:2.0.0-M6-SNAPSHOT: The following
artifacts could not be resolved: org.apache.directory.shared:shared-asn1-api:jar:1.0.0-M11-SNAPSHOT,
org.apache.directory.shared:shared-ldap-client-api:jar:1.0.0-M11-SNAPSHOT, org.apache.directory.shared:shared-ldap-codec-core:jar:1.0.0-M11-SNAPSHOT,
org.apache.directory.shared:shared-ldap-extras-aci:jar:1.0.0-M11-SNAPSHOT, org.apache.directory.shared:shared-ldap-extras-util:jar:1.0.0-M11-SNAPSHOT,
org.apache.directory.shared:shared-ldap-model:jar:1.0.0-M11-SNAPSHOT, org.apache.directory.shared:shared-ldap-schema-data:jar:1.0.0-M11-SNAPSHOT,
org.apache.directory.shared:shared-util:jar:1.0.0-M11-SNAPSHOT: Could not find artifact org.apache.directory.shared:shared-asn1-api:jar:1.0.0-M11-SNAPSHOT
in Nexus (http://repository.apache.org/snapshots)
	at org.apache.maven.project.DefaultProjectDependenciesResolver.resolve(DefaultProjectDependenciesResolver.java:170)
	at org.apache.maven.lifecycle.internal.LifecycleDependencyResolver.getDependencies(LifecycleDependencyResolver.java:171)
	... 30 more
Caused by: org.sonatype.aether.resolution.DependencyResolutionException: The following artifacts
could not be resolved: org.apache.directory.shared:shared-asn1-api:jar:1.0.0-M11-SNAPSHOT,
org.apache.directory.shared:shared-ldap-client-api:jar:1.0.0-M11-SNAPSHOT, org.apache.directory.shared:shared-ldap-codec-core:jar:1.0.0-M11-SNAPSHOT,
org.apache.directory.shared:shared-ldap-extras-aci:jar:1.0.0-M11-SNAPSHOT, org.apache.directory.shared:shared-ldap-extras-util:jar:1.0.0-M11-SNAPSHOT,
org.apache.directory.shared:shared-ldap-model:jar:1.0.0-M11-SNAPSHOT, org.apache.directory.shared:shared-ldap-schema-data:jar:1.0.0-M11-SNAPSHOT,
org.apache.directory.shared:shared-util:jar:1.0.0-M11-SNAPSHOT: Could not find artifact org.apache.directory.shared:shared-asn1-api:jar:1.0.0-M11-SNAPSHOT
in Nexus (http://repository.apache.org/snapshots)
	at org.sonatype.aether.impl.internal.DefaultRepositorySystem.resolveDependencies(DefaultRepositorySystem.java:412)
	at org.apache.maven.project.DefaultProjectDependenciesResolver.resolve(DefaultProjectDependenciesResolver.java:164)
	... 31 more
Caused by: org.sonatype.aether.resolution.ArtifactResolutionException: The following artifacts
could not be resolved: org.apache.directory.shared:shared-asn1-api:jar:1.0.0-M11-SNAPSHOT,
org.apache.directory.shared:shared-ldap-client-api:jar:1.0.0-M11-SNAPSHOT, org.apache.directory.shared:shared-ldap-codec-core:jar:1.0.0-M11-SNAPSHOT,
org.apache.directory.shared:shared-ldap-extras-aci:jar:1.0.0-M11-SNAPSHOT, org.apache.directory.shared:shared-ldap-extras-util:jar:1.0.0-M11-SNAPSHOT,
org.apache.directory.shared:shared-ldap-model:jar:1.0.0-M11-SNAPSHOT, org.apache.directory.shared:shared-ldap-schema-data:jar:1.0.0-M11-SNAPSHOT,
org.apache.directory.shared:shared-util:jar:1.0.0-M11-SNAPSHOT: Could not find artifact org.apache.directory.shared:shared-asn1-api:jar:1.0.0-M11-SNAPSHOT
in Nexus (http://repository.apache.org/snapshots)
	at org.sonatype.aether.impl.internal.DefaultArtifactResolver.resolve(DefaultArtifactResolver.java:541)
	at org.sonatype.aether.impl.internal.DefaultArtifactResolver.resolveArtifacts(DefaultArtifactResolver.java:220)
	at org.sonatype.aether.impl.internal.DefaultRepositorySystem.resolveDependencies(DefaultRepositorySystem.java:395)
	... 32 more
Caused by: org.sonatype.aether.transfer.ArtifactNotFoundException: Could not find artifact
org.apache.directory.shared:shared-asn1-api:jar:1.0.0-M11-SNAPSHOT in Nexus (http://repository.apache.org/snapshots)
	at org.sonatype.aether.connector.wagon.WagonRepositoryConnector$4.wrap(WagonRepositoryConnector.java:945)
	at org.sonatype.aether.connector.wagon.WagonRepositoryConnector$4.wrap(WagonRepositoryConnector.java:940)
	at org.sonatype.aether.connector.wagon.WagonRepositoryConnector$GetTask.flush(WagonRepositoryConnector.java:695)
	at org.sonatype.aether.connector.wagon.WagonRepositoryConnector$GetTask.flush(WagonRepositoryConnector.java:689)
	at org.sonatype.aether.connector.wagon.WagonRepositoryConnector.get(WagonRepositoryConnector.java:445)
	at org.sonatype.aether.impl.internal.DefaultArtifactResolver.resolve(DefaultArtifactResolver.java:460)
	... 34 more
channel stopped


Mime
View raw message