directory-notifications mailing list archives

Site index · List index
Message view « Date » · « Thread »
Top « Date » · « Thread »
From Apache Jenkins Server <jenk...@builds.apache.org>
Subject Build failed in Jenkins: dir-shared-jdk16-win #453
Date Sun, 11 Dec 2011 03:01:45 GMT
See <https://builds.apache.org/job/dir-shared-jdk16-win/453/>

------------------------------------------
[...truncated 7 lines...]
[trunk] $ f:\hudson\tools\java\latest-1.6-64/bin/java -Xmx512m -XX:MaxPermSize=128m -cp f:\hudson\hudson-slave\maven3-agent.jar;f:\hudson\tools\maven\latest3\boot\plexus-classworlds-2.4.jar
org.jvnet.hudson.maven3.agent.Maven3Main f:\hudson\tools\maven\latest3 C:\Users\hudson\AppData\LocalLow\Sun\Java\Deployment\cache\6.0\39\4bb6b7e7-1719b1e8
f:\hudson\hudson-slave\maven3-interceptor.jar 61530
<===[JENKINS REMOTING CAPACITY]===>   channel started
Executing Maven:  -B -f <https://builds.apache.org/job/dir-shared-jdk16-win/ws/trunk\pom.xml>
clean install
[INFO] Scanning for projects...
[INFO] ------------------------------------------------------------------------
[INFO] Reactor Build Order:
[INFO] 
[INFO] Apache Directory Shared
[INFO] Apache Directory Shared I18n
[INFO] Apache Directory Shared Utilities
[INFO] Apache Directory Shared ASN.1 Parent
[INFO] Apache Directory Shared ASN.1 API
[INFO] Apache Directory Shared ASN.1 BER
[INFO] Apache Directory Shared LDAP Parent
[INFO] Apache Directory Shared LDAP Model
[INFO] Apache Directory Shared LDAP Codec Parent
[INFO] Apache Directory Shared LDAP Codec
[INFO] Apache Directory Shared LDAP Net Parent
[INFO] Apache Directory Shared LDAP Network MINA
[INFO] Apache Directory Shared LDAP Codec Standalone
[INFO] Apache Directory Shared DSML Parent
[INFO] Apache Directory Shared DSML Parser
[INFO] Apache Directory Shared LDAP Extras
[INFO] Apache Directory Shared LDAP Extras ACI
[INFO] Apache Directory Shared LDAP Schema Parent
[INFO] Apache Directory Shared LDAP Schema
[INFO] Apache Directory Shared LDAP Client Parent
[INFO] Apache Directory Shared LDAP Client API
[INFO] Apache Directory Shared DSML Engine
[INFO] Apache Directory Shared LDAP Extras Codec API
[INFO] Apache Directory Shared LDAP Extras Codec
[INFO] Apache Directory Shared LDAP Extras Util
[INFO] Apache Directory Shared LDAP Extras Stored Procedures
[INFO] Apache Directory Shared LDAP Extras Trigger
[INFO] Apache Directory Shared LDAP Schema Converter
[INFO] Apache Directory Shared All
[INFO] Apache Directory Shared LDAP Client All
[INFO] Apache Directory Shared Integration Tests
[INFO] Apache Directory LDAP API Distribution
[INFO]                                                                         
[INFO] ------------------------------------------------------------------------
[INFO] Building Apache Directory Shared 1.0.0-M9-SNAPSHOT
[INFO] ------------------------------------------------------------------------
[INFO] 
[INFO] --- maven-clean-plugin:2.4.1:clean (default-clean) @ shared-parent ---
[INFO] Deleting <https://builds.apache.org/job/dir-shared-jdk16-win/ws/trunk\target>
[INFO] 
[INFO] --- maven-remote-resources-plugin:1.2.1:process (default) @ shared-parent ---
[INFO] 
[INFO] --- tools-maven-plugin:1.4:verify-legal-files (verify-legal-files) @ shared-parent
---
[INFO] 
[INFO] --- maven-install-plugin:2.3.1:install (default-install) @ shared-parent ---
[INFO] Installing <https://builds.apache.org/job/dir-shared-jdk16-win/ws/trunk\pom.xml>
to C:\Users\hudson\.m2\repository\org\apache\directory\shared\shared-parent\1.0.0-M9-SNAPSHOT\shared-parent-1.0.0-M9-SNAPSHOT.pom
[JENKINS] Archiving disabled - not archiving <https://builds.apache.org/job/dir-shared-jdk16-win/ws/trunk\pom.xml>
[INFO]                                                                         
[INFO] ------------------------------------------------------------------------
[INFO] Building Apache Directory Shared I18n 1.0.0-M9-SNAPSHOT
[INFO] ------------------------------------------------------------------------
[INFO] 
[INFO] --- maven-clean-plugin:2.4.1:clean (default-clean) @ shared-i18n ---
[INFO] Deleting F:\hudson\hudson-slave\workspace\dir-shared-jdk16-win\trunk\i18n\target
[INFO] 
[INFO] --- maven-remote-resources-plugin:1.2.1:process (default) @ shared-i18n ---
[INFO] 
[INFO] --- maven-resources-plugin:2.5:resources (default-resources) @ shared-i18n ---
[debug] execute contextualize
[INFO] Using 'UTF-8' encoding to copy filtered resources.
[INFO] Copying 2 resources
[INFO] Copying 3 resources
[INFO] 
[INFO] --- maven-compiler-plugin:2.3.2:compile (default-compile) @ shared-i18n ---
[INFO] Compiling 1 source file to F:\hudson\hudson-slave\workspace\dir-shared-jdk16-win\trunk\i18n\target\classes
[INFO] [debug] execute contextualize

[INFO] --- maven-resources-plugin:2.5:testResources (default-testResources) @ shared-i18n
---
[INFO] Using 'UTF-8' encoding to copy filtered resources.
[INFO] skip non existing resourceDirectory F:\hudson\hudson-slave\workspace\dir-shared-jdk16-win\trunk\i18n\src\test\resources
[INFO] Copying 3 resources
[INFO] 
[INFO] --- maven-compiler-plugin:2.3.2:testCompile (default-testCompile) @ shared-i18n ---
[INFO] No sources to compile
[INFO] 
[INFO] --- maven-surefire-plugin:2.10:test (default-test) @ shared-i18n ---
[INFO] Surefire report directory: F:\hudson\hudson-slave\workspace\dir-shared-jdk16-win\trunk\i18n\target\surefire-reports

-------------------------------------------------------
 T E S T S
-------------------------------------------------------

-------------------------------------------------------
 T E S T S
-------------------------------------------------------

Results :

Tests run: 0, Failures: 0, Errors: 0, Skipped: 0

[JENKINS] Recording test results
[INFO] 
[INFO] --- maven-bundle-plugin:2.3.4:bundle (default-bundle) @ shared-i18n ---
[INFO] [INFO] Checking legal files in: shared-i18n-1.0.0-M9-SNAPSHOT.jar

[INFO] --- tools-maven-plugin:1.4:verify-legal-files (verify-legal-files) @ shared-i18n ---
[INFO] 
[INFO] --- maven-install-plugin:2.3.1:install (default-install) @ shared-i18n ---
[INFO] Installing F:\hudson\hudson-slave\workspace\dir-shared-jdk16-win\trunk\i18n\target\shared-i18n-1.0.0-M9-SNAPSHOT.jar
to C:\Users\hudson\.m2\repository\org\apache\directory\shared\shared-i18n\1.0.0-M9-SNAPSHOT\shared-i18n-1.0.0-M9-SNAPSHOT.jar
[INFO] Installing F:\hudson\hudson-slave\workspace\dir-shared-jdk16-win\trunk\i18n\pom.xml
to C:\Users\hudson\.m2\repository\org\apache\directory\shared\shared-i18n\1.0.0-M9-SNAPSHOT\shared-i18n-1.0.0-M9-SNAPSHOT.pom
[INFO] 
[INFO] --- maven-bundle-plugin:2.3.4:install (default-install) @ shared-i18n ---
[WARNING] Exception while updating local OBR: Unable to read repository xml: file:/C:/Users/hudson/.m2/repository/repository.xml
org.apache.maven.plugin.MojoExecutionException: Unable to read repository xml: file:/C:/Users/hudson/.m2/repository/repository.xml
	at org.apache.felix.obrplugin.ObrUpdate.parseRepositoryXml(ObrUpdate.java:295)
	at org.apache.felix.obrplugin.ObrInstall.execute(ObrInstall.java:140)
	at org.apache.maven.plugin.DefaultBuildPluginManager.executeMojo(DefaultBuildPluginManager.java:107)
	at org.apache.maven.lifecycle.internal.MojoExecutor.execute(MojoExecutor.java:209)
	at org.apache.maven.lifecycle.internal.MojoExecutor.execute(MojoExecutor.java:153)
	at org.apache.maven.lifecycle.internal.MojoExecutor.execute(MojoExecutor.java:145)
	at org.apache.maven.lifecycle.internal.LifecycleModuleBuilder.buildProject(LifecycleModuleBuilder.java:84)
	at org.apache.maven.lifecycle.internal.LifecycleModuleBuilder.buildProject(LifecycleModuleBuilder.java:59)
	at org.apache.maven.lifecycle.internal.LifecycleStarter.singleThreadedBuild(LifecycleStarter.java:183)
	at org.apache.maven.lifecycle.internal.LifecycleStarter.execute(LifecycleStarter.java:161)
	at org.apache.maven.DefaultMaven.doExecute(DefaultMaven.java:319)
	at org.apache.maven.DefaultMaven.execute(DefaultMaven.java:156)
	at org.jvnet.hudson.maven3.launcher.Maven3Launcher.main(Maven3Launcher.java:79)
	at sun.reflect.NativeMethodAccessorImpl.invoke0(Native Method)
	at sun.reflect.NativeMethodAccessorImpl.invoke(NativeMethodAccessorImpl.java:39)
	at sun.reflect.DelegatingMethodAccessorImpl.invoke(DelegatingMethodAccessorImpl.java:25)
	at java.lang.reflect.Method.invoke(Method.java:597)
	at org.codehaus.plexus.classworlds.launcher.Launcher.launchStandard(Launcher.java:329)
	at org.codehaus.plexus.classworlds.launcher.Launcher.launch(Launcher.java:239)
	at org.jvnet.hudson.maven3.agent.Maven3Main.launch(Maven3Main.java:158)
	at hudson.maven.Maven3Builder.call(Maven3Builder.java:122)
	at hudson.maven.Maven3Builder.call(Maven3Builder.java:74)
	at hudson.remoting.UserRequest.perform(UserRequest.java:118)
	at hudson.remoting.UserRequest.perform(UserRequest.java:48)
	at hudson.remoting.Request$2.run(Request.java:287)
	at java.util.concurrent.Executors$RunnableAdapter.call(Executors.java:441)
	at java.util.concurrent.FutureTask$Sync.innerRun(FutureTask.java:303)
	at java.util.concurrent.FutureTask.run(FutureTask.java:138)
	at java.util.concurrent.ThreadPoolExecutor$Worker.runTask(ThreadPoolExecutor.java:886)
	at java.util.concurrent.ThreadPoolExecutor$Worker.run(ThreadPoolExecutor.java:908)
	at java.lang.Thread.run(Thread.java:662)
Caused by: org.xmlpull.v1.XmlPullParserException: unexpected type (position:END_DOCUMENT null@3:1
in java.io.InputStreamReader@4ad70ab0) 
	at org.kxml2.io.KXmlParser.exception(Unknown Source)
	at org.kxml2.io.KXmlParser.nextTag(Unknown Source)
	at org.apache.felix.bundlerepository.impl.PullParser.parseRepository(PullParser.java:43)
	at org.apache.felix.bundlerepository.impl.DataModelHelperImpl.repository(DataModelHelperImpl.java:147)
	at org.apache.felix.bundlerepository.impl.DataModelHelperImpl.repository(DataModelHelperImpl.java:118)
	at org.apache.felix.obrplugin.ObrUpdate.parseRepositoryXml(ObrUpdate.java:291)
	... 30 more
[JENKINS] Archiving disabled - not archiving F:\hudson\hudson-slave\workspace\dir-shared-jdk16-win\trunk\i18n\pom.xml
[JENKINS] Archiving disabled - not archiving F:\hudson\hudson-slave\workspace\dir-shared-jdk16-win\trunk\i18n\target\shared-i18n-1.0.0-M9-SNAPSHOT.jar
[INFO]                                                                         
[INFO] ------------------------------------------------------------------------
[INFO] Building Apache Directory Shared Utilities 1.0.0-M9-SNAPSHOT
[INFO] ------------------------------------------------------------------------
[INFO] [INFO] Deleting F:\hudson\hudson-slave\workspace\dir-shared-jdk16-win\trunk\util\target

[INFO] --- maven-clean-plugin:2.4.1:clean (default-clean) @ shared-util ---
[JENKINS] Archiving disabled - not archiving F:\hudson\hudson-slave\workspace\dir-shared-jdk16-win\trunk\util\pom.xml
[INFO] ------------------------------------------------------------------------
[INFO] Reactor Summary:
[INFO] 
[INFO] Apache Directory Shared ........................... SUCCESS [3.064s]
[INFO] Apache Directory Shared I18n ...................... SUCCESS [4.232s]
[INFO] Apache Directory Shared Utilities ................. FAILURE [0.490s]
[INFO] Apache Directory Shared ASN.1 Parent .............. SKIPPED
[INFO] Apache Directory Shared ASN.1 API ................. SKIPPED
[INFO] Apache Directory Shared ASN.1 BER ................. SKIPPED
[INFO] Apache Directory Shared LDAP Parent ............... SKIPPED
[INFO] Apache Directory Shared LDAP Model ................ SKIPPED
[INFO] Apache Directory Shared LDAP Codec Parent ......... SKIPPED
[INFO] Apache Directory Shared LDAP Codec ................ SKIPPED
[INFO] Apache Directory Shared LDAP Net Parent ........... SKIPPED
[INFO] Apache Directory Shared LDAP Network MINA ......... SKIPPED
[INFO] Apache Directory Shared LDAP Codec Standalone ..... SKIPPED
[INFO] Apache Directory Shared DSML Parent ............... SKIPPED
[INFO] Apache Directory Shared DSML Parser ............... SKIPPED
[INFO] Apache Directory Shared LDAP Extras ............... SKIPPED
[INFO] Apache Directory Shared LDAP Extras ACI ........... SKIPPED
[INFO] Apache Directory Shared LDAP Schema Parent ........ SKIPPED
[INFO] Apache Directory Shared LDAP Schema ............... SKIPPED
[INFO] Apache Directory Shared LDAP Client Parent ........ SKIPPED
[INFO] Apache Directory Shared LDAP Client API ........... SKIPPED
[INFO] Apache Directory Shared DSML Engine ............... SKIPPED
[INFO] Apache Directory Shared LDAP Extras Codec API ..... SKIPPED
[INFO] Apache Directory Shared LDAP Extras Codec ......... SKIPPED
[INFO] Apache Directory Shared LDAP Extras Util .......... SKIPPED
[INFO] Apache Directory Shared LDAP Extras Stored Procedures  SKIPPED
[INFO] Apache Directory Shared LDAP Extras Trigger ....... SKIPPED
[INFO] Apache Directory Shared LDAP Schema Converter ..... SKIPPED
[INFO] Apache Directory Shared All ....................... SKIPPED
[INFO] Apache Directory Shared LDAP Client All ........... SKIPPED
[INFO] Apache Directory Shared Integration Tests ......... SKIPPED
[INFO] Apache Directory LDAP API Distribution ............ SKIPPED
[INFO] ------------------------------------------------------------------------
[INFO] BUILD FAILURE
[INFO] ------------------------------------------------------------------------
[INFO] Total time: 10.616s
[INFO] Finished at: Sun Dec 11 03:01:41 GMT 2011
[INFO] Final Memory: 22M/145M
[INFO] ------------------------------------------------------------------------
mavenExecutionResult exceptions not empty
message : Failed to execute goal org.apache.maven.plugins:maven-clean-plugin:2.4.1:clean (default-clean)
on project shared-util: Failed to clean project: Failed to delete F:\hudson\hudson-slave\workspace\dir-shared-jdk16-win\trunk\util\target\shared-util-1.0.0-M9-SNAPSHOT.jar
cause : Failed to clean project: Failed to delete F:\hudson\hudson-slave\workspace\dir-shared-jdk16-win\trunk\util\target\shared-util-1.0.0-M9-SNAPSHOT.jar
Stack trace : 
org.apache.maven.lifecycle.LifecycleExecutionException: Failed to execute goal org.apache.maven.plugins:maven-clean-plugin:2.4.1:clean
(default-clean) on project shared-util: Failed to clean project: Failed to delete F:\hudson\hudson-slave\workspace\dir-shared-jdk16-win\trunk\util\target\shared-util-1.0.0-M9-SNAPSHOT.jar
	at org.apache.maven.lifecycle.internal.MojoExecutor.execute(MojoExecutor.java:217)
	at org.apache.maven.lifecycle.internal.MojoExecutor.execute(MojoExecutor.java:153)
	at org.apache.maven.lifecycle.internal.MojoExecutor.execute(MojoExecutor.java:145)
	at org.apache.maven.lifecycle.internal.LifecycleModuleBuilder.buildProject(LifecycleModuleBuilder.java:84)
	at org.apache.maven.lifecycle.internal.LifecycleModuleBuilder.buildProject(LifecycleModuleBuilder.java:59)
	at org.apache.maven.lifecycle.internal.LifecycleStarter.singleThreadedBuild(LifecycleStarter.java:183)
	at org.apache.maven.lifecycle.internal.LifecycleStarter.execute(LifecycleStarter.java:161)
	at org.apache.maven.DefaultMaven.doExecute(DefaultMaven.java:319)
	at org.apache.maven.DefaultMaven.execute(DefaultMaven.java:156)
	at org.jvnet.hudson.maven3.launcher.Maven3Launcher.main(Maven3Launcher.java:79)
	at sun.reflect.NativeMethodAccessorImpl.invoke0(Native Method)
	at sun.reflect.NativeMethodAccessorImpl.invoke(NativeMethodAccessorImpl.java:39)
	at sun.reflect.DelegatingMethodAccessorImpl.invoke(DelegatingMethodAccessorImpl.java:25)
	at java.lang.reflect.Method.invoke(Method.java:597)
	at org.codehaus.plexus.classworlds.launcher.Launcher.launchStandard(Launcher.java:329)
	at org.codehaus.plexus.classworlds.launcher.Launcher.launch(Launcher.java:239)
	at org.jvnet.hudson.maven3.agent.Maven3Main.launch(Maven3Main.java:158)
	at hudson.maven.Maven3Builder.call(Maven3Builder.java:122)
	at hudson.maven.Maven3Builder.call(Maven3Builder.java:74)
	at hudson.remoting.UserRequest.perform(UserRequest.java:118)
	at hudson.remoting.UserRequest.perform(UserRequest.java:48)
	at hudson.remoting.Request$2.run(Request.java:287)
	at java.util.concurrent.Executors$RunnableAdapter.call(Executors.java:441)
	at java.util.concurrent.FutureTask$Sync.innerRun(FutureTask.java:303)
	at java.util.concurrent.FutureTask.run(FutureTask.java:138)
	at java.util.concurrent.ThreadPoolExecutor$Worker.runTask(ThreadPoolExecutor.java:886)
	at java.util.concurrent.ThreadPoolExecutor$Worker.run(ThreadPoolExecutor.java:908)
	at java.lang.Thread.run(Thread.java:662)
Caused by: org.apache.maven.plugin.MojoExecutionException: Failed to clean project: Failed
to delete F:\hudson\hudson-slave\workspace\dir-shared-jdk16-win\trunk\util\target\shared-util-1.0.0-M9-SNAPSHOT.jar
	at org.apache.maven.plugin.clean.CleanMojo.execute(CleanMojo.java:188)
	at org.apache.maven.plugin.DefaultBuildPluginManager.executeMojo(DefaultBuildPluginManager.java:107)
	at org.apache.maven.lifecycle.internal.MojoExecutor.execute(MojoExecutor.java:209)
	... 27 more
Caused by: java.io.IOException: Failed to delete F:\hudson\hudson-slave\workspace\dir-shared-jdk16-win\trunk\util\target\shared-util-1.0.0-M9-SNAPSHOT.jar
	at org.apache.maven.plugin.clean.Cleaner.delete(Cleaner.java:227)
	at org.apache.maven.plugin.clean.Cleaner.delete(Cleaner.java:186)
	at org.apache.maven.plugin.clean.Cleaner.delete(Cleaner.java:154)
	at org.apache.maven.plugin.clean.Cleaner.delete(Cleaner.java:115)
	at org.apache.maven.plugin.clean.CleanMojo.execute(CleanMojo.java:168)
	... 29 more
Sending e-mails to: notifications@directory.apache.org
channel stopped


Mime
View raw message