directory-notifications mailing list archives

Site index · List index
Message view « Date » · « Thread »
Top « Date » · « Thread »
From Apache Jenkins Server <jenk...@builds.apache.org>
Subject Build failed in Jenkins: dir-shared-jdk15-ubuntu-deploy » Apache Directory Shared Integration Tests #500
Date Sat, 24 Dec 2011 03:18:09 GMT
See <https://builds.apache.org/job/dir-shared-jdk15-ubuntu-deploy/org.apache.directory.shared$shared-integ/500/>

------------------------------------------
[INFO]                                                                         
[INFO] ------------------------------------------------------------------------
[INFO] Building Apache Directory Shared Integration Tests 1.0.0-M9-SNAPSHOT
[INFO] ------------------------------------------------------------------------
[INFO] [INFO] Deleting <https://builds.apache.org/job/dir-shared-jdk15-ubuntu-deploy/org.apache.directory.shared$shared-integ/ws/target>

[INFO] --- maven-clean-plugin:2.4.1:clean (default-clean) @ shared-integ ---
[INFO] 
[INFO] --- maven-remote-resources-plugin:1.2.1:process (default) @ shared-integ ---
[debug] execute contextualize
[INFO] [INFO] Using 'UTF-8' encoding to copy filtered resources.
[INFO] skip non existing resourceDirectory <https://builds.apache.org/job/dir-shared-jdk15-ubuntu-deploy/org.apache.directory.shared$shared-integ/ws/src/main/resources>
[INFO] Copying 3 resources

[INFO] --- maven-resources-plugin:2.5:resources (default-resources) @ shared-integ ---
[INFO] [INFO] No sources to compile

[INFO] --- maven-compiler-plugin:2.3.2:compile (default-compile) @ shared-integ ---
[debug] execute contextualize
[INFO] [INFO] Using 'UTF-8' encoding to copy filtered resources.
[INFO] Copying 1 resource
[INFO] Copying 3 resources

[INFO] --- maven-resources-plugin:2.5:testResources (default-testResources) @ shared-integ
---
[INFO] 
[INFO] --- maven-dependency-plugin:2.3:copy (copy) @ shared-integ ---
[INFO] Configured Artifact: org.apache.directory.shared:shared-ldap-extras-codec:1.0.0-M9-SNAPSHOT:jar
[INFO] Copying shared-ldap-extras-codec-1.0.0-M9-SNAPSHOT.jar to <https://builds.apache.org/job/dir-shared-jdk15-ubuntu-deploy/org.apache.directory.shared$shared-integ/ws/target/pluginDirectory/shared-ldap-extras-codec-1.0.0-M9-SNAPSHOT.jar>
[INFO] 
[INFO] --- maven-compiler-plugin:2.3.2:testCompile (default-testCompile) @ shared-integ ---
[INFO] Compiling 21 source files to <https://builds.apache.org/job/dir-shared-jdk15-ubuntu-deploy/org.apache.directory.shared$shared-integ/ws/target/test-classes>
[INFO] -------------------------------------------------------------
[ERROR] COMPILATION ERROR : 
[INFO] -------------------------------------------------------------
[ERROR] <https://builds.apache.org/job/dir-shared-jdk15-ubuntu-deploy/org.apache.directory.shared$shared-integ/ws/src/test/java/org/apache/directory/shared/ldap/aci/ACIItemParserTest.java>:[51,19]
cannot find symbol
symbol  : class ACIItemParser
location: class org.apache.directory.shared.ldap.aci.ACIItemParserTest
[ERROR] <https://builds.apache.org/job/dir-shared-jdk15-ubuntu-deploy/org.apache.directory.shared$shared-integ/ws/src/test/java/org/apache/directory/shared/ldap/aci/ACIItemParserTest.java>:[68,49]
cannot find symbol
symbol  : class ACIItem
location: class org.apache.directory.shared.ldap.aci.ACIItemParserTest
[ERROR] <https://builds.apache.org/job/dir-shared-jdk15-ubuntu-deploy/org.apache.directory.shared$shared-integ/ws/src/test/java/org/apache/directory/shared/ldap/aci/ACIItemChekerTest.java>:[49,19]
cannot find symbol
symbol  : class ACIItemChecker
location: class org.apache.directory.shared.ldap.aci.ACIItemChekerTest
[ERROR] <https://builds.apache.org/job/dir-shared-jdk15-ubuntu-deploy/org.apache.directory.shared$shared-integ/ws/src/test/java/org/apache/directory/shared/ldap/schema/syntaxCheckers/ACIItemSyntaxCheckerTest.java>:[26,44]
cannot find symbol
symbol  : class ACIItemSyntaxChecker
location: package org.apache.directory.shared.ldap.aci
[ERROR] <https://builds.apache.org/job/dir-shared-jdk15-ubuntu-deploy/org.apache.directory.shared$shared-integ/ws/src/test/java/org/apache/directory/shared/ldap/schema/syntaxCheckers/ACIItemSyntaxCheckerTest.java>:[47,19]
cannot find symbol
symbol  : class ACIItemSyntaxChecker
location: class org.apache.directory.shared.ldap.schema.syntaxCheckers.ACIItemSyntaxCheckerTest
[ERROR] <https://builds.apache.org/job/dir-shared-jdk15-ubuntu-deploy/org.apache.directory.shared$shared-integ/ws/src/test/java/org/apache/directory/shared/ldap/aci/ACIItemParserTest.java>:[64,21]
cannot find symbol
symbol  : class ACIItemParser
location: class org.apache.directory.shared.ldap.aci.ACIItemParserTest
[ERROR] <https://builds.apache.org/job/dir-shared-jdk15-ubuntu-deploy/org.apache.directory.shared$shared-integ/ws/src/test/java/org/apache/directory/shared/ldap/aci/ACIItemParserTest.java>:[85,8]
cannot find symbol
symbol  : class ACIItem
location: class org.apache.directory.shared.ldap.aci.ACIItemParserTest
[ERROR] <https://builds.apache.org/job/dir-shared-jdk15-ubuntu-deploy/org.apache.directory.shared$shared-integ/ws/src/test/java/org/apache/directory/shared/ldap/aci/ACIItemParserTest.java>:[142,8]
cannot find symbol
symbol  : class ACIItem
location: class org.apache.directory.shared.ldap.aci.ACIItemParserTest
[ERROR] <https://builds.apache.org/job/dir-shared-jdk15-ubuntu-deploy/org.apache.directory.shared$shared-integ/ws/src/test/java/org/apache/directory/shared/ldap/aci/ACIItemParserTest.java>:[190,8]
cannot find symbol
symbol  : class ACIItem
location: class org.apache.directory.shared.ldap.aci.ACIItemParserTest
[ERROR] <https://builds.apache.org/job/dir-shared-jdk15-ubuntu-deploy/org.apache.directory.shared$shared-integ/ws/src/test/java/org/apache/directory/shared/ldap/aci/ACIItemParserTest.java>:[202,8]
cannot find symbol
symbol  : class ACIItem
location: class org.apache.directory.shared.ldap.aci.ACIItemParserTest
[ERROR] <https://builds.apache.org/job/dir-shared-jdk15-ubuntu-deploy/org.apache.directory.shared$shared-integ/ws/src/test/java/org/apache/directory/shared/ldap/aci/ACIItemParserTest.java>:[214,8]
cannot find symbol
symbol  : class ACIItem
location: class org.apache.directory.shared.ldap.aci.ACIItemParserTest
[ERROR] <https://builds.apache.org/job/dir-shared-jdk15-ubuntu-deploy/org.apache.directory.shared$shared-integ/ws/src/test/java/org/apache/directory/shared/ldap/aci/ACIItemParserTest.java>:[271,8]
cannot find symbol
symbol  : class ACIItem
location: class org.apache.directory.shared.ldap.aci.ACIItemParserTest
[ERROR] <https://builds.apache.org/job/dir-shared-jdk15-ubuntu-deploy/org.apache.directory.shared$shared-integ/ws/src/test/java/org/apache/directory/shared/ldap/aci/ACIItemParserTest.java>:[316,8]
cannot find symbol
symbol  : class ACIItem
location: class org.apache.directory.shared.ldap.aci.ACIItemParserTest
[ERROR] <https://builds.apache.org/job/dir-shared-jdk15-ubuntu-deploy/org.apache.directory.shared$shared-integ/ws/src/test/java/org/apache/directory/shared/ldap/aci/ACIItemParserTest.java>:[413,8]
cannot find symbol
symbol  : class ACIItem
location: class org.apache.directory.shared.ldap.aci.ACIItemParserTest
[ERROR] <https://builds.apache.org/job/dir-shared-jdk15-ubuntu-deploy/org.apache.directory.shared$shared-integ/ws/src/test/java/org/apache/directory/shared/ldap/aci/ACIItemParserTest.java>:[483,8]
cannot find symbol
symbol  : class ACIItem
location: class org.apache.directory.shared.ldap.aci.ACIItemParserTest
[ERROR] <https://builds.apache.org/job/dir-shared-jdk15-ubuntu-deploy/org.apache.directory.shared$shared-integ/ws/src/test/java/org/apache/directory/shared/ldap/aci/ACIItemParserTest.java>:[550,8]
cannot find symbol
symbol  : class ACIItem
location: class org.apache.directory.shared.ldap.aci.ACIItemParserTest
[ERROR] <https://builds.apache.org/job/dir-shared-jdk15-ubuntu-deploy/org.apache.directory.shared$shared-integ/ws/src/test/java/org/apache/directory/shared/ldap/aci/ACIItemParserTest.java>:[656,8]
cannot find symbol
symbol  : class ACIItem
location: class org.apache.directory.shared.ldap.aci.ACIItemParserTest
[ERROR] <https://builds.apache.org/job/dir-shared-jdk15-ubuntu-deploy/org.apache.directory.shared$shared-integ/ws/src/test/java/org/apache/directory/shared/ldap/aci/ACIItemParserTest.java>:[671,8]
cannot find symbol
symbol  : class ACIItem
location: class org.apache.directory.shared.ldap.aci.ACIItemParserTest
[ERROR] <https://builds.apache.org/job/dir-shared-jdk15-ubuntu-deploy/org.apache.directory.shared$shared-integ/ws/src/test/java/org/apache/directory/shared/ldap/aci/ACIItemParserTest.java>:[685,8]
cannot find symbol
symbol  : class ACIItem
location: class org.apache.directory.shared.ldap.aci.ACIItemParserTest
[ERROR] <https://builds.apache.org/job/dir-shared-jdk15-ubuntu-deploy/org.apache.directory.shared$shared-integ/ws/src/test/java/org/apache/directory/shared/ldap/aci/ACIItemParserTest.java>:[771,8]
cannot find symbol
symbol  : class ACIItem
location: class org.apache.directory.shared.ldap.aci.ACIItemParserTest
[ERROR] <https://builds.apache.org/job/dir-shared-jdk15-ubuntu-deploy/org.apache.directory.shared$shared-integ/ws/src/test/java/org/apache/directory/shared/ldap/aci/ACIItemParserTest.java>:[789,8]
cannot find symbol
symbol  : class ACIItem
location: class org.apache.directory.shared.ldap.aci.ACIItemParserTest
[ERROR] <https://builds.apache.org/job/dir-shared-jdk15-ubuntu-deploy/org.apache.directory.shared$shared-integ/ws/src/test/java/org/apache/directory/shared/ldap/aci/ACIItemParserTest.java>:[792,8]
cannot find symbol
symbol  : class UserFirstACIItem
location: class org.apache.directory.shared.ldap.aci.ACIItemParserTest
[ERROR] <https://builds.apache.org/job/dir-shared-jdk15-ubuntu-deploy/org.apache.directory.shared$shared-integ/ws/src/test/java/org/apache/directory/shared/ldap/aci/ACIItemParserTest.java>:[792,43]
cannot find symbol
symbol  : class UserFirstACIItem
location: class org.apache.directory.shared.ldap.aci.ACIItemParserTest
[ERROR] <https://builds.apache.org/job/dir-shared-jdk15-ubuntu-deploy/org.apache.directory.shared$shared-integ/ws/src/test/java/org/apache/directory/shared/ldap/aci/ACIItemParserTest.java>:[795,14]
cannot find symbol
symbol  : class UserPermission
location: class org.apache.directory.shared.ldap.aci.ACIItemParserTest
[ERROR] <https://builds.apache.org/job/dir-shared-jdk15-ubuntu-deploy/org.apache.directory.shared$shared-integ/ws/src/test/java/org/apache/directory/shared/ldap/aci/ACIItemChekerTest.java>:[62,22]
cannot find symbol
symbol  : class ACIItemChecker
location: class org.apache.directory.shared.ldap.aci.ACIItemChekerTest
[ERROR] <https://builds.apache.org/job/dir-shared-jdk15-ubuntu-deploy/org.apache.directory.shared$shared-integ/ws/src/test/java/org/apache/directory/shared/ldap/schema/syntaxCheckers/ACIItemSyntaxCheckerTest.java>:[55,58]
cannot find symbol
symbol  : class ACIItemSyntaxChecker
location: package org.apache.directory.shared.ldap.aci
[INFO] 26 errors 
[INFO] -------------------------------------------------------------
[JENKINS] Archiving <https://builds.apache.org/job/dir-shared-jdk15-ubuntu-deploy/org.apache.directory.shared$shared-integ/ws/pom.xml>
to /home/hudson/hudson/jobs/dir-shared-jdk15-ubuntu-deploy/modules/org.apache.directory.shared$shared-integ/builds/2011-12-24_03-05-37/archive/org.apache.directory.shared/shared-integ/1.0.0-M9-SNAPSHOT/shared-integ-1.0.0-M9-SNAPSHOT.pom


Mime
View raw message