directory-notifications mailing list archives

Site index · List index
Message view « Date » · « Thread »
Top « Date » · « Thread »
From Apache Jenkins Server <jenk...@builds.apache.org>
Subject Build failed in Jenkins: dir-studio-jdk16-ubuntu-deploy #455
Date Thu, 17 Nov 2011 04:16:34 GMT
See <https://builds.apache.org/job/dir-studio-jdk16-ubuntu-deploy/455/changes>

Changes:

[pamarcelot] Added javadoc.

[pamarcelot] Fixed a bug when an enty with all its children was deleted between the two partitions.

[pamarcelot] Bound remaining UI widgets to listeners for the Kerberos configuration page.

[pamarcelot] Bound UI widgets to listeners for TLS and Server-side password hashing.

------------------------------------------
[...truncated 12541 lines...]
Downloaded: http://repository.apache.org/snapshots/org/apache/directory/shared/shared-ldap-parent/1.0.0-M9-SNAPSHOT/maven-metadata.xml
(630 B at 4.7 KB/sec)
Downloading: file://<https://builds.apache.org/job/dir-studio-jdk16-ubuntu-deploy/ws/trunk/plugins/apacheds.configuration.v2/org/apache/directory/shared/shared-parent/1.0.0-M9-SNAPSHOT/maven-metadata.xml>
Downloading: http://repository.apache.org/snapshots/org/apache/directory/shared/shared-parent/1.0.0-M9-SNAPSHOT/maven-metadata.xml
Downloaded: http://repository.apache.org/snapshots/org/apache/directory/shared/shared-parent/1.0.0-M9-SNAPSHOT/maven-metadata.xml
(625 B at 6.4 KB/sec)
Downloading: file://<https://builds.apache.org/job/dir-studio-jdk16-ubuntu-deploy/ws/trunk/plugins/apacheds.configuration.v2/org/apache/directory/shared/shared-util/1.0.0-M9-SNAPSHOT/maven-metadata.xml>
Downloading: http://repository.apache.org/snapshots/org/apache/directory/shared/shared-util/1.0.0-M9-SNAPSHOT/maven-metadata.xml
Downloaded: http://repository.apache.org/snapshots/org/apache/directory/shared/shared-util/1.0.0-M9-SNAPSHOT/maven-metadata.xml
(1018 B at 9.6 KB/sec)
Downloading: file://<https://builds.apache.org/job/dir-studio-jdk16-ubuntu-deploy/ws/trunk/plugins/apacheds.configuration.v2/org/apache/directory/shared/shared-i18n/1.0.0-M9-SNAPSHOT/maven-metadata.xml>
Downloading: http://repository.apache.org/snapshots/org/apache/directory/shared/shared-i18n/1.0.0-M9-SNAPSHOT/maven-metadata.xml
Downloaded: http://repository.apache.org/snapshots/org/apache/directory/shared/shared-i18n/1.0.0-M9-SNAPSHOT/maven-metadata.xml
(1018 B at 9.7 KB/sec)
Downloading: file://<https://builds.apache.org/job/dir-studio-jdk16-ubuntu-deploy/ws/trunk/plugins/apacheds.configuration.v2/org/apache/directory/shared/shared-asn1-api/1.0.0-M9-SNAPSHOT/maven-metadata.xml>
Downloading: http://repository.apache.org/snapshots/org/apache/directory/shared/shared-asn1-api/1.0.0-M9-SNAPSHOT/maven-metadata.xml
Downloaded: http://repository.apache.org/snapshots/org/apache/directory/shared/shared-asn1-api/1.0.0-M9-SNAPSHOT/maven-metadata.xml
(1022 B at 4.3 KB/sec)
Downloading: file://<https://builds.apache.org/job/dir-studio-jdk16-ubuntu-deploy/ws/trunk/plugins/apacheds.configuration.v2/org/apache/directory/shared/shared-asn1-parent/1.0.0-M9-SNAPSHOT/maven-metadata.xml>
Downloading: http://repository.apache.org/snapshots/org/apache/directory/shared/shared-asn1-parent/1.0.0-M9-SNAPSHOT/maven-metadata.xml
Downloaded: http://repository.apache.org/snapshots/org/apache/directory/shared/shared-asn1-parent/1.0.0-M9-SNAPSHOT/maven-metadata.xml
(630 B at 6.1 KB/sec)
Downloading: file://<https://builds.apache.org/job/dir-studio-jdk16-ubuntu-deploy/ws/trunk/plugins/apacheds.configuration.v2/org/apache/directory/shared/shared-asn1-ber/1.0.0-M9-SNAPSHOT/maven-metadata.xml>
Downloading: http://repository.apache.org/snapshots/org/apache/directory/shared/shared-asn1-ber/1.0.0-M9-SNAPSHOT/maven-metadata.xml
Downloaded: http://repository.apache.org/snapshots/org/apache/directory/shared/shared-asn1-ber/1.0.0-M9-SNAPSHOT/maven-metadata.xml
(1022 B at 10.0 KB/sec)
Downloading: file://<https://builds.apache.org/job/dir-studio-jdk16-ubuntu-deploy/ws/trunk/plugins/apacheds.configuration.v2/org/apache/directory/shared/shared-ldap-schema-parent/1.0.0-M9-SNAPSHOT/maven-metadata.xml>
Downloading: http://repository.apache.org/snapshots/org/apache/directory/shared/shared-ldap-schema-parent/1.0.0-M9-SNAPSHOT/maven-metadata.xml
Downloaded: http://repository.apache.org/snapshots/org/apache/directory/shared/shared-ldap-schema-parent/1.0.0-M9-SNAPSHOT/maven-metadata.xml
(637 B at 7.8 KB/sec)
Downloading: file://<https://builds.apache.org/job/dir-studio-jdk16-ubuntu-deploy/ws/trunk/plugins/apacheds.configuration.v2/org/apache/directory/shared/shared-ldap-extras-aci/1.0.0-M9-SNAPSHOT/maven-metadata.xml>
Downloading: http://repository.apache.org/snapshots/org/apache/directory/shared/shared-ldap-extras-aci/1.0.0-M9-SNAPSHOT/maven-metadata.xml
Downloaded: http://repository.apache.org/snapshots/org/apache/directory/shared/shared-ldap-extras-aci/1.0.0-M9-SNAPSHOT/maven-metadata.xml
(2 KB at 11.8 KB/sec)
Downloading: file://<https://builds.apache.org/job/dir-studio-jdk16-ubuntu-deploy/ws/trunk/plugins/apacheds.configuration.v2/org/apache/directory/shared/shared-ldap-extras-parent/1.0.0-M9-SNAPSHOT/maven-metadata.xml>
Downloading: http://repository.apache.org/snapshots/org/apache/directory/shared/shared-ldap-extras-parent/1.0.0-M9-SNAPSHOT/maven-metadata.xml
Downloaded: http://repository.apache.org/snapshots/org/apache/directory/shared/shared-ldap-extras-parent/1.0.0-M9-SNAPSHOT/maven-metadata.xml
(637 B at 7.4 KB/sec)
Downloading: file://<https://builds.apache.org/job/dir-studio-jdk16-ubuntu-deploy/ws/trunk/plugins/apacheds.configuration.v2/org/apache/directory/shared/shared-ldap-model/1.0.0-M9-SNAPSHOT/maven-metadata.xml>
Downloading: http://repository.apache.org/snapshots/org/apache/directory/shared/shared-ldap-model/1.0.0-M9-SNAPSHOT/maven-metadata.xml
Downloaded: http://repository.apache.org/snapshots/org/apache/directory/shared/shared-ldap-model/1.0.0-M9-SNAPSHOT/maven-metadata.xml
(1 KB at 12.3 KB/sec)
Downloading: file://<https://builds.apache.org/job/dir-studio-jdk16-ubuntu-deploy/ws/trunk/plugins/apacheds.configuration.v2/org/apache/directory/server/apacheds-core-api/2.0.0-M4-SNAPSHOT/maven-metadata.xml>
Downloading: http://repository.apache.org/snapshots/org/apache/directory/server/apacheds-core-api/2.0.0-M4-SNAPSHOT/maven-metadata.xml
Downloaded: http://repository.apache.org/snapshots/org/apache/directory/server/apacheds-core-api/2.0.0-M4-SNAPSHOT/maven-metadata.xml
(2 KB at 13.8 KB/sec)
Downloading: file://<https://builds.apache.org/job/dir-studio-jdk16-ubuntu-deploy/ws/trunk/plugins/apacheds.configuration.v2/org/apache/directory/server/apacheds-parent/2.0.0-M4-SNAPSHOT/maven-metadata.xml>
Downloading: http://repository.apache.org/snapshots/org/apache/directory/server/apacheds-parent/2.0.0-M4-SNAPSHOT/maven-metadata.xml
Downloaded: http://repository.apache.org/snapshots/org/apache/directory/server/apacheds-parent/2.0.0-M4-SNAPSHOT/maven-metadata.xml
(842 B at 8.8 KB/sec)
Downloading: file://<https://builds.apache.org/job/dir-studio-jdk16-ubuntu-deploy/ws/trunk/plugins/apacheds.configuration.v2/org/apache/directory/server/apacheds-server-config/2.0.0-M4-SNAPSHOT/maven-metadata.xml>
Downloading: http://repository.apache.org/snapshots/org/apache/directory/server/apacheds-server-config/2.0.0-M4-SNAPSHOT/maven-metadata.xml
Downloaded: http://repository.apache.org/snapshots/org/apache/directory/server/apacheds-server-config/2.0.0-M4-SNAPSHOT/maven-metadata.xml
(811 B at 7.5 KB/sec)
Downloading: http://repository.apache.org/snapshots/org/apache/directory/server/apacheds-server-config/2.0.0-M4-SNAPSHOT/apacheds-server-config-2.0.0-M4-20111117.041509-67.pom
Downloaded: http://repository.apache.org/snapshots/org/apache/directory/server/apacheds-server-config/2.0.0-M4-SNAPSHOT/apacheds-server-config-2.0.0-M4-20111117.041509-67.pom
(4 KB at 41.6 KB/sec)
Downloading: file://<https://builds.apache.org/job/dir-studio-jdk16-ubuntu-deploy/ws/trunk/plugins/apacheds.configuration.v2/org/apache/directory/server/apacheds-ldif-partition/2.0.0-M4-SNAPSHOT/maven-metadata.xml>
Downloading: http://repository.apache.org/snapshots/org/apache/directory/server/apacheds-ldif-partition/2.0.0-M4-SNAPSHOT/maven-metadata.xml
Downloaded: http://repository.apache.org/snapshots/org/apache/directory/server/apacheds-ldif-partition/2.0.0-M4-SNAPSHOT/maven-metadata.xml
(2 KB at 10.1 KB/sec)
Downloading: http://repository.apache.org/snapshots/org/apache/directory/server/apacheds-xdbm-partition/2.0.0-M4-SNAPSHOT/maven-metadata.xml
Downloading: file://<https://builds.apache.org/job/dir-studio-jdk16-ubuntu-deploy/ws/trunk/plugins/apacheds.configuration.v2/org/apache/directory/server/apacheds-xdbm-partition/2.0.0-M4-SNAPSHOT/maven-metadata.xml>
Downloaded: http://repository.apache.org/snapshots/org/apache/directory/server/apacheds-xdbm-partition/2.0.0-M4-SNAPSHOT/maven-metadata.xml
(2 KB at 9.3 KB/sec)
[debug] execute contextualize
[INFO] [INFO] Using 'UTF-8' encoding to copy filtered resources.
[INFO] Copying 2 resources
[INFO] Copying 7 resources to resources

[INFO] --- maven-resources-plugin:2.5:resources (default-resources) @ apacheds.configuration.v2
---
[INFO] Copying 1 resource
[INFO] Copying 6 resources
[INFO] Copying 3 resources
Downloading: http://repository.apache.org/snapshots/org/apache/directory/studio/ldifeditor/2.0.0-SNAPSHOT/maven-metadata.xml
Downloading: file://<https://builds.apache.org/job/dir-studio-jdk16-ubuntu-deploy/ws/trunk/plugins/ldapbrowser.ui/org/apache/directory/studio/ldifeditor/2.0.0-SNAPSHOT/maven-metadata.xml>
Downloaded: http://repository.apache.org/snapshots/org/apache/directory/studio/ldifeditor/2.0.0-SNAPSHOT/maven-metadata.xml
(793 B at 9.0 KB/sec)
Downloading: file://<https://builds.apache.org/job/dir-studio-jdk16-ubuntu-deploy/ws/trunk/plugins/ldapservers.apacheds.v153/org/apache/directory/studio/ldapservers/2.0.0-SNAPSHOT/maven-metadata.xml>
Downloading: http://repository.apache.org/snapshots/org/apache/directory/studio/ldapservers/2.0.0-SNAPSHOT/maven-metadata.xml
Downloaded: http://repository.apache.org/snapshots/org/apache/directory/studio/ldapservers/2.0.0-SNAPSHOT/maven-metadata.xml
(794 B at 9.3 KB/sec)
Downloading: file://<https://builds.apache.org/job/dir-studio-jdk16-ubuntu-deploy/ws/trunk/plugins/ldapservers.apacheds.v154/org/apache/directory/studio/ldapservers/2.0.0-SNAPSHOT/maven-metadata.xml>
Downloading: http://repository.apache.org/snapshots/org/apache/directory/studio/ldapservers/2.0.0-SNAPSHOT/maven-metadata.xml
Downloaded: http://repository.apache.org/snapshots/org/apache/directory/studio/ldapservers/2.0.0-SNAPSHOT/maven-metadata.xml
(794 B at 8.5 KB/sec)
Downloading: http://repository.apache.org/snapshots/org/apache/directory/studio/ldapservers/2.0.0-SNAPSHOT/maven-metadata.xml
Downloading: file://<https://builds.apache.org/job/dir-studio-jdk16-ubuntu-deploy/ws/trunk/plugins/ldapservers.apacheds.v155/org/apache/directory/studio/ldapservers/2.0.0-SNAPSHOT/maven-metadata.xml>
Downloaded: http://repository.apache.org/snapshots/org/apache/directory/studio/ldapservers/2.0.0-SNAPSHOT/maven-metadata.xml
(794 B at 8.5 KB/sec)
Downloading: file://<https://builds.apache.org/job/dir-studio-jdk16-ubuntu-deploy/ws/trunk/plugins/ldapservers.apacheds.v156/org/apache/directory/studio/ldapservers/2.0.0-SNAPSHOT/maven-metadata.xml>
Downloading: http://repository.apache.org/snapshots/org/apache/directory/studio/ldapservers/2.0.0-SNAPSHOT/maven-metadata.xml
Downloaded: http://repository.apache.org/snapshots/org/apache/directory/studio/ldapservers/2.0.0-SNAPSHOT/maven-metadata.xml
(794 B at 7.3 KB/sec)
Downloading: file://<https://builds.apache.org/job/dir-studio-jdk16-ubuntu-deploy/ws/trunk/plugins/ldapservers.apacheds.v157/org/apache/directory/studio/ldapservers/2.0.0-SNAPSHOT/maven-metadata.xml>
Downloading: http://repository.apache.org/snapshots/org/apache/directory/studio/ldapservers/2.0.0-SNAPSHOT/maven-metadata.xml
Downloaded: http://repository.apache.org/snapshots/org/apache/directory/studio/ldapservers/2.0.0-SNAPSHOT/maven-metadata.xml
(794 B at 8.4 KB/sec)
Downloading: http://repository.apache.org/snapshots/org/apache/directory/studio/apacheds.configuration.v2/2.0.0-SNAPSHOT/maven-metadata.xml
Downloading: file://<https://builds.apache.org/job/dir-studio-jdk16-ubuntu-deploy/ws/trunk/plugins/ldapservers.apacheds.v200/org/apache/directory/studio/apacheds.configuration.v2/2.0.0-SNAPSHOT/maven-metadata.xml>
Downloaded: http://repository.apache.org/snapshots/org/apache/directory/studio/apacheds.configuration.v2/2.0.0-SNAPSHOT/maven-metadata.xml
(808 B at 7.9 KB/sec)
Downloading: http://repository.apache.org/snapshots/org/apache/directory/studio/ldapservers/2.0.0-SNAPSHOT/maven-metadata.xml
Downloading: file://<https://builds.apache.org/job/dir-studio-jdk16-ubuntu-deploy/ws/trunk/plugins/ldapservers.apacheds.v200/org/apache/directory/studio/ldapservers/2.0.0-SNAPSHOT/maven-metadata.xml>
Downloaded: http://repository.apache.org/snapshots/org/apache/directory/studio/ldapservers/2.0.0-SNAPSHOT/maven-metadata.xml
(794 B at 7.7 KB/sec)
[INFO] 
[INFO] --- studio-maven-plugin:1.0.4:prepare-jar-package (default) @ apacheds.configuration.v2
---
[INFO] [INFO] Compiling 31 source files to <https://builds.apache.org/job/dir-studio-jdk16-ubuntu-deploy/ws/trunk/plugins/apacheds.configuration.v2/target/classes>

[INFO] --- maven-compiler-plugin:2.3.2:compile (default-compile) @ apacheds.configuration.v2
---
[INFO] -------------------------------------------------------------
[ERROR] COMPILATION ERROR : 
[INFO] -------------------------------------------------------------
[ERROR] <https://builds.apache.org/job/dir-studio-jdk16-ubuntu-deploy/ws/trunk/plugins/apacheds.configuration.v2/src/main/java/org/apache/directory/studio/apacheds/configuration/v2/editor/LdapLdapsServersPage.java>:[1157,40]
cannot find symbol
symbol  : method setInterceptorClassName(java.lang.String)
location: class org.apache.directory.server.config.beans.InterceptorBean
[ERROR] <https://builds.apache.org/job/dir-studio-jdk16-ubuntu-deploy/ws/trunk/plugins/apacheds.configuration.v2/src/main/java/org/apache/directory/studio/apacheds/configuration/v2/editor/LdapLdapsServersPage.java>:[1161,40]
cannot find symbol
symbol  : method setInterceptorClassName(java.lang.String)
location: class org.apache.directory.server.config.beans.InterceptorBean
[ERROR] <https://builds.apache.org/job/dir-studio-jdk16-ubuntu-deploy/ws/trunk/plugins/apacheds.configuration.v2/src/main/java/org/apache/directory/studio/apacheds/configuration/v2/editor/LdapLdapsServersPage.java>:[1164,40]
cannot find symbol
symbol  : method setInterceptorClassName(java.lang.String)
location: class org.apache.directory.server.config.beans.InterceptorBean
[ERROR] <https://builds.apache.org/job/dir-studio-jdk16-ubuntu-deploy/ws/trunk/plugins/apacheds.configuration.v2/src/main/java/org/apache/directory/studio/apacheds/configuration/v2/editor/LdapLdapsServersPage.java>:[1167,40]
cannot find symbol
symbol  : method setInterceptorClassName(java.lang.String)
location: class org.apache.directory.server.config.beans.InterceptorBean
[ERROR] <https://builds.apache.org/job/dir-studio-jdk16-ubuntu-deploy/ws/trunk/plugins/apacheds.configuration.v2/src/main/java/org/apache/directory/studio/apacheds/configuration/v2/editor/LdapLdapsServersPage.java>:[1170,40]
cannot find symbol
symbol  : method setInterceptorClassName(java.lang.String)
location: class org.apache.directory.server.config.beans.InterceptorBean
[ERROR] <https://builds.apache.org/job/dir-studio-jdk16-ubuntu-deploy/ws/trunk/plugins/apacheds.configuration.v2/src/main/java/org/apache/directory/studio/apacheds/configuration/v2/editor/LdapLdapsServersPage.java>:[1173,40]
cannot find symbol
symbol  : method setInterceptorClassName(java.lang.String)
location: class org.apache.directory.server.config.beans.InterceptorBean
[ERROR] <https://builds.apache.org/job/dir-studio-jdk16-ubuntu-deploy/ws/trunk/plugins/apacheds.configuration.v2/src/main/java/org/apache/directory/studio/apacheds/configuration/v2/editor/LdapLdapsServersPage.java>:[1176,40]
cannot find symbol
symbol  : method setInterceptorClassName(java.lang.String)
location: class org.apache.directory.server.config.beans.InterceptorBean
[ERROR] <https://builds.apache.org/job/dir-studio-jdk16-ubuntu-deploy/ws/trunk/plugins/apacheds.configuration.v2/src/main/java/org/apache/directory/studio/apacheds/configuration/v2/editor/LdapLdapsServersPage.java>:[1179,40]
cannot find symbol
symbol  : method setInterceptorClassName(java.lang.String)
location: class org.apache.directory.server.config.beans.InterceptorBean
[ERROR] <https://builds.apache.org/job/dir-studio-jdk16-ubuntu-deploy/ws/trunk/plugins/apacheds.configuration.v2/src/main/java/org/apache/directory/studio/apacheds/configuration/v2/editor/LdapLdapsServersPage.java>:[1182,40]
cannot find symbol
symbol  : method setInterceptorClassName(java.lang.String)
location: class org.apache.directory.server.config.beans.InterceptorBean
[ERROR] <https://builds.apache.org/job/dir-studio-jdk16-ubuntu-deploy/ws/trunk/plugins/apacheds.configuration.v2/src/main/java/org/apache/directory/studio/apacheds/configuration/v2/editor/LdapLdapsServersPage.java>:[1185,40]
cannot find symbol
symbol  : method setInterceptorClassName(java.lang.String)
location: class org.apache.directory.server.config.beans.InterceptorBean
[ERROR] <https://builds.apache.org/job/dir-studio-jdk16-ubuntu-deploy/ws/trunk/plugins/apacheds.configuration.v2/src/main/java/org/apache/directory/studio/apacheds/configuration/v2/editor/LdapLdapsServersPage.java>:[1188,40]
cannot find symbol
symbol  : method setInterceptorClassName(java.lang.String)
location: class org.apache.directory.server.config.beans.InterceptorBean
[INFO] 11 errors 
[INFO] -------------------------------------------------------------
[JENKINS] Archiving <https://builds.apache.org/job/dir-studio-jdk16-ubuntu-deploy/ws/trunk/plugins/apacheds.configuration.v2/pom.xml>
to /home/hudson/hudson/jobs/dir-studio-jdk16-ubuntu-deploy/modules/org.apache.directory.studio$apacheds.configuration.v2/builds/2011-11-17_04-00-55/archive/org.apache.directory.studio/apacheds.configuration.v2/2.0.0-SNAPSHOT/apacheds.configuration.v2-2.0.0-SNAPSHOT.pom
[INFO] ------------------------------------------------------------------------
[INFO] Reactor Summary:
[INFO] 
[INFO] Apache Directory Studio ........................... SUCCESS [12.427s]
[INFO] Apache Directory Studio Repository ................ SUCCESS [8.604s]
[INFO] Apache Directory Studio Libraries Plugins ......... SUCCESS [0.796s]
[INFO] SLF4J API Module (for Apache Directory Studio) .... SUCCESS [2:07.361s]
[INFO] Ehcache Core (for Apache Directory Studio) ........ SUCCESS [12.740s]
[INFO] AntLR Parser Generator (for Apache Directory Studio)  SUCCESS [12.840s]
[INFO] Apache Commons Codec (for Apache Directory Studio)  SUCCESS [13.240s]
[INFO] Apache Commons Collections (for Apache Directory Studio)  SUCCESS [12.748s]
[INFO] Apache Commons IO (for Apache Directory Studio) ... SUCCESS [14.351s]
[INFO] Apache Commons Lang (for Apache Directory Studio) . SUCCESS [12.271s]
[INFO] Apache Commons Logging (for Apache Directory Studio)  SUCCESS [12.759s]
[INFO] Apache Commons Pool (for Apache Directory Studio) . SUCCESS [14.071s]
[INFO] ApacheDS Core Constants (for Apache Directory Studio)  SUCCESS [13.194s]
[INFO] ApacheDS I18n (for Apache Directory Studio) ....... SUCCESS [13.125s]
[INFO] ApacheDS Core API (for Apache Directory Studio) ... SUCCESS [16.119s]
[INFO] ApacheDS Core AVL (for Apache Directory Studio) ... SUCCESS [13.511s]
[INFO] ApacheDS Generalized (X) DBM Partition (for Apache Directory Studio)  SUCCESS [15.545s]
[INFO] ApacheDS Server Config (for Apache Directory Studio)  SUCCESS [13.048s]
[INFO] Legion of the Bouncy Castle Java Cryptography APIs (for Apache Directory Studio)  SUCCESS
[11.905s]
[INFO] ApacheDS Core (for Apache Directory Studio) ....... SUCCESS [17.611s]
[INFO] ApacheDS LDIF Partition (for Apache Directory Studio)  SUCCESS [15.862s]
[INFO] Apache HttpComponents Core (for Apache Directory Studio)  SUCCESS [12.507s]
[INFO] Apache HttpComponents Client (for Apache Directory Studio)  SUCCESS [10.748s]
[INFO] Log4j (for Apache Directory Studio) ............... SUCCESS [10.993s]
[INFO] Apache MINA Core (for Apache Directory Studio) .... SUCCESS [12.170s]
[INFO] dom4j (for Apache Directory Studio) ............... SUCCESS [10.330s]
[INFO] SLF4J LOG4J-12 Binding (for Apache Directory Studio)  SUCCESS [10.497s]
[INFO] XPP3 (for Apache Directory Studio) ................ SUCCESS [11.998s]
[INFO] Apache Directory Studio Plugins ................... SUCCESS [5.438s]
[INFO] Apache Directory Studio Common UI ................. SUCCESS [14.497s]
[INFO] Apache Directory Studio Common Core ............... SUCCESS [24.611s]
[INFO] Apache Directory Studio LDIF Parser ............... SUCCESS [41.419s]
[INFO] Apache Directory Studio Connection Core ........... SUCCESS [17.118s]
[INFO] Apache Directory Studio Connection UI ............. SUCCESS [11.714s]
[INFO] Apache Directory Studio LDAP Browser Core ......... SUCCESS [18.223s]
[INFO] Apache Directory Studio LDAP Browser Common ....... SUCCESS [13.833s]
[INFO] Apache Directory Studio Value Editors ............. SUCCESS [8.254s]
[INFO] Apache Directory Studio ACI Item Editor ........... SUCCESS [10.469s]
[INFO] Apache Directory Studio ApacheDS Configuration .... SUCCESS [14.057s]
[INFO] Apache Directory Studio ApacheDS .................. SUCCESS [25.693s]
[INFO] Apache Directory Studio ApacheDS Launcher ......... SUCCESS [4.925s]
[INFO] Apache Directory Studio ApacheDS 2.0 Configuration  FAILURE [5.390s]
[INFO] Apache Directory Studio LDIF Editor ............... SKIPPED
[INFO] Apache Directory Studio LDAP Browser UI ........... SKIPPED
[INFO] Apache Directory Studio LDAP Servers .............. SKIPPED
[INFO] Apache Directory Studio ApacheDS 1.5.3 LDAP Server Adapter  SKIPPED
[INFO] Apache Directory Studio ApacheDS 1.5.4 LDAP Server Adapter  SKIPPED
[INFO] Apache Directory Studio ApacheDS 1.5.5 LDAP Server Adapter  SKIPPED
[INFO] Apache Directory Studio ApacheDS 1.5.6 LDAP Server Adapter  SKIPPED
[INFO] Apache Directory Studio ApacheDS 1.5.7 LDAP Server Adapter  SKIPPED
[INFO] Apache Directory Studio ApacheDS 2.0.0 LDAP Server Adapter  SKIPPED
[INFO] Apache Directory Studio RCP ....................... SKIPPED
[INFO] Apache Directory Studio Schema Editor ............. SKIPPED
[INFO] Apache Directory Studio Apache DS Help ............ SKIPPED
[INFO] Apache Directory Studio Apache DS Configuration Help  SKIPPED
[INFO] Apache Directory Studio LDAP Browser Help ......... SKIPPED
[INFO] Apache Directory Studio LDIF Editor Help .......... SKIPPED
[INFO] Apache Directory Studio RCP Help .................. SKIPPED
[INFO] Apache Directory Studio Schema Editor Help ........ SKIPPED
[INFO] Apache Directory Studio Help Plugins .............. SKIPPED
[INFO] Apache Directory Studio Feature Plugins ........... SKIPPED
[INFO] Apache Directory Studio Apache DS Configuration Feature  SKIPPED
[INFO] Apache Directory Studio Apache DS Feature ......... SKIPPED
[INFO] Apache Directory Studio LDAP Browser Feature ...... SKIPPED
[INFO] Apache Directory Studio LDAP Servers Feature ...... SKIPPED
[INFO] Apache Directory Studio LDIF Editor Feature ....... SKIPPED
[INFO] Apache Directory Studio RCP Feature ............... SKIPPED
[INFO] Apache Directory Studio Schema Editor Feature ..... SKIPPED
[INFO] Apache Directory Studio Application ............... SKIPPED
[INFO] Apache Directory Studio Application Plugins ....... SKIPPED
[INFO] Apache Directory Studio Application Features ...... SKIPPED
[INFO] Apache Directory Studio Application Eclipse Plugins  SKIPPED
[INFO] ------------------------------------------------------------------------
[INFO] BUILD FAILURE
[INFO] ------------------------------------------------------------------------
[INFO] Total time: 15:26.593s
[INFO] Finished at: Thu Nov 17 04:16:31 UTC 2011
[WARNING] The requested profile "studio-full" could not be activated because it does not exist.
[INFO] Final Memory: 146M/395M
[INFO] ------------------------------------------------------------------------
mavenExecutionResult exceptions not empty
message : Failed to execute goal org.apache.maven.plugins:maven-compiler-plugin:2.3.2:compile
(default-compile) on project apacheds.configuration.v2: Compilation failure
cause : Compilation failure
Stack trace : 
org.apache.maven.lifecycle.LifecycleExecutionException: Failed to execute goal org.apache.maven.plugins:maven-compiler-plugin:2.3.2:compile
(default-compile) on project apacheds.configuration.v2: Compilation failure
	at org.apache.maven.lifecycle.internal.MojoExecutor.execute(MojoExecutor.java:213)
	at org.apache.maven.lifecycle.internal.MojoExecutor.execute(MojoExecutor.java:153)
	at org.apache.maven.lifecycle.internal.MojoExecutor.execute(MojoExecutor.java:145)
	at org.apache.maven.lifecycle.internal.LifecycleModuleBuilder.buildProject(LifecycleModuleBuilder.java:84)
	at org.apache.maven.lifecycle.internal.LifecycleModuleBuilder.buildProject(LifecycleModuleBuilder.java:59)
	at org.apache.maven.lifecycle.internal.LifecycleStarter.singleThreadedBuild(LifecycleStarter.java:183)
	at org.apache.maven.lifecycle.internal.LifecycleStarter.execute(LifecycleStarter.java:161)
	at org.apache.maven.DefaultMaven.doExecute(DefaultMaven.java:319)
	at org.apache.maven.DefaultMaven.execute(DefaultMaven.java:156)
	at org.jvnet.hudson.maven3.launcher.Maven3Launcher.main(Maven3Launcher.java:79)
	at sun.reflect.NativeMethodAccessorImpl.invoke0(Native Method)
	at sun.reflect.NativeMethodAccessorImpl.invoke(NativeMethodAccessorImpl.java:39)
	at sun.reflect.DelegatingMethodAccessorImpl.invoke(DelegatingMethodAccessorImpl.java:25)
	at java.lang.reflect.Method.invoke(Method.java:597)
	at org.codehaus.plexus.classworlds.launcher.Launcher.launchStandard(Launcher.java:329)
	at org.codehaus.plexus.classworlds.launcher.Launcher.launch(Launcher.java:239)
	at org.jvnet.hudson.maven3.agent.Maven3Main.launch(Maven3Main.java:158)
	at hudson.maven.Maven3Builder.call(Maven3Builder.java:122)
	at hudson.maven.Maven3Builder.call(Maven3Builder.java:74)
	at hudson.remoting.UserRequest.perform(UserRequest.java:118)
	at hudson.remoting.UserRequest.perform(UserRequest.java:48)
	at hudson.remoting.Request$2.run(Request.java:287)
	at java.util.concurrent.Executors$RunnableAdapter.call(Executors.java:441)
	at java.util.concurrent.FutureTask$Sync.innerRun(FutureTask.java:303)
	at java.util.concurrent.FutureTask.run(FutureTask.java:138)
	at java.util.concurrent.ThreadPoolExecutor$Worker.runTask(ThreadPoolExecutor.java:886)
	at java.util.concurrent.ThreadPoolExecutor$Worker.run(ThreadPoolExecutor.java:908)
	at java.lang.Thread.run(Thread.java:662)
Caused by: org.apache.maven.plugin.CompilationFailureException: Compilation failure
	at org.apache.maven.plugin.AbstractCompilerMojo.execute(AbstractCompilerMojo.java:656)
	at org.apache.maven.plugin.CompilerMojo.execute(CompilerMojo.java:128)
	at org.apache.maven.plugin.DefaultBuildPluginManager.executeMojo(DefaultBuildPluginManager.java:101)
	at org.apache.maven.lifecycle.internal.MojoExecutor.execute(MojoExecutor.java:209)
	... 27 more
Sending e-mails to: notifications@directory.apache.org
channel stopped


Mime
View raw message