directory-notifications mailing list archives

Site index · List index
Message view « Date » · « Thread »
Top « Date » · « Thread »
From Apache Jenkins Server <jenk...@builds.apache.org>
Subject Build failed in Jenkins: dir-junit-addons-jdk15-deploy-site #457
Date Thu, 24 Nov 2011 02:10:14 GMT
See <https://builds.apache.org/job/dir-junit-addons-jdk15-deploy-site/457/>

------------------------------------------
Started by timer
Building remotely on ubuntu3
Updating https://svn.apache.org/repos/asf/directory/buildtools/junit-addons/trunk
U         pom.xml
At revision 1205706
no change for https://svn.apache.org/repos/asf/directory/buildtools/junit-addons/trunk since
the previous build
Parsing POMs
[trunk] $ /home/hudson/tools/java/latest1.5/bin/java -Xmx512m -XX:MaxPermSize=128m -Djava.awt.headless=true
-cp /home/jenkins/jenkins-slave/maven3-agent.jar:/home/hudson/tools/maven/latest3/boot/plexus-classworlds-2.4.jar
org.jvnet.hudson.maven3.agent.Maven3Main /home/hudson/tools/maven/latest3 /x1/jenkins/jenkins-slave/slave.jar
/home/jenkins/jenkins-slave/maven3-interceptor.jar 34162
<===[JENKINS REMOTING CAPACITY]===>   Executing Maven:  -B -f <https://builds.apache.org/job/dir-junit-addons-jdk15-deploy-site/ws/trunk/pom.xml>
clean deploy site
channel started
[INFO] Scanning for projects...
[INFO]                                                                         
[INFO] ------------------------------------------------------------------------
[INFO] Building Apache Directory JUnit Add-ons 0.2-SNAPSHOT
[INFO] ------------------------------------------------------------------------
[INFO] 
[INFO] --- maven-clean-plugin:2.4.1:clean (default-clean) @ junit-addons ---
[INFO] 
[INFO] --- maven-remote-resources-plugin:1.2.1:process (default) @ junit-addons ---
[INFO] Deleting <https://builds.apache.org/job/dir-junit-addons-jdk15-deploy-site/ws/trunk/target>
[INFO] 
[INFO] --- maven-resources-plugin:2.5:resources (default-resources) @ junit-addons ---
[INFO] 
[INFO] --- maven-compiler-plugin:2.3.2:compile (default-compile) @ junit-addons ---
[INFO] 
[INFO] --- maven-resources-plugin:2.5:testResources (default-testResources) @ junit-addons
---
[INFO] 
[INFO] --- maven-compiler-plugin:2.3.2:testCompile (default-testCompile) @ junit-addons ---
[debug] execute contextualize
[INFO] Using 'UTF-8' encoding to copy filtered resources.
[INFO] skip non existing resourceDirectory <https://builds.apache.org/job/dir-junit-addons-jdk15-deploy-site/ws/trunk/src/main/resources>
[INFO] Copying 3 resources
[INFO] Compiling 9 source files to <https://builds.apache.org/job/dir-junit-addons-jdk15-deploy-site/ws/trunk/target/classes>
[debug] execute contextualize
[INFO] Using 'UTF-8' encoding to copy filtered resources.
[INFO] skip non existing resourceDirectory <https://builds.apache.org/job/dir-junit-addons-jdk15-deploy-site/ws/trunk/src/test/resources>
[INFO] Copying 3 resources
[INFO] No sources to compile
[INFO] 
[INFO] --- maven-surefire-plugin:2.10:test (default-test) @ junit-addons ---
[JENKINS] Recording test results
[INFO] 
[INFO] --- maven-bundle-plugin:2.3.5:bundle (default-bundle) @ junit-addons ---
[JENKINS] Archiving <https://builds.apache.org/job/dir-junit-addons-jdk15-deploy-site/ws/trunk/pom.xml>
to /home/hudson/hudson/jobs/dir-junit-addons-jdk15-deploy-site/modules/org.apache.directory.junit$junit-addons/builds/2011-11-24_02-09-45/archive/org.apache.directory.junit/junit-addons/0.2-SNAPSHOT/junit-addons-0.2-SNAPSHOT.pom
[INFO] ------------------------------------------------------------------------
[INFO] BUILD FAILURE
[INFO] ------------------------------------------------------------------------
[INFO] Total time: 10.630s
[INFO] Finished at: Thu Nov 24 02:10:11 GMT 2011
[INFO] Final Memory: 9M/51M
[INFO] ------------------------------------------------------------------------
mavenExecutionResult exceptions not empty
message : Failed to execute goal org.apache.felix:maven-bundle-plugin:2.3.5:bundle (default-bundle)
on project junit-addons: Execution default-bundle of goal org.apache.felix:maven-bundle-plugin:2.3.5:bundle
failed: An API incompatibility was encountered while executing org.apache.felix:maven-bundle-plugin:2.3.5:bundle:
java.lang.NoSuchMethodError: java.lang.String.getBytes(Ljava/nio/charset/Charset;)[B
-----------------------------------------------------
realm =    plugin>org.apache.felix:maven-bundle-plugin:2.3.5
strategy = org.codehaus.plexus.classworlds.strategy.SelfFirstStrategy
urls[0] = file:/home/jenkins/.m2/repository/org/apache/felix/maven-bundle-plugin/2.3.5/maven-bundle-plugin-2.3.5.jar
urls[1] = file:/home/jenkins/.m2/repository/biz/aQute/bndlib/1.43.0/bndlib-1.43.0.jar
urls[2] = file:/home/jenkins/.m2/repository/org/apache/felix/org.apache.felix.bundlerepository/1.6.6/org.apache.felix.bundlerepository-1.6.6.jar
urls[3] = file:/home/jenkins/.m2/repository/org/osgi/org.osgi.core/4.1.0/org.osgi.core-4.1.0.jar
urls[4] = file:/home/jenkins/.m2/repository/org/easymock/easymock/2.4/easymock-2.4.jar
urls[5] = file:/home/jenkins/.m2/repository/org/apache/maven/reporting/maven-reporting-api/2.0.7/maven-reporting-api-2.0.7.jar
urls[6] = file:/home/jenkins/.m2/repository/org/apache/maven/doxia/doxia-sink-api/1.0-alpha-7/doxia-sink-api-1.0-alpha-7.jar
urls[7] = file:/home/jenkins/.m2/repository/junit/junit/3.8.1/junit-3.8.1.jar
urls[8] = file:/home/jenkins/.m2/repository/commons-cli/commons-cli/1.0/commons-cli-1.0.jar
urls[9] = file:/home/jenkins/.m2/repository/org/codehaus/plexus/plexus-interactivity-api/1.0-alpha-4/plexus-interactivity-api-1.0-alpha-4.jar
urls[10] = file:/home/jenkins/.m2/repository/org/apache/maven/maven-archiver/2.4.1/maven-archiver-2.4.1.jar
urls[11] = file:/home/jenkins/.m2/repository/org/codehaus/plexus/plexus-archiver/1.0/plexus-archiver-1.0.jar
urls[12] = file:/home/jenkins/.m2/repository/org/codehaus/plexus/plexus-io/1.0/plexus-io-1.0.jar
urls[13] = file:/home/jenkins/.m2/repository/org/codehaus/plexus/plexus-interpolation/1.13/plexus-interpolation-1.13.jar
urls[14] = file:/home/jenkins/.m2/repository/org/apache/maven/shared/maven-dependency-tree/1.2/maven-dependency-tree-1.2.jar
urls[15] = file:/home/jenkins/.m2/repository/org/codehaus/plexus/plexus-utils/2.1/plexus-utils-2.1.jar
Number of foreign imports: 1
import: Entry[import  from realm ClassRealm[project>org.apache.directory.junit:junit-addons:0.2-SNAPSHOT,
parent: ClassRealm[maven.api, parent: null]]]

-----------------------------------------------------

cause : Execution default-bundle of goal org.apache.felix:maven-bundle-plugin:2.3.5:bundle
failed: An API incompatibility was encountered while executing org.apache.felix:maven-bundle-plugin:2.3.5:bundle:
java.lang.NoSuchMethodError: java.lang.String.getBytes(Ljava/nio/charset/Charset;)[B
-----------------------------------------------------
realm =    plugin>org.apache.felix:maven-bundle-plugin:2.3.5
strategy = org.codehaus.plexus.classworlds.strategy.SelfFirstStrategy
urls[0] = file:/home/jenkins/.m2/repository/org/apache/felix/maven-bundle-plugin/2.3.5/maven-bundle-plugin-2.3.5.jar
urls[1] = file:/home/jenkins/.m2/repository/biz/aQute/bndlib/1.43.0/bndlib-1.43.0.jar
urls[2] = file:/home/jenkins/.m2/repository/org/apache/felix/org.apache.felix.bundlerepository/1.6.6/org.apache.felix.bundlerepository-1.6.6.jar
urls[3] = file:/home/jenkins/.m2/repository/org/osgi/org.osgi.core/4.1.0/org.osgi.core-4.1.0.jar
urls[4] = file:/home/jenkins/.m2/repository/org/easymock/easymock/2.4/easymock-2.4.jar
urls[5] = file:/home/jenkins/.m2/repository/org/apache/maven/reporting/maven-reporting-api/2.0.7/maven-reporting-api-2.0.7.jar
urls[6] = file:/home/jenkins/.m2/repository/org/apache/maven/doxia/doxia-sink-api/1.0-alpha-7/doxia-sink-api-1.0-alpha-7.jar
urls[7] = file:/home/jenkins/.m2/repository/junit/junit/3.8.1/junit-3.8.1.jar
urls[8] = file:/home/jenkins/.m2/repository/commons-cli/commons-cli/1.0/commons-cli-1.0.jar
urls[9] = file:/home/jenkins/.m2/repository/org/codehaus/plexus/plexus-interactivity-api/1.0-alpha-4/plexus-interactivity-api-1.0-alpha-4.jar
urls[10] = file:/home/jenkins/.m2/repository/org/apache/maven/maven-archiver/2.4.1/maven-archiver-2.4.1.jar
urls[11] = file:/home/jenkins/.m2/repository/org/codehaus/plexus/plexus-archiver/1.0/plexus-archiver-1.0.jar
urls[12] = file:/home/jenkins/.m2/repository/org/codehaus/plexus/plexus-io/1.0/plexus-io-1.0.jar
urls[13] = file:/home/jenkins/.m2/repository/org/codehaus/plexus/plexus-interpolation/1.13/plexus-interpolation-1.13.jar
urls[14] = file:/home/jenkins/.m2/repository/org/apache/maven/shared/maven-dependency-tree/1.2/maven-dependency-tree-1.2.jar
urls[15] = file:/home/jenkins/.m2/repository/org/codehaus/plexus/plexus-utils/2.1/plexus-utils-2.1.jar
Number of foreign imports: 1
import: Entry[import  from realm ClassRealm[project>org.apache.directory.junit:junit-addons:0.2-SNAPSHOT,
parent: ClassRealm[maven.api, parent: null]]]

-----------------------------------------------------

Stack trace : 
org.apache.maven.lifecycle.LifecycleExecutionException: Failed to execute goal org.apache.felix:maven-bundle-plugin:2.3.5:bundle
(default-bundle) on project junit-addons: Execution default-bundle of goal org.apache.felix:maven-bundle-plugin:2.3.5:bundle
failed: An API incompatibility was encountered while executing org.apache.felix:maven-bundle-plugin:2.3.5:bundle:
java.lang.NoSuchMethodError: java.lang.String.getBytes(Ljava/nio/charset/Charset;)[B
-----------------------------------------------------
realm =    plugin>org.apache.felix:maven-bundle-plugin:2.3.5
strategy = org.codehaus.plexus.classworlds.strategy.SelfFirstStrategy
urls[0] = file:/home/jenkins/.m2/repository/org/apache/felix/maven-bundle-plugin/2.3.5/maven-bundle-plugin-2.3.5.jar
urls[1] = file:/home/jenkins/.m2/repository/biz/aQute/bndlib/1.43.0/bndlib-1.43.0.jar
urls[2] = file:/home/jenkins/.m2/repository/org/apache/felix/org.apache.felix.bundlerepository/1.6.6/org.apache.felix.bundlerepository-1.6.6.jar
urls[3] = file:/home/jenkins/.m2/repository/org/osgi/org.osgi.core/4.1.0/org.osgi.core-4.1.0.jar
urls[4] = file:/home/jenkins/.m2/repository/org/easymock/easymock/2.4/easymock-2.4.jar
urls[5] = file:/home/jenkins/.m2/repository/org/apache/maven/reporting/maven-reporting-api/2.0.7/maven-reporting-api-2.0.7.jar
urls[6] = file:/home/jenkins/.m2/repository/org/apache/maven/doxia/doxia-sink-api/1.0-alpha-7/doxia-sink-api-1.0-alpha-7.jar
urls[7] = file:/home/jenkins/.m2/repository/junit/junit/3.8.1/junit-3.8.1.jar
urls[8] = file:/home/jenkins/.m2/repository/commons-cli/commons-cli/1.0/commons-cli-1.0.jar
urls[9] = file:/home/jenkins/.m2/repository/org/codehaus/plexus/plexus-interactivity-api/1.0-alpha-4/plexus-interactivity-api-1.0-alpha-4.jar
urls[10] = file:/home/jenkins/.m2/repository/org/apache/maven/maven-archiver/2.4.1/maven-archiver-2.4.1.jar
urls[11] = file:/home/jenkins/.m2/repository/org/codehaus/plexus/plexus-archiver/1.0/plexus-archiver-1.0.jar
urls[12] = file:/home/jenkins/.m2/repository/org/codehaus/plexus/plexus-io/1.0/plexus-io-1.0.jar
urls[13] = file:/home/jenkins/.m2/repository/org/codehaus/plexus/plexus-interpolation/1.13/plexus-interpolation-1.13.jar
urls[14] = file:/home/jenkins/.m2/repository/org/apache/maven/shared/maven-dependency-tree/1.2/maven-dependency-tree-1.2.jar
urls[15] = file:/home/jenkins/.m2/repository/org/codehaus/plexus/plexus-utils/2.1/plexus-utils-2.1.jar
Number of foreign imports: 1
import: Entry[import  from realm ClassRealm[project>org.apache.directory.junit:junit-addons:0.2-SNAPSHOT,
parent: ClassRealm[maven.api, parent: null]]]

-----------------------------------------------------

	at org.apache.maven.lifecycle.internal.MojoExecutor.execute(MojoExecutor.java:225)
	at org.apache.maven.lifecycle.internal.MojoExecutor.execute(MojoExecutor.java:153)
	at org.apache.maven.lifecycle.internal.MojoExecutor.execute(MojoExecutor.java:145)
	at org.apache.maven.lifecycle.internal.LifecycleModuleBuilder.buildProject(LifecycleModuleBuilder.java:84)
	at org.apache.maven.lifecycle.internal.LifecycleModuleBuilder.buildProject(LifecycleModuleBuilder.java:59)
	at org.apache.maven.lifecycle.internal.LifecycleStarter.singleThreadedBuild(LifecycleStarter.java:183)
	at org.apache.maven.lifecycle.internal.LifecycleStarter.execute(LifecycleStarter.java:161)
	at org.apache.maven.DefaultMaven.doExecute(DefaultMaven.java:319)
	at org.apache.maven.DefaultMaven.execute(DefaultMaven.java:156)
	at org.jvnet.hudson.maven3.launcher.Maven3Launcher.main(Maven3Launcher.java:79)
	at sun.reflect.NativeMethodAccessorImpl.invoke0(Native Method)
	at sun.reflect.NativeMethodAccessorImpl.invoke(NativeMethodAccessorImpl.java:39)
	at sun.reflect.DelegatingMethodAccessorImpl.invoke(DelegatingMethodAccessorImpl.java:25)
	at java.lang.reflect.Method.invoke(Method.java:592)
	at org.codehaus.plexus.classworlds.launcher.Launcher.launchStandard(Launcher.java:329)
	at org.codehaus.plexus.classworlds.launcher.Launcher.launch(Launcher.java:239)
	at org.jvnet.hudson.maven3.agent.Maven3Main.launch(Maven3Main.java:158)
	at hudson.maven.Maven3Builder.call(Maven3Builder.java:122)
	at hudson.maven.Maven3Builder.call(Maven3Builder.java:74)
	at hudson.remoting.UserRequest.perform(UserRequest.java:118)
	at hudson.remoting.UserRequest.perform(UserRequest.java:48)
	at hudson.remoting.Request$2.run(Request.java:287)
	at java.util.concurrent.Executors$RunnableAdapter.call(Executors.java:417)
	at java.util.concurrent.FutureTask$Sync.innerRun(FutureTask.java:269)
	at java.util.concurrent.FutureTask.run(FutureTask.java:123)
	at java.util.concurrent.ThreadPoolExecutor$Worker.runTask(ThreadPoolExecutor.java:651)
	at java.util.concurrent.ThreadPoolExecutor$Worker.run(ThreadPoolExecutor.java:676)
	at java.lang.Thread.run(Thread.java:595)
Caused by: org.apache.maven.plugin.PluginExecutionException: Execution default-bundle of goal
org.apache.felix:maven-bundle-plugin:2.3.5:bundle failed: An API incompatibility was encountered
while executing org.apache.felix:maven-bundle-plugin:2.3.5:bundle: java.lang.NoSuchMethodError:
java.lang.String.getBytes(Ljava/nio/charset/Charset;)[B
-----------------------------------------------------
realm =    plugin>org.apache.felix:maven-bundle-plugin:2.3.5
strategy = org.codehaus.plexus.classworlds.strategy.SelfFirstStrategy
urls[0] = file:/home/jenkins/.m2/repository/org/apache/felix/maven-bundle-plugin/2.3.5/maven-bundle-plugin-2.3.5.jar
urls[1] = file:/home/jenkins/.m2/repository/biz/aQute/bndlib/1.43.0/bndlib-1.43.0.jar
urls[2] = file:/home/jenkins/.m2/repository/org/apache/felix/org.apache.felix.bundlerepository/1.6.6/org.apache.felix.bundlerepository-1.6.6.jar
urls[3] = file:/home/jenkins/.m2/repository/org/osgi/org.osgi.core/4.1.0/org.osgi.core-4.1.0.jar
urls[4] = file:/home/jenkins/.m2/repository/org/easymock/easymock/2.4/easymock-2.4.jar
urls[5] = file:/home/jenkins/.m2/repository/org/apache/maven/reporting/maven-reporting-api/2.0.7/maven-reporting-api-2.0.7.jar
urls[6] = file:/home/jenkins/.m2/repository/org/apache/maven/doxia/doxia-sink-api/1.0-alpha-7/doxia-sink-api-1.0-alpha-7.jar
urls[7] = file:/home/jenkins/.m2/repository/junit/junit/3.8.1/junit-3.8.1.jar
urls[8] = file:/home/jenkins/.m2/repository/commons-cli/commons-cli/1.0/commons-cli-1.0.jar
urls[9] = file:/home/jenkins/.m2/repository/org/codehaus/plexus/plexus-interactivity-api/1.0-alpha-4/plexus-interactivity-api-1.0-alpha-4.jar
urls[10] = file:/home/jenkins/.m2/repository/org/apache/maven/maven-archiver/2.4.1/maven-archiver-2.4.1.jar
urls[11] = file:/home/jenkins/.m2/repository/org/codehaus/plexus/plexus-archiver/1.0/plexus-archiver-1.0.jar
urls[12] = file:/home/jenkins/.m2/repository/org/codehaus/plexus/plexus-io/1.0/plexus-io-1.0.jar
urls[13] = file:/home/jenkins/.m2/repository/org/codehaus/plexus/plexus-interpolation/1.13/plexus-interpolation-1.13.jar
urls[14] = file:/home/jenkins/.m2/repository/org/apache/maven/shared/maven-dependency-tree/1.2/maven-dependency-tree-1.2.jar
urls[15] = file:/home/jenkins/.m2/repository/org/codehaus/plexus/plexus-utils/2.1/plexus-utils-2.1.jar
Number of foreign imports: 1
import: Entry[import  from realm ClassRealm[project>org.apache.directory.junit:junit-addons:0.2-SNAPSHOT,
parent: ClassRealm[maven.api, parent: null]]]

-----------------------------------------------------

	at org.apache.maven.plugin.DefaultBuildPluginManager.executeMojo(DefaultBuildPluginManager.java:139)
	at org.apache.maven.lifecycle.internal.MojoExecutor.execute(MojoExecutor.java:209)
	... 27 more
Caused by: org.apache.maven.plugin.PluginContainerException: An API incompatibility was encountered
while executing org.apache.felix:maven-bundle-plugin:2.3.5:bundle: java.lang.NoSuchMethodError:
java.lang.String.getBytes(Ljava/nio/charset/Charset;)[B
-----------------------------------------------------
realm =    plugin>org.apache.felix:maven-bundle-plugin:2.3.5
strategy = org.codehaus.plexus.classworlds.strategy.SelfFirstStrategy
urls[0] = file:/home/jenkins/.m2/repository/org/apache/felix/maven-bundle-plugin/2.3.5/maven-bundle-plugin-2.3.5.jar
urls[1] = file:/home/jenkins/.m2/repository/biz/aQute/bndlib/1.43.0/bndlib-1.43.0.jar
urls[2] = file:/home/jenkins/.m2/repository/org/apache/felix/org.apache.felix.bundlerepository/1.6.6/org.apache.felix.bundlerepository-1.6.6.jar
urls[3] = file:/home/jenkins/.m2/repository/org/osgi/org.osgi.core/4.1.0/org.osgi.core-4.1.0.jar
urls[4] = file:/home/jenkins/.m2/repository/org/easymock/easymock/2.4/easymock-2.4.jar
urls[5] = file:/home/jenkins/.m2/repository/org/apache/maven/reporting/maven-reporting-api/2.0.7/maven-reporting-api-2.0.7.jar
urls[6] = file:/home/jenkins/.m2/repository/org/apache/maven/doxia/doxia-sink-api/1.0-alpha-7/doxia-sink-api-1.0-alpha-7.jar
urls[7] = file:/home/jenkins/.m2/repository/junit/junit/3.8.1/junit-3.8.1.jar
urls[8] = file:/home/jenkins/.m2/repository/commons-cli/commons-cli/1.0/commons-cli-1.0.jar
urls[9] = file:/home/jenkins/.m2/repository/org/codehaus/plexus/plexus-interactivity-api/1.0-alpha-4/plexus-interactivity-api-1.0-alpha-4.jar
urls[10] = file:/home/jenkins/.m2/repository/org/apache/maven/maven-archiver/2.4.1/maven-archiver-2.4.1.jar
urls[11] = file:/home/jenkins/.m2/repository/org/codehaus/plexus/plexus-archiver/1.0/plexus-archiver-1.0.jar
urls[12] = file:/home/jenkins/.m2/repository/org/codehaus/plexus/plexus-io/1.0/plexus-io-1.0.jar
urls[13] = file:/home/jenkins/.m2/repository/org/codehaus/plexus/plexus-interpolation/1.13/plexus-interpolation-1.13.jar
urls[14] = file:/home/jenkins/.m2/repository/org/apache/maven/shared/maven-dependency-tree/1.2/maven-dependency-tree-1.2.jar
urls[15] = file:/home/jenkins/.m2/repository/org/codehaus/plexus/plexus-utils/2.1/plexus-utils-2.1.jar
Number of foreign imports: 1
import: Entry[import  from realm ClassRealm[project>org.apache.directory.junit:junit-addons:0.2-SNAPSHOT,
parent: ClassRealm[maven.api, parent: null]]]

-----------------------------------------------------

	at org.apache.maven.plugin.DefaultBuildPluginManager.executeMojo(DefaultBuildPluginManager.java:137)
	... 28 more
Caused by: java.lang.NoSuchMethodError: java.lang.String.getBytes(Ljava/nio/charset/Charset;)[B
	at aQute.lib.osgi.Jar.<clinit>(Jar.java:290)
	at org.apache.felix.bundleplugin.BundlePlugin.getClasspath(BundlePlugin.java:942)
	at org.apache.felix.bundleplugin.BundlePlugin.execute(BundlePlugin.java:261)
	at org.apache.felix.bundleplugin.BundlePlugin.execute(BundlePlugin.java:252)
	at org.apache.maven.plugin.DefaultBuildPluginManager.executeMojo(DefaultBuildPluginManager.java:101)
	... 28 more
Sending e-mails to: notifications@directory.apache.org
[INFO] Surefire report directory: <https://builds.apache.org/job/dir-junit-addons-jdk15-deploy-site/ws/trunk/target/surefire-reports>

-------------------------------------------------------
 T E S T S
-------------------------------------------------------

Results :

Tests run: 0, Failures: 0, Errors: 0, Skipped: 0

channel stopped


Mime
View raw message