directory-notifications mailing list archives

Site index · List index
Message view « Date » · « Thread »
Top « Date » · « Thread »
From Apache Jenkins Server <jenk...@builds.apache.org>
Subject Build failed in Jenkins: dir-apacheds-jdk16-ubuntu-deploy » ApacheDS Password Hashing Interceptor #417
Date Sun, 16 Oct 2011 04:04:45 GMT
See <https://builds.apache.org/job/dir-apacheds-jdk16-ubuntu-deploy/org.apache.directory.server$apacheds-interceptors-hash/417/changes>

Changes:

[elecharny] Remoevd some cross-dependencies between inteceptors

------------------------------------------
[INFO]                                                                         
[INFO] ------------------------------------------------------------------------
[INFO] Building ApacheDS Password Hashing Interceptor 2.0.0-M4-SNAPSHOT
[INFO] ------------------------------------------------------------------------
[INFO] 
[INFO] --- maven-clean-plugin:2.4.1:clean (default-clean) @ apacheds-interceptors-hash ---
[INFO] 
[INFO] --- maven-remote-resources-plugin:1.2:process (default) @ apacheds-interceptors-hash
---
[INFO] [debug] execute contextualize
[INFO] Using 'UTF-8' encoding to copy filtered resources.
[INFO] skip non existing resourceDirectory <https://builds.apache.org/job/dir-apacheds-jdk16-ubuntu-deploy/org.apache.directory.server$apacheds-interceptors-hash/ws/src/main/resources>
[INFO] Copying 3 resources

[INFO] --- maven-resources-plugin:2.5:resources (default-resources) @ apacheds-interceptors-hash
---
[INFO] [INFO] Compiling 12 source files to <https://builds.apache.org/job/dir-apacheds-jdk16-ubuntu-deploy/org.apache.directory.server$apacheds-interceptors-hash/ws/target/classes>

[INFO] --- maven-compiler-plugin:2.3.2:compile (default-compile) @ apacheds-interceptors-hash
---
[INFO] -------------------------------------------------------------
[ERROR] COMPILATION ERROR : 
[INFO] -------------------------------------------------------------
[ERROR] <https://builds.apache.org/job/dir-apacheds-jdk16-ubuntu-deploy/org.apache.directory.server$apacheds-interceptors-hash/ws/src/main/java/org/apache/directory/server/core/hash/PasswordHashingInterceptor.java>:[30,52]
package org.apache.directory.server.core.shared.authn does not exist
[ERROR] <https://builds.apache.org/job/dir-apacheds-jdk16-ubuntu-deploy/org.apache.directory.server$apacheds-interceptors-hash/ws/src/main/java/org/apache/directory/server/core/hash/PasswordHashingInterceptor.java>:[137,45]
cannot find symbol
symbol  : variable PasswordUtil
location: class org.apache.directory.server.core.hash.PasswordHashingInterceptor
[ERROR] <https://builds.apache.org/job/dir-apacheds-jdk16-ubuntu-deploy/org.apache.directory.server$apacheds-interceptors-hash/ws/src/main/java/org/apache/directory/server/core/hash/PasswordHashingInterceptor.java>:[142,36]
cannot find symbol
symbol  : variable PasswordUtil
location: class org.apache.directory.server.core.hash.PasswordHashingInterceptor
[INFO] 3 errors 
[INFO] -------------------------------------------------------------
[JENKINS] Archiving <https://builds.apache.org/job/dir-apacheds-jdk16-ubuntu-deploy/org.apache.directory.server$apacheds-interceptors-hash/ws/pom.xml>
to /home/hudson/hudson/jobs/dir-apacheds-jdk16-ubuntu-deploy/modules/org.apache.directory.server$apacheds-interceptors-hash/builds/2011-10-16_04-01-17/archive/org.apache.directory.server/apacheds-interceptors-hash/2.0.0-M4-SNAPSHOT/apacheds-interceptors-hash-2.0.0-M4-SNAPSHOT.pom


Mime
View raw message