directory-notifications mailing list archives

Site index · List index
Message view « Date » · « Thread »
Top « Date » · « Thread »
From Apache Jenkins Server <jenk...@builds.apache.org>
Subject Build failed in Jenkins: dir-apacheds-jdk16-ubuntu-deploy #417
Date Sun, 16 Oct 2011 04:04:46 GMT
See <https://builds.apache.org/job/dir-apacheds-jdk16-ubuntu-deploy/417/changes>

Changes:

[elecharny] Remoevd some cross-dependencies between inteceptors

[elecharny] Fixed compilation errors

[elecharny] Applied Kiran's changes

[elecharny] Applied Kiran's changes

------------------------------------------
[...truncated 1731 lines...]
[INFO] [INFO] Installing <https://builds.apache.org/job/dir-apacheds-jdk16-ubuntu-deploy/ws/trunk/interceptors/event/target/apacheds-interceptors-event-2.0.0-M4-SNAPSHOT.jar>
to /home/jenkins/.m2/repository/org/apache/directory/server/apacheds-interceptors-event/2.0.0-M4-SNAPSHOT/apacheds-interceptors-event-2.0.0-M4-SNAPSHOT.jar
[INFO] Installing <https://builds.apache.org/job/dir-apacheds-jdk16-ubuntu-deploy/ws/trunk/interceptors/event/pom.xml>
to /home/jenkins/.m2/repository/org/apache/directory/server/apacheds-interceptors-event/2.0.0-M4-SNAPSHOT/apacheds-interceptors-event-2.0.0-M4-SNAPSHOT.pom
[INFO] Installing <https://builds.apache.org/job/dir-apacheds-jdk16-ubuntu-deploy/ws/trunk/interceptors/event/target/apacheds-interceptors-event-2.0.0-M4-SNAPSHOT-sources.jar>
to /home/jenkins/.m2/repository/org/apache/directory/server/apacheds-interceptors-event/2.0.0-M4-SNAPSHOT/apacheds-interceptors-event-2.0.0-M4-SNAPSHOT-sources.jar

[INFO] --- maven-install-plugin:2.3.1:install (default-install) @ apacheds-interceptors-event
---
[INFO] Downloading: https://repository.apache.org/content/repositories/snapshots/org/apache/directory/server/apacheds-interceptors-event/2.0.0-M4-SNAPSHOT/maven-metadata.xml

[INFO] --- maven-deploy-plugin:2.5:deploy (default-deploy) @ apacheds-interceptors-event ---
Downloaded: https://repository.apache.org/content/repositories/snapshots/org/apache/directory/server/apacheds-interceptors-event/2.0.0-M4-SNAPSHOT/maven-metadata.xml
(2 KB at 5.9 KB/sec)
Uploading: https://repository.apache.org/content/repositories/snapshots/org/apache/directory/server/apacheds-interceptors-event/2.0.0-M4-SNAPSHOT/apacheds-interceptors-event-2.0.0-M4-20111016.040429-2.jar
Uploaded: https://repository.apache.org/content/repositories/snapshots/org/apache/directory/server/apacheds-interceptors-event/2.0.0-M4-SNAPSHOT/apacheds-interceptors-event-2.0.0-M4-20111016.040429-2.jar
(20 KB at 64.9 KB/sec)
Uploading: https://repository.apache.org/content/repositories/snapshots/org/apache/directory/server/apacheds-interceptors-event/2.0.0-M4-SNAPSHOT/apacheds-interceptors-event-2.0.0-M4-20111016.040429-2.pom
Uploaded: https://repository.apache.org/content/repositories/snapshots/org/apache/directory/server/apacheds-interceptors-event/2.0.0-M4-SNAPSHOT/apacheds-interceptors-event-2.0.0-M4-20111016.040429-2.pom
(6 KB at 16.4 KB/sec)
Downloading: https://repository.apache.org/content/repositories/snapshots/org/apache/directory/server/apacheds-interceptors-event/maven-metadata.xml
Downloaded: https://repository.apache.org/content/repositories/snapshots/org/apache/directory/server/apacheds-interceptors-event/maven-metadata.xml
(317 B at 1.3 KB/sec)
Uploading: https://repository.apache.org/content/repositories/snapshots/org/apache/directory/server/apacheds-interceptors-event/2.0.0-M4-SNAPSHOT/maven-metadata.xml
Uploaded: https://repository.apache.org/content/repositories/snapshots/org/apache/directory/server/apacheds-interceptors-event/2.0.0-M4-SNAPSHOT/maven-metadata.xml
(2 KB at 4.2 KB/sec)
Uploading: https://repository.apache.org/content/repositories/snapshots/org/apache/directory/server/apacheds-interceptors-event/maven-metadata.xml
Uploaded: https://repository.apache.org/content/repositories/snapshots/org/apache/directory/server/apacheds-interceptors-event/maven-metadata.xml
(317 B at 0.9 KB/sec)
Uploading: https://repository.apache.org/content/repositories/snapshots/org/apache/directory/server/apacheds-interceptors-event/2.0.0-M4-SNAPSHOT/apacheds-interceptors-event-2.0.0-M4-20111016.040429-2-sources.jar
Uploaded: https://repository.apache.org/content/repositories/snapshots/org/apache/directory/server/apacheds-interceptors-event/2.0.0-M4-SNAPSHOT/apacheds-interceptors-event-2.0.0-M4-20111016.040429-2-sources.jar
(11 KB at 37.4 KB/sec)
Uploading: https://repository.apache.org/content/repositories/snapshots/org/apache/directory/server/apacheds-interceptors-event/2.0.0-M4-SNAPSHOT/maven-metadata.xml
Uploaded: https://repository.apache.org/content/repositories/snapshots/org/apache/directory/server/apacheds-interceptors-event/2.0.0-M4-SNAPSHOT/maven-metadata.xml
(2 KB at 2.6 KB/sec)
[JENKINS] Archiving <https://builds.apache.org/job/dir-apacheds-jdk16-ubuntu-deploy/ws/trunk/interceptors/event/pom.xml>
to /home/hudson/hudson/jobs/dir-apacheds-jdk16-ubuntu-deploy/modules/org.apache.directory.server$apacheds-interceptors-event/builds/2011-10-16_04-01-17/archive/org.apache.directory.server/apacheds-interceptors-event/2.0.0-M4-SNAPSHOT/apacheds-interceptors-event-2.0.0-M4-SNAPSHOT.pom
[JENKINS] Archiving <https://builds.apache.org/job/dir-apacheds-jdk16-ubuntu-deploy/ws/trunk/interceptors/event/target/apacheds-interceptors-event-2.0.0-M4-SNAPSHOT.jar>
to /home/hudson/hudson/jobs/dir-apacheds-jdk16-ubuntu-deploy/modules/org.apache.directory.server$apacheds-interceptors-event/builds/2011-10-16_04-01-17/archive/org.apache.directory.server/apacheds-interceptors-event/2.0.0-M4-20111016.040429-2/apacheds-interceptors-event-2.0.0-M4-20111016.040429-2.jar
[JENKINS] Archiving <https://builds.apache.org/job/dir-apacheds-jdk16-ubuntu-deploy/ws/trunk/interceptors/event/target/apacheds-interceptors-event-2.0.0-M4-SNAPSHOT-sources.jar>
to /home/hudson/hudson/jobs/dir-apacheds-jdk16-ubuntu-deploy/modules/org.apache.directory.server$apacheds-interceptors-event/builds/2011-10-16_04-01-17/archive/org.apache.directory.server/apacheds-interceptors-event/2.0.0-M4-20111016.040429-2/apacheds-interceptors-event-2.0.0-M4-20111016.040429-2-sources.jar
[INFO]                                                                         
[INFO] ------------------------------------------------------------------------
[INFO] Building ApacheDS Exception Interceptor 2.0.0-M4-SNAPSHOT
[INFO] ------------------------------------------------------------------------
[INFO] 
[INFO] --- maven-clean-plugin:2.4.1:clean (default-clean) @ apacheds-interceptors-exception
---
[INFO] 
[INFO] --- maven-remote-resources-plugin:1.2:process (default) @ apacheds-interceptors-exception
---
[debug] execute contextualize
[INFO] [INFO] Using 'UTF-8' encoding to copy filtered resources.
[INFO] skip non existing resourceDirectory <https://builds.apache.org/job/dir-apacheds-jdk16-ubuntu-deploy/ws/trunk/interceptors/exception/src/main/resources>
[INFO] Copying 3 resources

[INFO] --- maven-resources-plugin:2.5:resources (default-resources) @ apacheds-interceptors-exception
---
[INFO] [INFO] Compiling 1 source file to <https://builds.apache.org/job/dir-apacheds-jdk16-ubuntu-deploy/ws/trunk/interceptors/exception/target/classes>

[INFO] --- maven-compiler-plugin:2.3.2:compile (default-compile) @ apacheds-interceptors-exception
---
[debug] execute contextualize
[INFO] [INFO] Using 'UTF-8' encoding to copy filtered resources.
[INFO] skip non existing resourceDirectory <https://builds.apache.org/job/dir-apacheds-jdk16-ubuntu-deploy/ws/trunk/interceptors/exception/src/test/resources>
[INFO] Copying 3 resources

[INFO] --- maven-resources-plugin:2.5:testResources (default-testResources) @ apacheds-interceptors-exception
---
[INFO] [INFO] Nothing to compile - all classes are up to date

[INFO] --- maven-compiler-plugin:2.3.2:testCompile (default-testCompile) @ apacheds-interceptors-exception
---
[INFO] [INFO] Surefire report directory: <https://builds.apache.org/job/dir-apacheds-jdk16-ubuntu-deploy/ws/trunk/interceptors/exception/target/surefire-reports>

[INFO] --- maven-surefire-plugin:2.8:test (default-test) @ apacheds-interceptors-exception
---

-------------------------------------------------------
 T E S T S
-------------------------------------------------------
There are no tests to run.

Results :

Tests run: 0, Failures: 0, Errors: 0, Skipped: 0

[JENKINS] Recording test results
[INFO] 
[INFO] --- maven-jar-plugin:2.3.1:jar (default-jar) @ apacheds-interceptors-exception ---
[INFO] Building jar: <https://builds.apache.org/job/dir-apacheds-jdk16-ubuntu-deploy/ws/trunk/interceptors/exception/target/apacheds-interceptors-exception-2.0.0-M4-SNAPSHOT.jar>
[INFO] 
[INFO] --- maven-site-plugin:3.0:attach-descriptor (attach-descriptor) @ apacheds-interceptors-exception
---
[INFO] [INFO] Checking legal files in: apacheds-interceptors-exception-2.0.0-M4-SNAPSHOT.jar

[INFO] --- tools-maven-plugin:1.4:verify-legal-files (verify-legal-files) @ apacheds-interceptors-exception
---
ignoring exception during new ExecutedMojo null
[INFO] 
[INFO] --- maven-source-plugin:2.1.2:jar (attach-sources) @ apacheds-interceptors-exception
---
[INFO] META-INF already added, skipping
[INFO] META-INF/LICENSE already added, skipping
[INFO] META-INF/NOTICE already added, skipping
[INFO] META-INF/DEPENDENCIES already added, skipping
[INFO] Building jar: <https://builds.apache.org/job/dir-apacheds-jdk16-ubuntu-deploy/ws/trunk/interceptors/exception/target/apacheds-interceptors-exception-2.0.0-M4-SNAPSHOT-sources.jar>
[INFO] META-INF already added, skipping
[INFO] META-INF/LICENSE already added, skipping
[INFO] META-INF/NOTICE already added, skipping
[INFO] META-INF/DEPENDENCIES already added, skipping
[INFO] [INFO] Installing <https://builds.apache.org/job/dir-apacheds-jdk16-ubuntu-deploy/ws/trunk/interceptors/exception/target/apacheds-interceptors-exception-2.0.0-M4-SNAPSHOT.jar>
to /home/jenkins/.m2/repository/org/apache/directory/server/apacheds-interceptors-exception/2.0.0-M4-SNAPSHOT/apacheds-interceptors-exception-2.0.0-M4-SNAPSHOT.jar
[INFO] Installing <https://builds.apache.org/job/dir-apacheds-jdk16-ubuntu-deploy/ws/trunk/interceptors/exception/pom.xml>
to /home/jenkins/.m2/repository/org/apache/directory/server/apacheds-interceptors-exception/2.0.0-M4-SNAPSHOT/apacheds-interceptors-exception-2.0.0-M4-SNAPSHOT.pom
[INFO] Installing <https://builds.apache.org/job/dir-apacheds-jdk16-ubuntu-deploy/ws/trunk/interceptors/exception/target/apacheds-interceptors-exception-2.0.0-M4-SNAPSHOT-sources.jar>
to /home/jenkins/.m2/repository/org/apache/directory/server/apacheds-interceptors-exception/2.0.0-M4-SNAPSHOT/apacheds-interceptors-exception-2.0.0-M4-SNAPSHOT-sources.jar

[INFO] --- maven-install-plugin:2.3.1:install (default-install) @ apacheds-interceptors-exception
---
[INFO] Downloading: https://repository.apache.org/content/repositories/snapshots/org/apache/directory/server/apacheds-interceptors-exception/2.0.0-M4-SNAPSHOT/maven-metadata.xml

[INFO] --- maven-deploy-plugin:2.5:deploy (default-deploy) @ apacheds-interceptors-exception
---
Downloaded: https://repository.apache.org/content/repositories/snapshots/org/apache/directory/server/apacheds-interceptors-exception/2.0.0-M4-SNAPSHOT/maven-metadata.xml
(2 KB at 7.0 KB/sec)
Uploading: https://repository.apache.org/content/repositories/snapshots/org/apache/directory/server/apacheds-interceptors-exception/2.0.0-M4-SNAPSHOT/apacheds-interceptors-exception-2.0.0-M4-20111016.040437-2.jar
Uploaded: https://repository.apache.org/content/repositories/snapshots/org/apache/directory/server/apacheds-interceptors-exception/2.0.0-M4-SNAPSHOT/apacheds-interceptors-exception-2.0.0-M4-20111016.040437-2.jar
(14 KB at 38.5 KB/sec)
Uploading: https://repository.apache.org/content/repositories/snapshots/org/apache/directory/server/apacheds-interceptors-exception/2.0.0-M4-SNAPSHOT/apacheds-interceptors-exception-2.0.0-M4-20111016.040437-2.pom
Uploaded: https://repository.apache.org/content/repositories/snapshots/org/apache/directory/server/apacheds-interceptors-exception/2.0.0-M4-SNAPSHOT/apacheds-interceptors-exception-2.0.0-M4-20111016.040437-2.pom
(6 KB at 26.3 KB/sec)
Downloading: https://repository.apache.org/content/repositories/snapshots/org/apache/directory/server/apacheds-interceptors-exception/maven-metadata.xml
Downloaded: https://repository.apache.org/content/repositories/snapshots/org/apache/directory/server/apacheds-interceptors-exception/maven-metadata.xml
(321 B at 0.5 KB/sec)
Uploading: https://repository.apache.org/content/repositories/snapshots/org/apache/directory/server/apacheds-interceptors-exception/2.0.0-M4-SNAPSHOT/maven-metadata.xml
Uploaded: https://repository.apache.org/content/repositories/snapshots/org/apache/directory/server/apacheds-interceptors-exception/2.0.0-M4-SNAPSHOT/maven-metadata.xml
(2 KB at 3.3 KB/sec)
Uploading: https://repository.apache.org/content/repositories/snapshots/org/apache/directory/server/apacheds-interceptors-exception/maven-metadata.xml
Uploaded: https://repository.apache.org/content/repositories/snapshots/org/apache/directory/server/apacheds-interceptors-exception/maven-metadata.xml
(321 B at 1.2 KB/sec)
Uploading: https://repository.apache.org/content/repositories/snapshots/org/apache/directory/server/apacheds-interceptors-exception/2.0.0-M4-SNAPSHOT/apacheds-interceptors-exception-2.0.0-M4-20111016.040437-2-sources.jar
Uploaded: https://repository.apache.org/content/repositories/snapshots/org/apache/directory/server/apacheds-interceptors-exception/2.0.0-M4-SNAPSHOT/apacheds-interceptors-exception-2.0.0-M4-20111016.040437-2-sources.jar
(11 KB at 30.4 KB/sec)
Uploading: https://repository.apache.org/content/repositories/snapshots/org/apache/directory/server/apacheds-interceptors-exception/2.0.0-M4-SNAPSHOT/maven-metadata.xml
Uploaded: https://repository.apache.org/content/repositories/snapshots/org/apache/directory/server/apacheds-interceptors-exception/2.0.0-M4-SNAPSHOT/maven-metadata.xml
(2 KB at 4.0 KB/sec)
[JENKINS] Archiving <https://builds.apache.org/job/dir-apacheds-jdk16-ubuntu-deploy/ws/trunk/interceptors/exception/pom.xml>
to /home/hudson/hudson/jobs/dir-apacheds-jdk16-ubuntu-deploy/modules/org.apache.directory.server$apacheds-interceptors-exception/builds/2011-10-16_04-01-17/archive/org.apache.directory.server/apacheds-interceptors-exception/2.0.0-M4-SNAPSHOT/apacheds-interceptors-exception-2.0.0-M4-SNAPSHOT.pom
[JENKINS] Archiving <https://builds.apache.org/job/dir-apacheds-jdk16-ubuntu-deploy/ws/trunk/interceptors/exception/target/apacheds-interceptors-exception-2.0.0-M4-SNAPSHOT.jar>
to /home/hudson/hudson/jobs/dir-apacheds-jdk16-ubuntu-deploy/modules/org.apache.directory.server$apacheds-interceptors-exception/builds/2011-10-16_04-01-17/archive/org.apache.directory.server/apacheds-interceptors-exception/2.0.0-M4-20111016.040437-2/apacheds-interceptors-exception-2.0.0-M4-20111016.040437-2.jar
[JENKINS] Archiving <https://builds.apache.org/job/dir-apacheds-jdk16-ubuntu-deploy/ws/trunk/interceptors/exception/target/apacheds-interceptors-exception-2.0.0-M4-SNAPSHOT-sources.jar>
to /home/hudson/hudson/jobs/dir-apacheds-jdk16-ubuntu-deploy/modules/org.apache.directory.server$apacheds-interceptors-exception/builds/2011-10-16_04-01-17/archive/org.apache.directory.server/apacheds-interceptors-exception/2.0.0-M4-20111016.040437-2/apacheds-interceptors-exception-2.0.0-M4-20111016.040437-2-sources.jar
[INFO]                                                                         
[INFO] ------------------------------------------------------------------------
[INFO] Building ApacheDS Password Hashing Interceptor 2.0.0-M4-SNAPSHOT
[INFO] ------------------------------------------------------------------------
[INFO] 
[INFO] --- maven-clean-plugin:2.4.1:clean (default-clean) @ apacheds-interceptors-hash ---
[INFO] 
[INFO] --- maven-remote-resources-plugin:1.2:process (default) @ apacheds-interceptors-hash
---
[INFO] [debug] execute contextualize
[INFO] Using 'UTF-8' encoding to copy filtered resources.
[INFO] skip non existing resourceDirectory <https://builds.apache.org/job/dir-apacheds-jdk16-ubuntu-deploy/ws/trunk/interceptors/hash/src/main/resources>
[INFO] Copying 3 resources

[INFO] --- maven-resources-plugin:2.5:resources (default-resources) @ apacheds-interceptors-hash
---
[INFO] [INFO] Compiling 12 source files to <https://builds.apache.org/job/dir-apacheds-jdk16-ubuntu-deploy/ws/trunk/interceptors/hash/target/classes>

[INFO] --- maven-compiler-plugin:2.3.2:compile (default-compile) @ apacheds-interceptors-hash
---
[INFO] -------------------------------------------------------------
[ERROR] COMPILATION ERROR : 
[INFO] -------------------------------------------------------------
[ERROR] <https://builds.apache.org/job/dir-apacheds-jdk16-ubuntu-deploy/ws/trunk/interceptors/hash/src/main/java/org/apache/directory/server/core/hash/PasswordHashingInterceptor.java>:[30,52]
package org.apache.directory.server.core.shared.authn does not exist
[ERROR] <https://builds.apache.org/job/dir-apacheds-jdk16-ubuntu-deploy/ws/trunk/interceptors/hash/src/main/java/org/apache/directory/server/core/hash/PasswordHashingInterceptor.java>:[137,45]
cannot find symbol
symbol  : variable PasswordUtil
location: class org.apache.directory.server.core.hash.PasswordHashingInterceptor
[ERROR] <https://builds.apache.org/job/dir-apacheds-jdk16-ubuntu-deploy/ws/trunk/interceptors/hash/src/main/java/org/apache/directory/server/core/hash/PasswordHashingInterceptor.java>:[142,36]
cannot find symbol
symbol  : variable PasswordUtil
location: class org.apache.directory.server.core.hash.PasswordHashingInterceptor
[INFO] 3 errors 
[INFO] -------------------------------------------------------------
[JENKINS] Archiving <https://builds.apache.org/job/dir-apacheds-jdk16-ubuntu-deploy/ws/trunk/interceptors/hash/pom.xml>
to /home/hudson/hudson/jobs/dir-apacheds-jdk16-ubuntu-deploy/modules/org.apache.directory.server$apacheds-interceptors-hash/builds/2011-10-16_04-01-17/archive/org.apache.directory.server/apacheds-interceptors-hash/2.0.0-M4-SNAPSHOT/apacheds-interceptors-hash-2.0.0-M4-SNAPSHOT.pom
[INFO] ------------------------------------------------------------------------
[INFO] Reactor Summary:
[INFO] 
[INFO] ApacheDS .......................................... SUCCESS [14.442s]
[INFO] ApacheDS I18n ..................................... SUCCESS [7.007s]
[INFO] ApacheDS Core Constants ........................... SUCCESS [4.383s]
[INFO] ApacheDS Core API ................................. SUCCESS [59.585s]
[INFO] ApacheDS Core Shared .............................. SUCCESS [8.201s]
[INFO] ApacheDS Interceptors ............................. SUCCESS [3.172s]
[INFO] ApacheDS AdministrativePoint Interceptor .......... SUCCESS [6.947s]
[INFO] ApacheDS Authentication Interceptor ............... SUCCESS [9.091s]
[INFO] ApacheDS Subtree Interceptor ...................... SUCCESS [10.126s]
[INFO] ApacheDS Authorization Interceptor ................ SUCCESS [10.652s]
[INFO] ApacheDS ChangeLog Interceptor .................... SUCCESS [7.773s]
[INFO] ApacheDS Collective Attribute Interceptor ......... SUCCESS [5.792s]
[INFO] ApacheDS Event Interceptor ........................ SUCCESS [6.404s]
[INFO] ApacheDS Exception Interceptor .................... SUCCESS [6.304s]
[INFO] ApacheDS Password Hashing Interceptor ............. FAILURE [1.202s]
[INFO] ApacheDS Journal Interceptor ...................... SKIPPED
[INFO] ApacheDS Logger Interceptor ....................... SKIPPED
[INFO] ApacheDS Normalization Interceptor ................ SKIPPED
[INFO] ApacheDS Operational Attribute Interceptor ........ SKIPPED
[INFO] ApacheDS Referral Interceptor ..................... SKIPPED
[INFO] ApacheDS Schema Interceptor ....................... SKIPPED
[INFO] ApacheDS Triggers Interceptor ..................... SKIPPED
[INFO] ApacheDS Core ..................................... SKIPPED
[INFO] ApacheDS Core AVL ................................. SKIPPED
[INFO] ApacheDS Generalized (X) DBM Partition ............ SKIPPED
[INFO] ApacheDS LDIF Partition ........................... SKIPPED
[INFO] ApacheDS JDBM implementation ...................... SKIPPED
[INFO] ApacheDS JDBM Partition ........................... SKIPPED
[INFO] ApacheDS Core Annotations ......................... SKIPPED
[INFO] ApacheDS Core JNDI ................................ SKIPPED
[INFO] ApacheDS Protocol Shared .......................... SKIPPED
[INFO] ApacheDS Protocol Kerberos Codec .................. SKIPPED
[INFO] ApacheDS Interceptors for Kerberos ................ SKIPPED
[INFO] ApacheDS Protocol Dhcp ............................ SKIPPED
[INFO] ApacheDS Protocol Dns ............................. SKIPPED
[INFO] ApacheDS Protocol Kerberos ........................ SKIPPED
[INFO] ApacheDS Protocol Ldap ............................ SKIPPED
[INFO] ApacheDS Protocol Ntp ............................. SKIPPED
[INFO] Apacheds Server Annotations ....................... SKIPPED
[INFO] ApacheDS Server Config ............................ SKIPPED
[INFO] ApacheDS Server JNDI .............................. SKIPPED
[INFO] ApacheDS Server Replication Service ............... SKIPPED
[INFO] ApacheDS Test Framework ........................... SKIPPED
[INFO] ApacheDS Generalized (X) DBM Tools ................ SKIPPED
[INFO] ApacheDS All ...................................... SKIPPED
[INFO] ApacheDS Core Integration ......................... SKIPPED
[INFO] ApacheDS Server Integration ....................... SKIPPED
[INFO] ApacheDS DirectoryService-WebApp bridge ........... SKIPPED
[INFO] ApacheDS Jetty HTTP Server Integration ............ SKIPPED
[INFO] ApacheDS Service Builder .......................... SKIPPED
[INFO] ApacheDS Protocol Kerberos Test ................... SKIPPED
[INFO] Apache Directory LDAP Client API test ............. SKIPPED
[INFO] ApacheDS Service .................................. SKIPPED
[INFO] ApacheDS Wrapper .................................. SKIPPED
[INFO] ApacheDS Installers Maven Plugin .................. SKIPPED
[INFO] ApacheDS Installers ............................... SKIPPED
[INFO] ------------------------------------------------------------------------
[INFO] BUILD FAILURE
[INFO] ------------------------------------------------------------------------
[INFO] Total time: 3:14.385s
[INFO] Finished at: Sun Oct 16 04:04:43 UTC 2011
[INFO] Final Memory: 102M/293M
[INFO] ------------------------------------------------------------------------
mavenExecutionResult exceptions not empty
message : Failed to execute goal org.apache.maven.plugins:maven-compiler-plugin:2.3.2:compile
(default-compile) on project apacheds-interceptors-hash: Compilation failure
cause : Compilation failure
Stack trace : 
org.apache.maven.lifecycle.LifecycleExecutionException: Failed to execute goal org.apache.maven.plugins:maven-compiler-plugin:2.3.2:compile
(default-compile) on project apacheds-interceptors-hash: Compilation failure
	at org.apache.maven.lifecycle.internal.MojoExecutor.execute(MojoExecutor.java:213)
	at org.apache.maven.lifecycle.internal.MojoExecutor.execute(MojoExecutor.java:153)
	at org.apache.maven.lifecycle.internal.MojoExecutor.execute(MojoExecutor.java:145)
	at org.apache.maven.lifecycle.internal.LifecycleModuleBuilder.buildProject(LifecycleModuleBuilder.java:84)
	at org.apache.maven.lifecycle.internal.LifecycleModuleBuilder.buildProject(LifecycleModuleBuilder.java:59)
	at org.apache.maven.lifecycle.internal.LifecycleStarter.singleThreadedBuild(LifecycleStarter.java:183)
	at org.apache.maven.lifecycle.internal.LifecycleStarter.execute(LifecycleStarter.java:161)
	at org.apache.maven.DefaultMaven.doExecute(DefaultMaven.java:319)
	at org.apache.maven.DefaultMaven.execute(DefaultMaven.java:156)
	at org.jvnet.hudson.maven3.launcher.Maven3Launcher.main(Maven3Launcher.java:79)
	at sun.reflect.NativeMethodAccessorImpl.invoke0(Native Method)
	at sun.reflect.NativeMethodAccessorImpl.invoke(NativeMethodAccessorImpl.java:39)
	at sun.reflect.DelegatingMethodAccessorImpl.invoke(DelegatingMethodAccessorImpl.java:25)
	at java.lang.reflect.Method.invoke(Method.java:597)
	at org.codehaus.plexus.classworlds.launcher.Launcher.launchStandard(Launcher.java:329)
	at org.codehaus.plexus.classworlds.launcher.Launcher.launch(Launcher.java:239)
	at org.jvnet.hudson.maven3.agent.Maven3Main.launch(Maven3Main.java:158)
	at hudson.maven.Maven3Builder.call(Maven3Builder.java:122)
	at hudson.maven.Maven3Builder.call(Maven3Builder.java:74)
	at hudson.remoting.UserRequest.perform(UserRequest.java:118)
	at hudson.remoting.UserRequest.perform(UserRequest.java:48)
	at hudson.remoting.Request$2.run(Request.java:287)
	at java.util.concurrent.Executors$RunnableAdapter.call(Executors.java:441)
	at java.util.concurrent.FutureTask$Sync.innerRun(FutureTask.java:303)
	at java.util.concurrent.FutureTask.run(FutureTask.java:138)
	at java.util.concurrent.ThreadPoolExecutor$Worker.runTask(ThreadPoolExecutor.java:886)
	at java.util.concurrent.ThreadPoolExecutor$Worker.run(ThreadPoolExecutor.java:908)
	at java.lang.Thread.run(Thread.java:619)
Caused by: org.apache.maven.plugin.CompilationFailureException: Compilation failure
	at org.apache.maven.plugin.AbstractCompilerMojo.execute(AbstractCompilerMojo.java:656)
	at org.apache.maven.plugin.CompilerMojo.execute(CompilerMojo.java:128)
	at org.apache.maven.plugin.DefaultBuildPluginManager.executeMojo(DefaultBuildPluginManager.java:101)
	at org.apache.maven.lifecycle.internal.MojoExecutor.execute(MojoExecutor.java:209)
	... 27 more
Sending e-mails to: notifications@directory.apache.org
channel stopped


Mime
View raw message