directory-notifications mailing list archives

Site index · List index
Message view « Date » · « Thread »
Top « Date » · « Thread »
From Apache Jenkins Server <jenk...@builds.apache.org>
Subject Build failed in Jenkins: dir-studio-jdk16-win #375
Date Mon, 10 Oct 2011 04:04:29 GMT
See <https://builds.apache.org/job/dir-studio-jdk16-win/375/changes>

Changes:

[seelmann] Package name refactoring (DIRSERVER-1667)

------------------------------------------
[...truncated 2668 lines...]
[WARNING] The artifact org.slf4j:jcl104-over-slf4j:jar:1.5.6 has been relocated to org.slf4j:jcl-over-slf4j:jar:1.5.6
[INFO] 
[INFO] --- maven-clean-plugin:2.4.1:clean (default-clean) @ apacheds-launcher ---
[INFO] Deleting F:\hudson\hudson-slave\workspace\dir-studio-jdk16-win\trunk\plugins\apacheds-launcher\target
[INFO] 
[INFO] --- maven-remote-resources-plugin:1.2:process (default) @ apacheds-launcher ---
[WARNING] While downloading org.slf4j:jcl104-over-slf4j:1.5.6
  This artifact has been relocated to org.slf4j:jcl-over-slf4j:1.5.6.
  As it now supports JCL versions 1.0.4, 1.1 and 1.1.1, the jcl104-over-slf4j module has been
renamed as jcl-over-slf4j.


[debug] execute contextualize
[INFO] Using 'UTF-8' encoding to copy filtered resources.
[INFO] 
[INFO] --- maven-resources-plugin:2.5:resources (default-resources) @ apacheds-launcher ---
[INFO] Copying 0 resource
[INFO] Copying 3 resources
[INFO] Compiling 2 source files to F:\hudson\hudson-slave\workspace\dir-studio-jdk16-win\trunk\plugins\apacheds-launcher\target\classes
[INFO] 
[INFO] --- maven-compiler-plugin:2.3.2:compile (default-compile) @ apacheds-launcher ---
[INFO] [debug] execute contextualize

[INFO] --- maven-resources-plugin:2.5:testResources (default-testResources) @ apacheds-launcher
---[INFO] Using 'UTF-8' encoding to copy filtered resources.

[INFO] skip non existing resourceDirectory F:\hudson\hudson-slave\workspace\dir-studio-jdk16-win\trunk\plugins\apacheds-launcher\src\test\resources
[INFO] Copying 3 resources
[INFO] [INFO] No sources to compile

[INFO] --- maven-compiler-plugin:2.3.2:testCompile (default-testCompile) @ apacheds-launcher
---
[INFO] 
[INFO] --- maven-surefire-plugin:2.8:test (default-test) @ apacheds-launcher ---
[INFO] Surefire report directory: F:\hudson\hudson-slave\workspace\dir-studio-jdk16-win\trunk\plugins\apacheds-launcher\target\surefire-reports

-------------------------------------------------------
 T E S T S
-------------------------------------------------------
There are no tests to run.

Results :

Tests run: 0, Failures: 0, Errors: 0, Skipped: 0

[JENKINS] Recording test results
[INFO] 
[INFO] --- maven-jar-plugin:2.3.1:jar (default-jar) @ apacheds-launcher ---
[INFO] Building jar: F:\hudson\hudson-slave\workspace\dir-studio-jdk16-win\trunk\plugins\apacheds-launcher\target\apacheds-launcher-2.0.0-SNAPSHOT.jar
[INFO] [INFO] Checking legal files in: apacheds-launcher-2.0.0-SNAPSHOT.jar

[INFO] --- tools-maven-plugin:1.4:verify-legal-files (verify-legal-files) @ apacheds-launcher
---
[INFO] [INFO] Installing F:\hudson\hudson-slave\workspace\dir-studio-jdk16-win\trunk\plugins\apacheds-launcher\target\apacheds-launcher-2.0.0-SNAPSHOT.jar
to C:\Users\hudson\.m2\repository\org\apache\directory\studio\apacheds-launcher\2.0.0-SNAPSHOT\apacheds-launcher-2.0.0-SNAPSHOT.jar

[INFO] --- maven-install-plugin:2.3.1:install (default-install) @ apacheds-launcher ---
[INFO] Installing F:\hudson\hudson-slave\workspace\dir-studio-jdk16-win\trunk\plugins\apacheds-launcher\pom.xml
to C:\Users\hudson\.m2\repository\org\apache\directory\studio\apacheds-launcher\2.0.0-SNAPSHOT\apacheds-launcher-2.0.0-SNAPSHOT.pom
[JENKINS] Archiving disabled - not archiving F:\hudson\hudson-slave\workspace\dir-studio-jdk16-win\trunk\plugins\apacheds-launcher\pom.xml
[JENKINS] Archiving disabled - not archiving F:\hudson\hudson-slave\workspace\dir-studio-jdk16-win\trunk\plugins\apacheds-launcher\target\apacheds-launcher-2.0.0-SNAPSHOT.jar
[INFO]                                                                         
[INFO] ------------------------------------------------------------------------
[INFO] Building Apache Directory Studio Apache DS 2.0 Configuration 2.0.0-SNAPSHOT
[INFO] ------------------------------------------------------------------------
[INFO] 
[INFO] --- maven-clean-plugin:2.4.1:clean (default-clean) @ apacheds.configuration.v2 ---
[INFO] Deleting F:\hudson\hudson-slave\workspace\dir-studio-jdk16-win\trunk\plugins\apacheds.configuration.v2\target
[INFO] 
[INFO] --- maven-remote-resources-plugin:1.2:process (default) @ apacheds.configuration.v2
---
[debug] execute contextualize
[INFO] Using 'UTF-8' encoding to copy filtered resources.
[INFO] Copying 2 resources
[INFO] 
[INFO] --- maven-resources-plugin:2.5:resources (default-resources) @ apacheds.configuration.v2
---
[INFO] Copying 6 resources to resources
[INFO] Copying 1 resource
[INFO] Copying 3 resources
[INFO] Copying 3 resources
[INFO] 
[INFO] --- studio-maven-plugin:1.0.4:prepare-jar-package (default) @ apacheds.configuration.v2
---
[INFO] Compiling 29 source files to F:\hudson\hudson-slave\workspace\dir-studio-jdk16-win\trunk\plugins\apacheds.configuration.v2\target\classes
[INFO] 
[INFO] --- maven-compiler-plugin:2.3.2:compile (default-compile) @ apacheds.configuration.v2
---
[INFO] -------------------------------------------------------------
[ERROR] COMPILATION ERROR : 
[INFO] -------------------------------------------------------------
[ERROR] \hudson\hudson-slave\workspace\dir-studio-jdk16-win\trunk\plugins\apacheds.configuration.v2\src\main\java\org\apache\directory\studio\apacheds\configuration\v2\jobs\EntryBasedConfigurationPartition.java:[27,63]
package org.apache.directory.server.core.api.interceptor.context does not exist
[ERROR] \hudson\hudson-slave\workspace\dir-studio-jdk16-win\trunk\plugins\apacheds.configuration.v2\src\main\java\org\apache\directory\studio\apacheds\configuration\v2\jobs\PartitionsDiffComputer.java:[30,63]
package org.apache.directory.server.core.api.interceptor.context does not exist
[ERROR] \hudson\hudson-slave\workspace\dir-studio-jdk16-win\trunk\plugins\apacheds.configuration.v2\src\main\java\org\apache\directory\studio\apacheds\configuration\v2\jobs\PartitionsDiffComputer.java:[31,63]
package org.apache.directory.server.core.api.interceptor.context does not exist
[ERROR] \hudson\hudson-slave\workspace\dir-studio-jdk16-win\trunk\plugins\apacheds.configuration.v2\src\main\java\org\apache\directory\studio\apacheds\configuration\v2\jobs\PartitionsDiffComputer.java:[32,53]
package org.apache.directory.server.core.api.partition does not exist
[ERROR] \hudson\hudson-slave\workspace\dir-studio-jdk16-win\trunk\plugins\apacheds.configuration.v2\src\main\java\org\apache\directory\studio\apacheds\configuration\v2\jobs\PartitionsDiffComputer.java:[59,12]
cannot find symbol
symbol  : class Partition
location: class org.apache.directory.studio.apacheds.configuration.v2.jobs.PartitionsDiffComputer
[ERROR] \hudson\hudson-slave\workspace\dir-studio-jdk16-win\trunk\plugins\apacheds.configuration.v2\src\main\java\org\apache\directory\studio\apacheds\configuration\v2\jobs\PartitionsDiffComputer.java:[62,12]
cannot find symbol
symbol  : class Partition
location: class org.apache.directory.studio.apacheds.configuration.v2.jobs.PartitionsDiffComputer
[ERROR] \hudson\hudson-slave\workspace\dir-studio-jdk16-win\trunk\plugins\apacheds.configuration.v2\src\main\java\org\apache\directory\studio\apacheds\configuration\v2\jobs\PartitionsDiffComputer.java:[70,35]
cannot find symbol
symbol  : class Partition
location: class org.apache.directory.studio.apacheds.configuration.v2.jobs.PartitionsDiffComputer
[ERROR] \hudson\hudson-slave\workspace\dir-studio-jdk16-win\trunk\plugins\apacheds.configuration.v2\src\main\java\org\apache\directory\studio\apacheds\configuration\v2\jobs\PartitionsDiffComputer.java:[70,64]
cannot find symbol
symbol  : class Partition
location: class org.apache.directory.studio.apacheds.configuration.v2.jobs.PartitionsDiffComputer
[ERROR] \hudson\hudson-slave\workspace\dir-studio-jdk16-win\trunk\plugins\apacheds.configuration.v2\src\main\java\org\apache\directory\studio\apacheds\configuration\v2\jobs\PartitionsDiffComputer.java:[255,8]
cannot find symbol
symbol  : class SearchOperationContext
location: class org.apache.directory.studio.apacheds.configuration.v2.jobs.PartitionsDiffComputer
[ERROR] \hudson\hudson-slave\workspace\dir-studio-jdk16-win\trunk\plugins\apacheds.configuration.v2\src\main\java\org\apache\directory\studio\apacheds\configuration\v2\jobs\PartitionsDiffComputer.java:[457,11]
cannot find symbol
symbol  : class Partition
location: class org.apache.directory.studio.apacheds.configuration.v2.jobs.PartitionsDiffComputer
[ERROR] \hudson\hudson-slave\workspace\dir-studio-jdk16-win\trunk\plugins\apacheds.configuration.v2\src\main\java\org\apache\directory\studio\apacheds\configuration\v2\jobs\PartitionsDiffComputer.java:[469,38]
cannot find symbol
symbol  : class Partition
location: class org.apache.directory.studio.apacheds.configuration.v2.jobs.PartitionsDiffComputer
[ERROR] \hudson\hudson-slave\workspace\dir-studio-jdk16-win\trunk\plugins\apacheds.configuration.v2\src\main\java\org\apache\directory\studio\apacheds\configuration\v2\jobs\PartitionsDiffComputer.java:[481,11]
cannot find symbol
symbol  : class Partition
location: class org.apache.directory.studio.apacheds.configuration.v2.jobs.PartitionsDiffComputer
[ERROR] \hudson\hudson-slave\workspace\dir-studio-jdk16-win\trunk\plugins\apacheds.configuration.v2\src\main\java\org\apache\directory\studio\apacheds\configuration\v2\jobs\PartitionsDiffComputer.java:[493,41]
cannot find symbol
symbol  : class Partition
location: class org.apache.directory.studio.apacheds.configuration.v2.jobs.PartitionsDiffComputer
[ERROR] \hudson\hudson-slave\workspace\dir-studio-jdk16-win\trunk\plugins\apacheds.configuration.v2\src\main\java\org\apache\directory\studio\apacheds\configuration\v2\jobs\EntryBasedConfigurationPartition.java:[82,17]
cannot find symbol
symbol  : class AddOperationContext
location: class org.apache.directory.studio.apacheds.configuration.v2.jobs.EntryBasedConfigurationPartition
[ERROR] \hudson\hudson-slave\workspace\dir-studio-jdk16-win\trunk\plugins\apacheds.configuration.v2\src\main\java\org\apache\directory\studio\apacheds\configuration\v2\jobs\PartitionsDiffComputer.java:[164,29]
cannot find symbol
symbol  : class LookupOperationContext
location: class org.apache.directory.studio.apacheds.configuration.v2.jobs.PartitionsDiffComputer
[ERROR] \hudson\hudson-slave\workspace\dir-studio-jdk16-win\trunk\plugins\apacheds.configuration.v2\src\main\java\org\apache\directory\studio\apacheds\configuration\v2\jobs\PartitionsDiffComputer.java:[186,74]
cannot find symbol
symbol  : class LookupOperationContext
location: class org.apache.directory.studio.apacheds.configuration.v2.jobs.PartitionsDiffComputer
[ERROR] \hudson\hudson-slave\workspace\dir-studio-jdk16-win\trunk\plugins\apacheds.configuration.v2\src\main\java\org\apache\directory\studio\apacheds\configuration\v2\jobs\PartitionsDiffComputer.java:[218,16]
cannot find symbol
symbol  : class SearchOperationContext
location: class org.apache.directory.studio.apacheds.configuration.v2.jobs.PartitionsDiffComputer
[ERROR] \hudson\hudson-slave\workspace\dir-studio-jdk16-win\trunk\plugins\apacheds.configuration.v2\src\main\java\org\apache\directory\studio\apacheds\configuration\v2\jobs\PartitionsDiffComputer.java:[218,49]
cannot find symbol
symbol  : class SearchOperationContext
location: class org.apache.directory.studio.apacheds.configuration.v2.jobs.PartitionsDiffComputer
[INFO] 18 errors 
[INFO] -------------------------------------------------------------
[JENKINS] Archiving disabled - not archiving F:\hudson\hudson-slave\workspace\dir-studio-jdk16-win\trunk\plugins\apacheds.configuration.v2\pom.xml
[INFO] ------------------------------------------------------------------------
[INFO] Reactor Summary:
[INFO] 
[INFO] Apache Directory Studio ........................... SUCCESS [2.384s]
[INFO] Apache Directory Studio Repository ................ SUCCESS [2.021s]
[INFO] Apache Directory Studio Libraries Plugins ......... SUCCESS [0.124s]
[INFO] SLF4J API Module (for Apache Directory Studio) .... SUCCESS [29.311s]
[INFO] Ehcache Core (for Apache Directory Studio) ........ SUCCESS [1.887s]
[INFO] AntLR Parser Generator (for Apache Directory Studio)  SUCCESS [1.531s]
[INFO] Apache Commons Codec (for Apache Directory Studio)  SUCCESS [1.167s]
[INFO] Apache Commons Collections (for Apache Directory Studio)  SUCCESS [1.254s]
[INFO] Apache Commons IO (for Apache Directory Studio) ... SUCCESS [0.833s]
[INFO] Apache Commons Lang (for Apache Directory Studio) . SUCCESS [0.836s]
[INFO] Apache Commons Logging (for Apache Directory Studio)  SUCCESS [0.702s]
[INFO] Apache Commons Pool (for Apache Directory Studio) . SUCCESS [0.675s]
[INFO] ApacheDS Core Constants (for Apache Directory Studio)  SUCCESS [0.998s]
[INFO] ApacheDS I18n (for Apache Directory Studio) ....... SUCCESS [0.629s]
[INFO] ApacheDS Core API (for Apache Directory Studio) ... SUCCESS [1.639s]
[INFO] ApacheDS Core AVL (for Apache Directory Studio) ... SUCCESS [0.753s]
[INFO] ApacheDS Generalized (X) DBM Partition (for Apache Directory Studio)  SUCCESS [0.964s]
[INFO] ApacheDS Server Config (for Apache Directory Studio)  SUCCESS [0.818s]
[INFO] Legion of the Bouncy Castle Java Cryptography APIs (for Apache Directory Studio)  SUCCESS
[1.150s]
[INFO] ApacheDS Core (for Apache Directory Studio) ....... SUCCESS [1.126s]
[INFO] ApacheDS LDIF Partition (for Apache Directory Studio)  SUCCESS [1.018s]
[INFO] Apache HttpComponents Core (for Apache Directory Studio)  SUCCESS [0.626s]
[INFO] Apache HttpComponents Client (for Apache Directory Studio)  SUCCESS [0.696s]
[INFO] Log4j (for Apache Directory Studio) ............... SUCCESS [0.650s]
[INFO] Apache MINA Core (for Apache Directory Studio) .... SUCCESS [0.743s]
[INFO] dom4j (for Apache Directory Studio) ............... SUCCESS [0.642s]
[INFO] SLF4J LOG4J-12 Binding (for Apache Directory Studio)  SUCCESS [0.599s]
[INFO] XPP3 (for Apache Directory Studio) ................ SUCCESS [0.562s]
[INFO] Apache Directory Studio Plugins ................... SUCCESS [0.074s]
[INFO] Apache Directory Studio Common UI ................. SUCCESS [2.897s]
[INFO] Apache Directory Studio Common Core ............... SUCCESS [1.712s]
[INFO] Apache Directory Studio LDIF Parser ............... SUCCESS [4.984s]
[INFO] Apache Directory Studio Connection Core ........... SUCCESS [5.838s]
[INFO] Apache Directory Studio Connection UI ............. SUCCESS [4.825s]
[INFO] Apache Directory Studio LDAP Browser Core ......... SUCCESS [8.139s]
[INFO] Apache Directory Studio LDAP Browser Common ....... SUCCESS [7.638s]
[INFO] Apache Directory Studio Value Editors ............. SUCCESS [3.682s]
[INFO] Apache Directory Studio ACI Item Editor ........... SUCCESS [3.670s]
[INFO] Apache Directory Studio Apache DS Configuration ... SUCCESS [10.103s]
[INFO] Apache Directory Studio Apache DS ................. SUCCESS [10.726s]
[INFO] Apache Directory Studio Apache DS Launcher ........ SUCCESS [2.545s]
[INFO] Apache Directory Studio Apache DS 2.0 Configuration  FAILURE [3.180s]
[INFO] Apache Directory Studio LDIF Editor ............... SKIPPED
[INFO] Apache Directory Studio LDAP Browser UI ........... SKIPPED
[INFO] Apache Directory Studio LDAP Servers .............. SKIPPED
[INFO] Apache Directory Studio ApacheDS 1.5.3 LDAP Server Adapter  SKIPPED
[INFO] Apache Directory Studio ApacheDS 1.5.4 LDAP Server Adapter  SKIPPED
[INFO] Apache Directory Studio ApacheDS 1.5.5 LDAP Server Adapter  SKIPPED
[INFO] Apache Directory Studio ApacheDS 1.5.6 LDAP Server Adapter  SKIPPED
[INFO] Apache Directory Studio ApacheDS 1.5.7 LDAP Server Adapter  SKIPPED
[INFO] Apache Directory Studio ApacheDS 2.0.0 LDAP Server Adapter  SKIPPED
[INFO] Apache Directory Studio RCP ....................... SKIPPED
[INFO] Apache Directory Studio Schema Editor ............. SKIPPED
[INFO] Apache Directory Studio Apache DS Help ............ SKIPPED
[INFO] Apache Directory Studio Apache DS Configuration Help  SKIPPED
[INFO] Apache Directory Studio LDAP Browser Help ......... SKIPPED
[INFO] Apache Directory Studio LDIF Editor Help .......... SKIPPED
[INFO] Apache Directory Studio RCP Help .................. SKIPPED
[INFO] Apache Directory Studio Schema Editor Help ........ SKIPPED
[INFO] Apache Directory Studio Help Plugins .............. SKIPPED
[INFO] Apache Directory Studio Feature Plugins ........... SKIPPED
[INFO] Apache Directory Studio Apache DS Configuration Feature  SKIPPED
[INFO] Apache Directory Studio Apache DS Feature ......... SKIPPED
[INFO] Apache Directory Studio LDAP Browser Feature ...... SKIPPED
[INFO] Apache Directory Studio LDIF Editor Feature ....... SKIPPED
[INFO] Apache Directory Studio RCP Feature ............... SKIPPED
[INFO] Apache Directory Studio Schema Editor Feature ..... SKIPPED
[INFO] ------------------------------------------------------------------------
[INFO] BUILD FAILURE
[INFO] ------------------------------------------------------------------------
[INFO] Total time: 2:15.257s
[INFO] Finished at: Mon Oct 10 05:04:24 BST 2011
[INFO] Final Memory: 149M/290M
[INFO] ------------------------------------------------------------------------
Waiting for Jenkins to finish collecting data
mavenExecutionResult exceptions not empty
message : Failed to execute goal org.apache.maven.plugins:maven-compiler-plugin:2.3.2:compile
(default-compile) on project apacheds.configuration.v2: Compilation failure
cause : Compilation failure
Stack trace : 
org.apache.maven.lifecycle.LifecycleExecutionException: Failed to execute goal org.apache.maven.plugins:maven-compiler-plugin:2.3.2:compile
(default-compile) on project apacheds.configuration.v2: Compilation failure
	at org.apache.maven.lifecycle.internal.MojoExecutor.execute(MojoExecutor.java:213)
	at org.apache.maven.lifecycle.internal.MojoExecutor.execute(MojoExecutor.java:153)
	at org.apache.maven.lifecycle.internal.MojoExecutor.execute(MojoExecutor.java:145)
	at org.apache.maven.lifecycle.internal.LifecycleModuleBuilder.buildProject(LifecycleModuleBuilder.java:84)
	at org.apache.maven.lifecycle.internal.LifecycleModuleBuilder.buildProject(LifecycleModuleBuilder.java:59)
	at org.apache.maven.lifecycle.internal.LifecycleStarter.singleThreadedBuild(LifecycleStarter.java:183)
	at org.apache.maven.lifecycle.internal.LifecycleStarter.execute(LifecycleStarter.java:161)
	at org.apache.maven.DefaultMaven.doExecute(DefaultMaven.java:319)
	at org.apache.maven.DefaultMaven.execute(DefaultMaven.java:156)
	at org.jvnet.hudson.maven3.launcher.Maven3Launcher.main(Maven3Launcher.java:79)
	at sun.reflect.NativeMethodAccessorImpl.invoke0(Native Method)
	at sun.reflect.NativeMethodAccessorImpl.invoke(NativeMethodAccessorImpl.java:39)
	at sun.reflect.DelegatingMethodAccessorImpl.invoke(DelegatingMethodAccessorImpl.java:25)
	at java.lang.reflect.Method.invoke(Method.java:597)
	at org.codehaus.plexus.classworlds.launcher.Launcher.launchStandard(Launcher.java:329)
	at org.codehaus.plexus.classworlds.launcher.Launcher.launch(Launcher.java:239)
	at org.jvnet.hudson.maven3.agent.Maven3Main.launch(Maven3Main.java:158)
	at hudson.maven.Maven3Builder.call(Maven3Builder.java:122)
	at hudson.maven.Maven3Builder.call(Maven3Builder.java:74)
	at hudson.remoting.UserRequest.perform(UserRequest.java:118)
	at hudson.remoting.UserRequest.perform(UserRequest.java:48)
	at hudson.remoting.Request$2.run(Request.java:287)
	at java.util.concurrent.Executors$RunnableAdapter.call(Executors.java:441)
	at java.util.concurrent.FutureTask$Sync.innerRun(FutureTask.java:303)
	at java.util.concurrent.FutureTask.run(FutureTask.java:138)
	at java.util.concurrent.ThreadPoolExecutor$Worker.runTask(ThreadPoolExecutor.java:886)
	at java.util.concurrent.ThreadPoolExecutor$Worker.run(ThreadPoolExecutor.java:908)
	at java.lang.Thread.run(Thread.java:662)
Caused by: org.apache.maven.plugin.CompilationFailureException: Compilation failure
	at org.apache.maven.plugin.AbstractCompilerMojo.execute(AbstractCompilerMojo.java:656)
	at org.apache.maven.plugin.CompilerMojo.execute(CompilerMojo.java:128)
	at org.apache.maven.plugin.DefaultBuildPluginManager.executeMojo(DefaultBuildPluginManager.java:107)
	at org.apache.maven.lifecycle.internal.MojoExecutor.execute(MojoExecutor.java:209)
	... 27 more
Sending e-mails to: notifications@directory.apache.org
channel stopped


Mime
View raw message