directory-notifications mailing list archives

Site index · List index
Message view « Date » · « Thread »
Top « Date » · « Thread »
From Apache Jenkins Server <jenk...@builds.apache.org>
Subject Build failed in Jenkins: dir-apacheds-jdk16-ubuntu-deploy #377
Date Tue, 06 Sep 2011 04:02:59 GMT
See <https://builds.apache.org/job/dir-apacheds-jdk16-ubuntu-deploy/377/changes>

Changes:

[elecharny] [maven-release-plugin] prepare for next development iteration

[elecharny] [maven-release-plugin] prepare release 2.0.0-M3

[elecharny] bumped up shared reference to 1.0.0-M8, for the release preparation

[elecharny] bumped up many dependencies

[pamarcelot] Re-integrated the 'installers-maven-plugin' and 'installers' sub-modules in the
default build. Installers generation is triggered by the use of the 'installers' profile ('-Pinstallers').

------------------------------------------
[...truncated 249 lines...]
[INFO] --- maven-deploy-plugin:2.5:deploy (default-deploy) @ apacheds-i18n ---
Uploading: https://repository.apache.org/content/repositories/snapshots/org/apache/directory/server/apacheds-i18n/2.0.0-M4-SNAPSHOT/apacheds-i18n-2.0.0-M4-20110906.040244-1.jar
Uploaded: https://repository.apache.org/content/repositories/snapshots/org/apache/directory/server/apacheds-i18n/2.0.0-M4-SNAPSHOT/apacheds-i18n-2.0.0-M4-20110906.040244-1.jar
(45 KB at 59.6 KB/sec)
Uploading: https://repository.apache.org/content/repositories/snapshots/org/apache/directory/server/apacheds-i18n/2.0.0-M4-SNAPSHOT/apacheds-i18n-2.0.0-M4-20110906.040244-1.pom
Uploaded: https://repository.apache.org/content/repositories/snapshots/org/apache/directory/server/apacheds-i18n/2.0.0-M4-SNAPSHOT/apacheds-i18n-2.0.0-M4-20110906.040244-1.pom
(2 KB at 8.7 KB/sec)
Downloading: https://repository.apache.org/content/repositories/snapshots/org/apache/directory/server/apacheds-i18n/maven-metadata.xml
Downloaded: https://repository.apache.org/content/repositories/snapshots/org/apache/directory/server/apacheds-i18n/maven-metadata.xml
(406 B at 2.7 KB/sec)
Uploading: https://repository.apache.org/content/repositories/snapshots/org/apache/directory/server/apacheds-i18n/2.0.0-M4-SNAPSHOT/maven-metadata.xml
Uploaded: https://repository.apache.org/content/repositories/snapshots/org/apache/directory/server/apacheds-i18n/2.0.0-M4-SNAPSHOT/maven-metadata.xml
(799 B at 5.6 KB/sec)
Uploading: https://repository.apache.org/content/repositories/snapshots/org/apache/directory/server/apacheds-i18n/maven-metadata.xml
Uploaded: https://repository.apache.org/content/repositories/snapshots/org/apache/directory/server/apacheds-i18n/maven-metadata.xml
(449 B at 2.6 KB/sec)
projectSucceeded org.apache.directory.server:apacheds-i18n:2.0.0-M4-SNAPSHOT
[JENKINS] Archiving <https://builds.apache.org/job/dir-apacheds-jdk16-ubuntu-deploy/ws/trunk/i18n/pom.xml>
to /home/hudson/hudson/jobs/dir-apacheds-jdk16-ubuntu-deploy/modules/org.apache.directory.server$apacheds-i18n/builds/2011-09-06_04-01-23/archive/org.apache.directory.server/apacheds-i18n/2.0.0-M4-SNAPSHOT/apacheds-i18n-2.0.0-M4-SNAPSHOT.pom
[JENKINS] Archiving <https://builds.apache.org/job/dir-apacheds-jdk16-ubuntu-deploy/ws/trunk/i18n/target/apacheds-i18n-2.0.0-M4-SNAPSHOT.jar>
to /home/hudson/hudson/jobs/dir-apacheds-jdk16-ubuntu-deploy/modules/org.apache.directory.server$apacheds-i18n/builds/2011-09-06_04-01-23/archive/org.apache.directory.server/apacheds-i18n/2.0.0-M4-20110906.040244-1/apacheds-i18n-2.0.0-M4-20110906.040244-1.jar
[INFO] [INFO] Deleting <https://builds.apache.org/job/dir-apacheds-jdk16-ubuntu-deploy/ws/trunk/core-constants/target>
                                                                        
[INFO] ------------------------------------------------------------------------
[INFO] Building ApacheDS Core Constants 2.0.0-M4-SNAPSHOT
[INFO] ------------------------------------------------------------------------
[INFO] 
[INFO] --- maven-clean-plugin:2.4.1:clean (default-clean) @ apacheds-core-constants ---
[INFO] 
[INFO] --- maven-remote-resources-plugin:1.2:process (default) @ apacheds-core-constants ---
[debug] execute contextualize
[INFO] [INFO] Using 'UTF-8' encoding to copy filtered resources.
[INFO] Copying 0 resource
[INFO] Copying 3 resources

[INFO] --- maven-resources-plugin:2.5:resources (default-resources) @ apacheds-core-constants
---
[INFO] [INFO] Compiling 4 source files to <https://builds.apache.org/job/dir-apacheds-jdk16-ubuntu-deploy/ws/trunk/core-constants/target/classes>

[INFO] --- maven-compiler-plugin:2.3.2:compile (default-compile) @ apacheds-core-constants
---
[debug] execute contextualize
[INFO] [INFO] Using 'UTF-8' encoding to copy filtered resources.
[INFO] skip non existing resourceDirectory <https://builds.apache.org/job/dir-apacheds-jdk16-ubuntu-deploy/ws/trunk/core-constants/src/test/resources>
[INFO] Copying 3 resources

[INFO] --- maven-resources-plugin:2.5:testResources (default-testResources) @ apacheds-core-constants
---
[INFO] [INFO] No sources to compile

[INFO] --- maven-compiler-plugin:2.3.2:testCompile (default-testCompile) @ apacheds-core-constants
---
[INFO] [INFO] Surefire report directory: <https://builds.apache.org/job/dir-apacheds-jdk16-ubuntu-deploy/ws/trunk/core-constants/target/surefire-reports>

[INFO] --- maven-surefire-plugin:2.8:test (default-test) @ apacheds-core-constants ---

-------------------------------------------------------
 T E S T S
-------------------------------------------------------
There are no tests to run.

Results :

Tests run: 0, Failures: 0, Errors: 0, Skipped: 0

[JENKINS] Recording test results
[INFO] 
[INFO] --- maven-jar-plugin:2.3.1:jar (default-jar) @ apacheds-core-constants ---
[INFO] Building jar: <https://builds.apache.org/job/dir-apacheds-jdk16-ubuntu-deploy/ws/trunk/core-constants/target/apacheds-core-constants-2.0.0-M4-SNAPSHOT.jar>
[INFO] [INFO] Checking legal files in: apacheds-core-constants-2.0.0-M4-SNAPSHOT.jar

[INFO] --- tools-maven-plugin:1.4:verify-legal-files (verify-legal-files) @ apacheds-core-constants
---
[INFO] [INFO] Exclude: **/target/**/*
[INFO] Exclude: **/cobertura.ser
[INFO] Exclude: **/.classpath
[INFO] Exclude: **/.project
[INFO] Exclude: **/.settings/**/*
[INFO] Exclude: **/ApacheDS.launch
[INFO] Exclude: **/*.iml
[INFO] Exclude: **/*.ipr
[INFO] Exclude: **/*.iws
[INFO] Exclude: **/MANIFEST.MF
[INFO] Exclude: **/dependency-reduced-pom.xml
[INFO] Exclude: **/*.ldif
[INFO] Exclude: **/*.pdu
[INFO] Exclude: jdbm/**/*
[INFO] Exclude: installers-maven-plugin/src/main/resources/org/apache/directory/server/installers/deb/control
[INFO] Exclude: installers-maven-plugin/src/main/resources/org/apache/directory/server/installers/macosxpkg/License.rtf
[INFO] Exclude: installers-maven-plugin/src/main/resources/org/apache/directory/server/installers/solarispkg/pkginfo
[INFO] Exclude: installers-maven-plugin/src/main/resources/org/apache/directory/server/installers/solarispkg/Prototype
[INFO] Exclude: osgi/src/main/resources/META-INF/spring.handlers
[INFO] Exclude: osgi/src/main/resources/META-INF/spring.schemas
[INFO] Exclude: **/*.log

[INFO] --- apache-rat-plugin:0.7:check (default) @ apacheds-core-constants ---
[INFO] [INFO] Installing <https://builds.apache.org/job/dir-apacheds-jdk16-ubuntu-deploy/ws/trunk/core-constants/target/apacheds-core-constants-2.0.0-M4-SNAPSHOT.jar>
to /home/hudson/.m2/repository/org/apache/directory/server/apacheds-core-constants/2.0.0-M4-SNAPSHOT/apacheds-core-constants-2.0.0-M4-SNAPSHOT.jar

[INFO] --- maven-install-plugin:2.3.1:install (default-install) @ apacheds-core-constants
---
[INFO] Installing <https://builds.apache.org/job/dir-apacheds-jdk16-ubuntu-deploy/ws/trunk/core-constants/pom.xml>
to /home/hudson/.m2/repository/org/apache/directory/server/apacheds-core-constants/2.0.0-M4-SNAPSHOT/apacheds-core-constants-2.0.0-M4-SNAPSHOT.pom
[INFO] Downloading: https://repository.apache.org/content/repositories/snapshots/org/apache/directory/server/apacheds-core-constants/2.0.0-M4-SNAPSHOT/maven-metadata.xml

[INFO] --- maven-deploy-plugin:2.5:deploy (default-deploy) @ apacheds-core-constants ---
Uploading: https://repository.apache.org/content/repositories/snapshots/org/apache/directory/server/apacheds-core-constants/2.0.0-M4-SNAPSHOT/apacheds-core-constants-2.0.0-M4-20110906.040249-1.jar
Uploaded: https://repository.apache.org/content/repositories/snapshots/org/apache/directory/server/apacheds-core-constants/2.0.0-M4-SNAPSHOT/apacheds-core-constants-2.0.0-M4-20110906.040249-1.jar
(11 KB at 37.2 KB/sec)
Uploading: https://repository.apache.org/content/repositories/snapshots/org/apache/directory/server/apacheds-core-constants/2.0.0-M4-SNAPSHOT/apacheds-core-constants-2.0.0-M4-20110906.040249-1.pom
Uploaded: https://repository.apache.org/content/repositories/snapshots/org/apache/directory/server/apacheds-core-constants/2.0.0-M4-SNAPSHOT/apacheds-core-constants-2.0.0-M4-20110906.040249-1.pom
(2 KB at 9.6 KB/sec)
Downloading: https://repository.apache.org/content/repositories/snapshots/org/apache/directory/server/apacheds-core-constants/maven-metadata.xml
Downloaded: https://repository.apache.org/content/repositories/snapshots/org/apache/directory/server/apacheds-core-constants/maven-metadata.xml
(516 B at 3.7 KB/sec)
Uploading: https://repository.apache.org/content/repositories/snapshots/org/apache/directory/server/apacheds-core-constants/2.0.0-M4-SNAPSHOT/maven-metadata.xml
Uploaded: https://repository.apache.org/content/repositories/snapshots/org/apache/directory/server/apacheds-core-constants/2.0.0-M4-SNAPSHOT/maven-metadata.xml
(809 B at 5.5 KB/sec)
Uploading: https://repository.apache.org/content/repositories/snapshots/org/apache/directory/server/apacheds-core-constants/maven-metadata.xml
Uploaded: https://repository.apache.org/content/repositories/snapshots/org/apache/directory/server/apacheds-core-constants/maven-metadata.xml
(559 B at 3.1 KB/sec)
projectSucceeded org.apache.directory.server:apacheds-core-constants:2.0.0-M4-SNAPSHOT
[JENKINS] Archiving <https://builds.apache.org/job/dir-apacheds-jdk16-ubuntu-deploy/ws/trunk/core-constants/pom.xml>
to /home/hudson/hudson/jobs/dir-apacheds-jdk16-ubuntu-deploy/modules/org.apache.directory.server$apacheds-core-constants/builds/2011-09-06_04-01-23/archive/org.apache.directory.server/apacheds-core-constants/2.0.0-M4-SNAPSHOT/apacheds-core-constants-2.0.0-M4-SNAPSHOT.pom
[JENKINS] Archiving <https://builds.apache.org/job/dir-apacheds-jdk16-ubuntu-deploy/ws/trunk/core-constants/target/apacheds-core-constants-2.0.0-M4-SNAPSHOT.jar>
to /home/hudson/hudson/jobs/dir-apacheds-jdk16-ubuntu-deploy/modules/org.apache.directory.server$apacheds-core-constants/builds/2011-09-06_04-01-23/archive/org.apache.directory.server/apacheds-core-constants/2.0.0-M4-20110906.040249-1/apacheds-core-constants-2.0.0-M4-20110906.040249-1.jar
[INFO]                                                                         
[INFO] ------------------------------------------------------------------------
[INFO] Building ApacheDS Core API 2.0.0-M4-SNAPSHOT
[INFO] ------------------------------------------------------------------------
Downloading: http://repo1.maven.org/maven2/org/apache/directory/shared/shared-ldap-client-api/1.0.0-M8/shared-ldap-client-api-1.0.0-M8.pom
[WARNING] The POM for org.apache.directory.shared:shared-ldap-client-api:jar:1.0.0-M8 is missing,
no dependency information available
Downloading: http://repo1.maven.org/maven2/org/apache/directory/shared/shared-asn1-api/1.0.0-M8/shared-asn1-api-1.0.0-M8.pom
[WARNING] The POM for org.apache.directory.shared:shared-asn1-api:jar:1.0.0-M8 is missing,
no dependency information available
Downloading: http://repo1.maven.org/maven2/org/apache/directory/shared/shared-i18n/1.0.0-M8/shared-i18n-1.0.0-M8.pom
[WARNING] The POM for org.apache.directory.shared:shared-i18n:jar:1.0.0-M8 is missing, no
dependency information available
Downloading: http://repo1.maven.org/maven2/org/apache/directory/shared/shared-ldap-codec-standalone/1.0.0-M8/shared-ldap-codec-standalone-1.0.0-M8.pom
[WARNING] The POM for org.apache.directory.shared:shared-ldap-codec-standalone:jar:1.0.0-M8
is missing, no dependency information available
Downloading: http://repo1.maven.org/maven2/org/apache/directory/shared/shared-ldap-codec-core/1.0.0-M8/shared-ldap-codec-core-1.0.0-M8.pom
[WARNING] The POM for org.apache.directory.shared:shared-ldap-codec-core:jar:1.0.0-M8 is missing,
no dependency information available
Downloading: http://repo1.maven.org/maven2/org/apache/directory/shared/shared-ldap-model/1.0.0-M8/shared-ldap-model-1.0.0-M8.pom
[WARNING] The POM for org.apache.directory.shared:shared-ldap-model:jar:1.0.0-M8 is missing,
no dependency information available
Downloading: http://repo1.maven.org/maven2/org/apache/directory/shared/shared-ldap-schema-data/1.0.0-M8/shared-ldap-schema-data-1.0.0-M8.pom
[WARNING] The POM for org.apache.directory.shared:shared-ldap-schema-data:jar:1.0.0-M8 is
missing, no dependency information available
Downloading: http://repo1.maven.org/maven2/org/apache/directory/shared/shared-util/1.0.0-M8/shared-util-1.0.0-M8.pom
[WARNING] The POM for org.apache.directory.shared:shared-util:jar:1.0.0-M8 is missing, no
dependency information available
Downloading: http://repo1.maven.org/maven2/org/apache/directory/shared/shared-ldap-extras-util/1.0.0-M8/shared-ldap-extras-util-1.0.0-M8.pom
[WARNING] The POM for org.apache.directory.shared:shared-ldap-extras-util:jar:1.0.0-M8 is
missing, no dependency information available
Downloading: http://repo1.maven.org/maven2/net/sf/ehcache/ehcache-core/2.4.4/ehcache-core-2.4.4.pom
Downloaded: http://repo1.maven.org/maven2/net/sf/ehcache/ehcache-core/2.4.4/ehcache-core-2.4.4.pom
(0 B at 0.0 KB/sec)
Downloading: http://repo1.maven.org/maven2/org/apache/directory/shared/shared-ldap-client-api/1.0.0-M8/shared-ldap-client-api-1.0.0-M8.jar
Downloading: http://repo1.maven.org/maven2/org/apache/directory/shared/shared-asn1-api/1.0.0-M8/shared-asn1-api-1.0.0-M8.jar
Downloading: http://repo1.maven.org/maven2/org/apache/directory/shared/shared-i18n/1.0.0-M8/shared-i18n-1.0.0-M8.jar
Downloading: http://repo1.maven.org/maven2/org/apache/directory/shared/shared-ldap-codec-standalone/1.0.0-M8/shared-ldap-codec-standalone-1.0.0-M8.jar
Downloading: http://repo1.maven.org/maven2/org/apache/directory/shared/shared-ldap-codec-core/1.0.0-M8/shared-ldap-codec-core-1.0.0-M8.jar
Downloading: http://repo1.maven.org/maven2/org/apache/directory/shared/shared-ldap-model/1.0.0-M8/shared-ldap-model-1.0.0-M8.jar
Downloading: http://repo1.maven.org/maven2/org/apache/directory/shared/shared-ldap-schema-data/1.0.0-M8/shared-ldap-schema-data-1.0.0-M8.jar
Downloading: http://repo1.maven.org/maven2/org/apache/directory/shared/shared-util/1.0.0-M8/shared-util-1.0.0-M8.jar
Downloading: http://repo1.maven.org/maven2/org/apache/directory/shared/shared-ldap-extras-util/1.0.0-M8/shared-ldap-extras-util-1.0.0-M8.jar
Downloading: http://repo1.maven.org/maven2/net/sf/ehcache/ehcache-core/2.4.4/ehcache-core-2.4.4.jar
Downloaded: http://repo1.maven.org/maven2/net/sf/ehcache/ehcache-core/2.4.4/ehcache-core-2.4.4.jar
(0 B at 0.0 KB/sec)
projectFailed org.apache.directory.server:apacheds-core-api:2.0.0-M4-SNAPSHOT
[JENKINS] Archiving <https://builds.apache.org/job/dir-apacheds-jdk16-ubuntu-deploy/ws/trunk/core-api/pom.xml>
to /home/hudson/hudson/jobs/dir-apacheds-jdk16-ubuntu-deploy/modules/org.apache.directory.server$apacheds-core-api/builds/2011-09-06_04-01-23/archive/org.apache.directory.server/apacheds-core-api/2.0.0-M4-SNAPSHOT/apacheds-core-api-2.0.0-M4-SNAPSHOT.pom
sessionEnded
[INFO] ------------------------------------------------------------------------
[INFO] Reactor Summary:
[INFO] 
[INFO] ApacheDS .......................................... SUCCESS [55.642s]
[INFO] ApacheDS I18n ..................................... SUCCESS [6.544s]
[INFO] ApacheDS Core Constants ........................... SUCCESS [3.231s]
[INFO] ApacheDS Core API ................................. FAILURE [5.147s]
[INFO] ApacheDS Core ..................................... SKIPPED
[INFO] ApacheDS Core AVL ................................. SKIPPED
[INFO] ApacheDS Generalized (X) DBM Partition ............ SKIPPED
[INFO] ApacheDS LDIF Partition ........................... SKIPPED
[INFO] ApacheDS JDBM implementation ...................... SKIPPED
[INFO] ApacheDS JDBM Partition ........................... SKIPPED
[INFO] ApacheDS Core Annotations ......................... SKIPPED
[INFO] ApacheDS Core JNDI ................................ SKIPPED
[INFO] ApacheDS Protocol Shared .......................... SKIPPED
[INFO] ApacheDS Protocol Kerberos Codec .................. SKIPPED
[INFO] ApacheDS Interceptors for Kerberos ................ SKIPPED
[INFO] ApacheDS Protocol Dhcp ............................ SKIPPED
[INFO] ApacheDS Protocol Dns ............................. SKIPPED
[INFO] ApacheDS Protocol Kerberos ........................ SKIPPED
[INFO] ApacheDS Protocol Ldap ............................ SKIPPED
[INFO] ApacheDS Protocol Ntp ............................. SKIPPED
[INFO] Apacheds Server Annotations ....................... SKIPPED
[INFO] ApacheDS Server Config ............................ SKIPPED
[INFO] ApacheDS Server JNDI .............................. SKIPPED
[INFO] ApacheDS Server Replication Service ............... SKIPPED
[INFO] ApacheDS Test Framework ........................... SKIPPED
[INFO] ApacheDS Generalized (X) DBM Tools ................ SKIPPED
[INFO] ApacheDS All ...................................... SKIPPED
[INFO] ApacheDS Core Integration ......................... SKIPPED
[INFO] ApacheDS Server Integration ....................... SKIPPED
[INFO] ApacheDS DirectoryService-WebApp bridge ........... SKIPPED
[INFO] ApacheDS Jetty HTTP Server Integration ............ SKIPPED
[INFO] ApacheDS Service Builder .......................... SKIPPED
[INFO] ApacheDS Protocol Kerberos Test ................... SKIPPED
[INFO] Apache Directory LDAP Client API test ............. SKIPPED
[INFO] ApacheDS Service .................................. SKIPPED
[INFO] ApacheDS Wrapper .................................. SKIPPED
[INFO] ApacheDS Installers Maven Plugin .................. SKIPPED
[INFO] ApacheDS Installers ............................... SKIPPED
[INFO] ------------------------------------------------------------------------
[INFO] BUILD FAILURE
[INFO] ------------------------------------------------------------------------
[INFO] Total time: 1:17.852s
[INFO] Finished at: Tue Sep 06 04:02:58 UTC 2011
[INFO] Final Memory: 28M/110M
[INFO] ------------------------------------------------------------------------
mavenExecutionResult exceptions not empty
message : Failed to execute goal on project apacheds-core-api: Could not resolve dependencies
for project org.apache.directory.server:apacheds-core-api:jar:2.0.0-M4-SNAPSHOT: The following
artifacts could not be resolved: org.apache.directory.shared:shared-ldap-client-api:jar:1.0.0-M8,
org.apache.directory.shared:shared-asn1-api:jar:1.0.0-M8, org.apache.directory.shared:shared-i18n:jar:1.0.0-M8,
org.apache.directory.shared:shared-ldap-codec-standalone:jar:1.0.0-M8, org.apache.directory.shared:shared-ldap-codec-core:jar:1.0.0-M8,
org.apache.directory.shared:shared-ldap-model:jar:1.0.0-M8, org.apache.directory.shared:shared-ldap-schema-data:jar:1.0.0-M8,
org.apache.directory.shared:shared-util:jar:1.0.0-M8, org.apache.directory.shared:shared-ldap-extras-util:jar:1.0.0-M8:
Could not find artifact org.apache.directory.shared:shared-ldap-client-api:jar:1.0.0-M8 in
central (http://repo1.maven.org/maven2)
cause : Could not resolve dependencies for project org.apache.directory.server:apacheds-core-api:jar:2.0.0-M4-SNAPSHOT:
The following artifacts could not be resolved: org.apache.directory.shared:shared-ldap-client-api:jar:1.0.0-M8,
org.apache.directory.shared:shared-asn1-api:jar:1.0.0-M8, org.apache.directory.shared:shared-i18n:jar:1.0.0-M8,
org.apache.directory.shared:shared-ldap-codec-standalone:jar:1.0.0-M8, org.apache.directory.shared:shared-ldap-codec-core:jar:1.0.0-M8,
org.apache.directory.shared:shared-ldap-model:jar:1.0.0-M8, org.apache.directory.shared:shared-ldap-schema-data:jar:1.0.0-M8,
org.apache.directory.shared:shared-util:jar:1.0.0-M8, org.apache.directory.shared:shared-ldap-extras-util:jar:1.0.0-M8:
Could not find artifact org.apache.directory.shared:shared-ldap-client-api:jar:1.0.0-M8 in
central (http://repo1.maven.org/maven2)
Stack trace : 
org.apache.maven.lifecycle.LifecycleExecutionException: Failed to execute goal on project
apacheds-core-api: Could not resolve dependencies for project org.apache.directory.server:apacheds-core-api:jar:2.0.0-M4-SNAPSHOT:
The following artifacts could not be resolved: org.apache.directory.shared:shared-ldap-client-api:jar:1.0.0-M8,
org.apache.directory.shared:shared-asn1-api:jar:1.0.0-M8, org.apache.directory.shared:shared-i18n:jar:1.0.0-M8,
org.apache.directory.shared:shared-ldap-codec-standalone:jar:1.0.0-M8, org.apache.directory.shared:shared-ldap-codec-core:jar:1.0.0-M8,
org.apache.directory.shared:shared-ldap-model:jar:1.0.0-M8, org.apache.directory.shared:shared-ldap-schema-data:jar:1.0.0-M8,
org.apache.directory.shared:shared-util:jar:1.0.0-M8, org.apache.directory.shared:shared-ldap-extras-util:jar:1.0.0-M8:
Could not find artifact org.apache.directory.shared:shared-ldap-client-api:jar:1.0.0-M8 in
central (http://repo1.maven.org/maven2)
	at org.apache.maven.lifecycle.internal.LifecycleDependencyResolver.getDependencies(LifecycleDependencyResolver.java:196)
	at org.apache.maven.lifecycle.internal.LifecycleDependencyResolver.resolveProjectDependencies(LifecycleDependencyResolver.java:108)
	at org.apache.maven.lifecycle.internal.MojoExecutor.ensureDependenciesAreResolved(MojoExecutor.java:258)
	at org.apache.maven.lifecycle.internal.MojoExecutor.execute(MojoExecutor.java:201)
	at org.apache.maven.lifecycle.internal.MojoExecutor.execute(MojoExecutor.java:153)
	at org.apache.maven.lifecycle.internal.MojoExecutor.execute(MojoExecutor.java:145)
	at org.apache.maven.lifecycle.internal.LifecycleModuleBuilder.buildProject(LifecycleModuleBuilder.java:84)
	at org.apache.maven.lifecycle.internal.LifecycleModuleBuilder.buildProject(LifecycleModuleBuilder.java:59)
	at org.apache.maven.lifecycle.internal.LifecycleStarter.singleThreadedBuild(LifecycleStarter.java:183)
	at org.apache.maven.lifecycle.internal.LifecycleStarter.execute(LifecycleStarter.java:161)
	at org.apache.maven.DefaultMaven.doExecute(DefaultMaven.java:319)
	at org.apache.maven.DefaultMaven.execute(DefaultMaven.java:156)
	at org.jvnet.hudson.maven3.launcher.Maven3Launcher.main(Maven3Launcher.java:79)
	at sun.reflect.NativeMethodAccessorImpl.invoke0(Native Method)
	at sun.reflect.NativeMethodAccessorImpl.invoke(NativeMethodAccessorImpl.java:39)
	at sun.reflect.DelegatingMethodAccessorImpl.invoke(DelegatingMethodAccessorImpl.java:25)
	at java.lang.reflect.Method.invoke(Method.java:597)
	at org.codehaus.plexus.classworlds.launcher.Launcher.launchStandard(Launcher.java:329)
	at org.codehaus.plexus.classworlds.launcher.Launcher.launch(Launcher.java:239)
	at org.jvnet.hudson.maven3.agent.Maven3Main.launch(Maven3Main.java:158)
	at hudson.maven.Maven3Builder.call(Maven3Builder.java:121)
	at hudson.maven.Maven3Builder.call(Maven3Builder.java:73)
	at hudson.remoting.UserRequest.perform(UserRequest.java:118)
	at hudson.remoting.UserRequest.perform(UserRequest.java:48)
	at hudson.remoting.Request$2.run(Request.java:287)
	at java.util.concurrent.Executors$RunnableAdapter.call(Executors.java:441)
	at java.util.concurrent.FutureTask$Sync.innerRun(FutureTask.java:303)
	at java.util.concurrent.FutureTask.run(FutureTask.java:138)
	at java.util.concurrent.ThreadPoolExecutor$Worker.runTask(ThreadPoolExecutor.java:886)
	at java.util.concurrent.ThreadPoolExecutor$Worker.run(ThreadPoolExecutor.java:908)
	at java.lang.Thread.run(Thread.java:619)
Caused by: org.apache.maven.project.DependencyResolutionException: Could not resolve dependencies
for project org.apache.directory.server:apacheds-core-api:jar:2.0.0-M4-SNAPSHOT: The following
artifacts could not be resolved: org.apache.directory.shared:shared-ldap-client-api:jar:1.0.0-M8,
org.apache.directory.shared:shared-asn1-api:jar:1.0.0-M8, org.apache.directory.shared:shared-i18n:jar:1.0.0-M8,
org.apache.directory.shared:shared-ldap-codec-standalone:jar:1.0.0-M8, org.apache.directory.shared:shared-ldap-codec-core:jar:1.0.0-M8,
org.apache.directory.shared:shared-ldap-model:jar:1.0.0-M8, org.apache.directory.shared:shared-ldap-schema-data:jar:1.0.0-M8,
org.apache.directory.shared:shared-util:jar:1.0.0-M8, org.apache.directory.shared:shared-ldap-extras-util:jar:1.0.0-M8:
Could not find artifact org.apache.directory.shared:shared-ldap-client-api:jar:1.0.0-M8 in
central (http://repo1.maven.org/maven2)
	at org.apache.maven.project.DefaultProjectDependenciesResolver.resolve(DefaultProjectDependenciesResolver.java:170)
	at org.apache.maven.lifecycle.internal.LifecycleDependencyResolver.getDependencies(LifecycleDependencyResolver.java:171)
	... 30 more
Caused by: org.sonatype.aether.resolution.DependencyResolutionException: The following artifacts
could not be resolved: org.apache.directory.shared:shared-ldap-client-api:jar:1.0.0-M8, org.apache.directory.shared:shared-asn1-api:jar:1.0.0-M8,
org.apache.directory.shared:shared-i18n:jar:1.0.0-M8, org.apache.directory.shared:shared-ldap-codec-standalone:jar:1.0.0-M8,
org.apache.directory.shared:shared-ldap-codec-core:jar:1.0.0-M8, org.apache.directory.shared:shared-ldap-model:jar:1.0.0-M8,
org.apache.directory.shared:shared-ldap-schema-data:jar:1.0.0-M8, org.apache.directory.shared:shared-util:jar:1.0.0-M8,
org.apache.directory.shared:shared-ldap-extras-util:jar:1.0.0-M8: Could not find artifact
org.apache.directory.shared:shared-ldap-client-api:jar:1.0.0-M8 in central (http://repo1.maven.org/maven2)
	at org.sonatype.aether.impl.internal.DefaultRepositorySystem.resolveDependencies(DefaultRepositorySystem.java:412)
	at org.apache.maven.project.DefaultProjectDependenciesResolver.resolve(DefaultProjectDependenciesResolver.java:164)
	... 31 more
Caused by: org.sonatype.aether.resolution.ArtifactResolutionException: The following artifacts
could not be resolved: org.apache.directory.shared:shared-ldap-client-api:jar:1.0.0-M8, org.apache.directory.shared:shared-asn1-api:jar:1.0.0-M8,
org.apache.directory.shared:shared-i18n:jar:1.0.0-M8, org.apache.directory.shared:shared-ldap-codec-standalone:jar:1.0.0-M8,
org.apache.directory.shared:shared-ldap-codec-core:jar:1.0.0-M8, org.apache.directory.shared:shared-ldap-model:jar:1.0.0-M8,
org.apache.directory.shared:shared-ldap-schema-data:jar:1.0.0-M8, org.apache.directory.shared:shared-util:jar:1.0.0-M8,
org.apache.directory.shared:shared-ldap-extras-util:jar:1.0.0-M8: Could not find artifact
org.apache.directory.shared:shared-ldap-client-api:jar:1.0.0-M8 in central (http://repo1.maven.org/maven2)
	at org.sonatype.aether.impl.internal.DefaultArtifactResolver.resolve(DefaultArtifactResolver.java:541)
	at org.sonatype.aether.impl.internal.DefaultArtifactResolver.resolveArtifacts(DefaultArtifactResolver.java:220)
	at org.sonatype.aether.impl.internal.DefaultRepositorySystem.resolveDependencies(DefaultRepositorySystem.java:395)
	... 32 more
Caused by: org.sonatype.aether.transfer.ArtifactNotFoundException: Could not find artifact
org.apache.directory.shared:shared-ldap-client-api:jar:1.0.0-M8 in central (http://repo1.maven.org/maven2)
	at org.sonatype.aether.connector.wagon.WagonRepositoryConnector$4.wrap(WagonRepositoryConnector.java:945)
	at org.sonatype.aether.connector.wagon.WagonRepositoryConnector$4.wrap(WagonRepositoryConnector.java:940)
	at org.sonatype.aether.connector.wagon.WagonRepositoryConnector$GetTask.flush(WagonRepositoryConnector.java:695)
	at org.sonatype.aether.connector.wagon.WagonRepositoryConnector$GetTask.flush(WagonRepositoryConnector.java:689)
	at org.sonatype.aether.connector.wagon.WagonRepositoryConnector.get(WagonRepositoryConnector.java:445)
	at org.sonatype.aether.impl.internal.DefaultArtifactResolver.resolve(DefaultArtifactResolver.java:460)
	... 34 more
Sending e-mails to: notifications@directory.apache.org
channel stopped


Mime
View raw message