directory-notifications mailing list archives

Site index · List index
Message view « Date » · « Thread »
Top « Date » · « Thread »
From Apache Jenkins Server <jenk...@builds.apache.org>
Subject Build failed in Jenkins: dir-studio-jdk16-win #364
Date Tue, 27 Sep 2011 04:02:10 GMT
See <https://builds.apache.org/job/dir-studio-jdk16-win/364/changes>

Changes:

[pamarcelot] Moved to the latest version of the Directory TLP Project pom.

[pamarcelot] Fixed the start of the connection startup listener watchdog.
Fixed the creation of associated connection from the ApacheDS server configuration.

[pamarcelot] Fixed wrong space.

[pamarcelot] Fixed wrong space.

------------------------------------------
Started by timer
Building remotely on windows1
Updating https://svn.apache.org/repos/asf/directory/studio/trunk
U         plugins\ldapservers.apacheds.v200\src\main\java\org\apache\directory\studio\ldapservers\apacheds\v200\CreateConnectionAction.java
U         plugins\ldapservers.apacheds.v200\src\main\java\org\apache\directory\studio\ldapservers\apacheds\v200\messages.properties
U         plugins\ldapservers.apacheds.v200\src\main\java\org\apache\directory\studio\ldapservers\apacheds\v200\ApacheDS200LdapServerAdapter.java
U         plugins\ldapservers.apacheds.v200\src\main\java\org\apache\directory\studio\ldapservers\apacheds\v200\messages_fr.properties
U         plugins\ldapservers.apacheds.v200\src\main\java\org\apache\directory\studio\ldapservers\apacheds\v200\messages_de.properties
U         plugins\ldapservers.apacheds.v200\pom.xml
U         plugins\apacheds\src\main\java\org\apache\directory\studio\apacheds\jobs\messages.properties
U         plugins\apacheds\src\main\java\org\apache\directory\studio\apacheds\jobs\messages_fr.properties
U         plugins\apacheds\src\main\java\org\apache\directory\studio\apacheds\jobs\messages_de.properties
U         pom.xml
At revision 1176188
Parsing POMs
Failed to transfer File: ${project.basedir}\org\apache\directory\project\project\24-SNAPSHOT\maven-metadata.xml
does not exist
Failed to transfer File: ${project.basedir}\org\apache\directory\project\project\24-SNAPSHOT\project-24-SNAPSHOT.pom
does not exist
ERROR: Failed to parse POMs
hudson.util.IOException2: remote file operation failed: <https://builds.apache.org/job/dir-studio-jdk16-win/ws/trunk>
at hudson.remoting.Channel@22f653c4:windows1
	at hudson.FilePath.act(FilePath.java:754)
	at hudson.FilePath.act(FilePath.java:740)
	at hudson.maven.MavenModuleSetBuild$RunnerImpl.parsePoms(MavenModuleSetBuild.java:869)
	at hudson.maven.MavenModuleSetBuild$RunnerImpl.doRun(MavenModuleSetBuild.java:639)
	at hudson.model.AbstractBuild$AbstractRunner.run(AbstractBuild.java:459)
	at hudson.model.Run.run(Run.java:1376)
	at hudson.maven.MavenModuleSetBuild.run(MavenModuleSetBuild.java:474)
	at hudson.model.ResourceController.execute(ResourceController.java:88)
	at hudson.model.Executor.run(Executor.java:230)
Caused by: hudson.remoting.ProxyException: hudson.maven.MavenModuleSetBuild$MavenExecutionException:
org.apache.maven.project.ProjectBuildingException: Some problems were encountered while processing
the POMs:
[FATAL] Non-resolvable parent POM: Could not find artifact org.apache.directory.project:project:pom:24-SNAPSHOT
in studio.repository (file://${project.basedir}) and 'parent.relativePath' points at no local
POM @ line 23, column 11

	at hudson.maven.MavenModuleSetBuild$PomParser.invoke(MavenModuleSetBuild.java:1403)
	at hudson.maven.MavenModuleSetBuild$PomParser.invoke(MavenModuleSetBuild.java:1182)
	at hudson.FilePath$FileCallableWrapper.call(FilePath.java:1995)
	at hudson.remoting.UserRequest.perform(UserRequest.java:118)
	at hudson.remoting.UserRequest.perform(UserRequest.java:48)
	at hudson.remoting.Request$2.run(Request.java:287)
	at java.util.concurrent.Executors$RunnableAdapter.call(Unknown Source)
	at java.util.concurrent.FutureTask$Sync.innerRun(Unknown Source)
	at java.util.concurrent.FutureTask.run(Unknown Source)
	at java.util.concurrent.ThreadPoolExecutor.runWorker(Unknown Source)
	at java.util.concurrent.ThreadPoolExecutor$Worker.run(Unknown Source)
	at hudson.remoting.Engine$1$1.run(Engine.java:60)
	at java.lang.Thread.run(Unknown Source)
Caused by: hudson.remoting.ProxyException: org.apache.maven.project.ProjectBuildingException:
Some problems were encountered while processing the POMs:
[FATAL] Non-resolvable parent POM: Could not find artifact org.apache.directory.project:project:pom:24-SNAPSHOT
in studio.repository (file://${project.basedir}) and 'parent.relativePath' points at no local
POM @ line 23, column 11

	at org.apache.maven.project.DefaultProjectBuilder.build(DefaultProjectBuilder.java:339)
	at hudson.maven.MavenEmbedder.buildProjects(MavenEmbedder.java:360)
	at hudson.maven.MavenEmbedder.readProjects(MavenEmbedder.java:330)
	at hudson.maven.MavenModuleSetBuild$PomParser.invoke(MavenModuleSetBuild.java:1353)
	... 12 more


Mime
View raw message