directory-notifications mailing list archives

Site index · List index
Message view « Date » · « Thread »
Top « Date » · « Thread »
From Apache Jenkins Server <jenk...@builds.apache.org>
Subject Build failed in Jenkins: dir-studio-jdk16-ubuntu-deploy #342
Date Sun, 24 Jul 2011 04:09:53 GMT
See <https://builds.apache.org/job/dir-studio-jdk16-ubuntu-deploy/342/>

------------------------------------------
[...truncated 12652 lines...]
Downloading: https://repository.apache.org/content/repositories/snapshots/org/apache/directory/studio/apacheds-launcher/maven-metadata.xml
Downloaded: https://repository.apache.org/content/repositories/snapshots/org/apache/directory/studio/apacheds-launcher/maven-metadata.xml
(484 B at 6.6 KB/sec)
Uploading: https://repository.apache.org/content/repositories/snapshots/org/apache/directory/studio/apacheds-launcher/2.0.0-SNAPSHOT/maven-metadata.xml
Uploaded: https://repository.apache.org/content/repositories/snapshots/org/apache/directory/studio/apacheds-launcher/2.0.0-SNAPSHOT/maven-metadata.xml
(800 B at 8.5 KB/sec)
Uploading: https://repository.apache.org/content/repositories/snapshots/org/apache/directory/studio/apacheds-launcher/maven-metadata.xml
Uploaded: https://repository.apache.org/content/repositories/snapshots/org/apache/directory/studio/apacheds-launcher/maven-metadata.xml
(484 B at 8.3 KB/sec)
projectSucceeded org.apache.directory.studio:apacheds-launcher:2.0.0-SNAPSHOT
[JENKINS] Archiving <https://builds.apache.org/job/dir-studio-jdk16-ubuntu-deploy/ws/trunk/plugins/apacheds-launcher/pom.xml>
to /home/hudson/hudson/jobs/dir-studio-jdk16-ubuntu-deploy/modules/org.apache.directory.studio$apacheds-launcher/builds/2011-07-24_04-03-09/archive/org.apache.directory.studio/apacheds-launcher/2.0.0-SNAPSHOT/apacheds-launcher-2.0.0-SNAPSHOT.pom
[JENKINS] Archiving <https://builds.apache.org/job/dir-studio-jdk16-ubuntu-deploy/ws/trunk/plugins/apacheds-launcher/target/apacheds-launcher-2.0.0-SNAPSHOT.jar>
to /home/hudson/hudson/jobs/dir-studio-jdk16-ubuntu-deploy/modules/org.apache.directory.studio$apacheds-launcher/builds/2011-07-24_04-03-09/archive/org.apache.directory.studio/apacheds-launcher/2.0.0-20110724.040215-261/apacheds-launcher-2.0.0-20110724.040215-261.jar
[INFO]                                                                         
[INFO] ------------------------------------------------------------------------
[INFO] Building Apache Directory Studio Apache DS 2.0 Configuration 2.0.0-SNAPSHOT
[INFO] ------------------------------------------------------------------------
[INFO] [INFO] Deleting <https://builds.apache.org/job/dir-studio-jdk16-ubuntu-deploy/ws/trunk/plugins/apacheds.configuration.v2/target>

[INFO] --- maven-clean-plugin:2.4.1:clean (default-clean) @ apacheds.configuration.v2 ---
[INFO] Downloading: file://<https://builds.apache.org/job/dir-studio-jdk16-ubuntu-deploy/ws/trunk/plugins/apacheds.configuration.v2/org/apache/directory/shared/shared-ldap-parent/1.0.0-M6-SNAPSHOT/maven-metadata.xml>
Downloading: http://repository.apache.org/snapshots/org/apache/directory/shared/shared-ldap-parent/1.0.0-M6-SNAPSHOT/maven-metadata.xml

[INFO] --- maven-remote-resources-plugin:1.2:process (default) @ apacheds.configuration.v2
---
Downloaded: http://repository.apache.org/snapshots/org/apache/directory/shared/shared-ldap-parent/1.0.0-M6-SNAPSHOT/maven-metadata.xml
(630 B at 29.3 KB/sec)
Downloading: file://<https://builds.apache.org/job/dir-studio-jdk16-ubuntu-deploy/ws/trunk/plugins/apacheds.configuration.v2/org/apache/directory/shared/shared-parent/1.0.0-M6-SNAPSHOT/maven-metadata.xml>
Downloading: http://repository.apache.org/snapshots/org/apache/directory/shared/shared-parent/1.0.0-M6-SNAPSHOT/maven-metadata.xml
Downloaded: http://repository.apache.org/snapshots/org/apache/directory/shared/shared-parent/1.0.0-M6-SNAPSHOT/maven-metadata.xml
(625 B at 30.5 KB/sec)
Downloading: file://<https://builds.apache.org/job/dir-studio-jdk16-ubuntu-deploy/ws/trunk/plugins/apacheds.configuration.v2/org/apache/directory/shared/shared-util/1.0.0-M6-SNAPSHOT/maven-metadata.xml>
Downloading: http://repository.apache.org/snapshots/org/apache/directory/shared/shared-util/1.0.0-M6-SNAPSHOT/maven-metadata.xml
Downloaded: http://repository.apache.org/snapshots/org/apache/directory/shared/shared-util/1.0.0-M6-SNAPSHOT/maven-metadata.xml
(800 B at 43.4 KB/sec)
Downloading: file://<https://builds.apache.org/job/dir-studio-jdk16-ubuntu-deploy/ws/trunk/plugins/apacheds.configuration.v2/org/apache/directory/shared/shared-i18n/1.0.0-M6-SNAPSHOT/maven-metadata.xml>
Downloading: http://repository.apache.org/snapshots/org/apache/directory/shared/shared-i18n/1.0.0-M6-SNAPSHOT/maven-metadata.xml
Downloaded: http://repository.apache.org/snapshots/org/apache/directory/shared/shared-i18n/1.0.0-M6-SNAPSHOT/maven-metadata.xml
(800 B at 43.4 KB/sec)
Downloading: file://<https://builds.apache.org/job/dir-studio-jdk16-ubuntu-deploy/ws/trunk/plugins/apacheds.configuration.v2/org/apache/directory/shared/shared-asn1-api/1.0.0-M6-SNAPSHOT/maven-metadata.xml>
Downloading: http://repository.apache.org/snapshots/org/apache/directory/shared/shared-asn1-api/1.0.0-M6-SNAPSHOT/maven-metadata.xml
Downloaded: http://repository.apache.org/snapshots/org/apache/directory/shared/shared-asn1-api/1.0.0-M6-SNAPSHOT/maven-metadata.xml
(804 B at 43.6 KB/sec)
Downloading: file://<https://builds.apache.org/job/dir-studio-jdk16-ubuntu-deploy/ws/trunk/plugins/apacheds.configuration.v2/org/apache/directory/shared/shared-asn1-parent/1.0.0-M6-SNAPSHOT/maven-metadata.xml>
Downloading: http://repository.apache.org/snapshots/org/apache/directory/shared/shared-asn1-parent/1.0.0-M6-SNAPSHOT/maven-metadata.xml
Downloaded: http://repository.apache.org/snapshots/org/apache/directory/shared/shared-asn1-parent/1.0.0-M6-SNAPSHOT/maven-metadata.xml
(630 B at 32.4 KB/sec)
Downloading: http://repository.apache.org/snapshots/org/apache/directory/shared/shared-asn1-ber/1.0.0-M6-SNAPSHOT/maven-metadata.xml
Downloading: file://<https://builds.apache.org/job/dir-studio-jdk16-ubuntu-deploy/ws/trunk/plugins/apacheds.configuration.v2/org/apache/directory/shared/shared-asn1-ber/1.0.0-M6-SNAPSHOT/maven-metadata.xml>
Downloaded: http://repository.apache.org/snapshots/org/apache/directory/shared/shared-asn1-ber/1.0.0-M6-SNAPSHOT/maven-metadata.xml
(804 B at 41.3 KB/sec)
Downloading: file://<https://builds.apache.org/job/dir-studio-jdk16-ubuntu-deploy/ws/trunk/plugins/apacheds.configuration.v2/org/apache/directory/shared/shared-ldap-schema-parent/1.0.0-M6-SNAPSHOT/maven-metadata.xml>
Downloading: http://repository.apache.org/snapshots/org/apache/directory/shared/shared-ldap-schema-parent/1.0.0-M6-SNAPSHOT/maven-metadata.xml
Downloaded: http://repository.apache.org/snapshots/org/apache/directory/shared/shared-ldap-schema-parent/1.0.0-M6-SNAPSHOT/maven-metadata.xml
(637 B at 34.6 KB/sec)
Downloading: file://<https://builds.apache.org/job/dir-studio-jdk16-ubuntu-deploy/ws/trunk/plugins/apacheds.configuration.v2/org/apache/directory/shared/shared-ldap-extras-aci/1.0.0-M6-SNAPSHOT/maven-metadata.xml>
Downloading: http://repository.apache.org/snapshots/org/apache/directory/shared/shared-ldap-extras-aci/1.0.0-M6-SNAPSHOT/maven-metadata.xml
Downloaded: http://repository.apache.org/snapshots/org/apache/directory/shared/shared-ldap-extras-aci/1.0.0-M6-SNAPSHOT/maven-metadata.xml
(811 B at 39.6 KB/sec)
Downloading: file://<https://builds.apache.org/job/dir-studio-jdk16-ubuntu-deploy/ws/trunk/plugins/apacheds.configuration.v2/org/apache/directory/shared/shared-ldap-extras-parent/1.0.0-M6-SNAPSHOT/maven-metadata.xml>
Downloading: http://repository.apache.org/snapshots/org/apache/directory/shared/shared-ldap-extras-parent/1.0.0-M6-SNAPSHOT/maven-metadata.xml
Downloaded: http://repository.apache.org/snapshots/org/apache/directory/shared/shared-ldap-extras-parent/1.0.0-M6-SNAPSHOT/maven-metadata.xml
(637 B at 34.6 KB/sec)
Downloading: file://<https://builds.apache.org/job/dir-studio-jdk16-ubuntu-deploy/ws/trunk/plugins/apacheds.configuration.v2/org/apache/directory/shared/shared-ldap-model/1.0.0-M6-SNAPSHOT/maven-metadata.xml>
Downloading: http://repository.apache.org/snapshots/org/apache/directory/shared/shared-ldap-model/1.0.0-M6-SNAPSHOT/maven-metadata.xml
Downloaded: http://repository.apache.org/snapshots/org/apache/directory/shared/shared-ldap-model/1.0.0-M6-SNAPSHOT/maven-metadata.xml
(806 B at 49.2 KB/sec)
Downloading: file://<https://builds.apache.org/job/dir-studio-jdk16-ubuntu-deploy/ws/trunk/plugins/apacheds.configuration.v2/org/apache/directory/server/apacheds-core-api/2.0.0-M2-SNAPSHOT/maven-metadata.xml>
Downloading: http://repository.apache.org/snapshots/org/apache/directory/server/apacheds-core-api/2.0.0-M2-SNAPSHOT/maven-metadata.xml
Downloaded: http://repository.apache.org/snapshots/org/apache/directory/server/apacheds-core-api/2.0.0-M2-SNAPSHOT/maven-metadata.xml
(2 KB at 46.6 KB/sec)
Downloading: file://<https://builds.apache.org/job/dir-studio-jdk16-ubuntu-deploy/ws/trunk/plugins/apacheds.configuration.v2/org/apache/directory/server/apacheds-parent/2.0.0-M2-SNAPSHOT/maven-metadata.xml>
Downloading: http://repository.apache.org/snapshots/org/apache/directory/server/apacheds-parent/2.0.0-M2-SNAPSHOT/maven-metadata.xml
Downloaded: http://repository.apache.org/snapshots/org/apache/directory/server/apacheds-parent/2.0.0-M2-SNAPSHOT/maven-metadata.xml
(627 B at 32.2 KB/sec)
Downloading: file://<https://builds.apache.org/job/dir-studio-jdk16-ubuntu-deploy/ws/trunk/plugins/apacheds.configuration.v2/org/apache/directory/server/apacheds-server-config/2.0.0-M2-SNAPSHOT/maven-metadata.xml>
Downloading: http://repository.apache.org/snapshots/org/apache/directory/server/apacheds-server-config/2.0.0-M2-SNAPSHOT/maven-metadata.xml
Downloaded: http://repository.apache.org/snapshots/org/apache/directory/server/apacheds-server-config/2.0.0-M2-SNAPSHOT/maven-metadata.xml
(811 B at 39.6 KB/sec)
Downloading: file://<https://builds.apache.org/job/dir-studio-jdk16-ubuntu-deploy/ws/trunk/plugins/apacheds.configuration.v2/org/apache/directory/server/apacheds-ldif-partition/2.0.0-M2-SNAPSHOT/maven-metadata.xml>
Downloading: http://repository.apache.org/snapshots/org/apache/directory/server/apacheds-ldif-partition/2.0.0-M2-SNAPSHOT/maven-metadata.xml
Downloaded: http://repository.apache.org/snapshots/org/apache/directory/server/apacheds-ldif-partition/2.0.0-M2-SNAPSHOT/maven-metadata.xml
(2 KB at 50.3 KB/sec)
Downloading: file://<https://builds.apache.org/job/dir-studio-jdk16-ubuntu-deploy/ws/trunk/plugins/apacheds.configuration.v2/org/apache/directory/server/apacheds-xdbm-partition/2.0.0-M2-SNAPSHOT/maven-metadata.xml>
Downloading: http://repository.apache.org/snapshots/org/apache/directory/server/apacheds-xdbm-partition/2.0.0-M2-SNAPSHOT/maven-metadata.xml
Downloaded: http://repository.apache.org/snapshots/org/apache/directory/server/apacheds-xdbm-partition/2.0.0-M2-SNAPSHOT/maven-metadata.xml
(2 KB at 59.1 KB/sec)
[debug] execute contextualize
[INFO] [INFO] Using 'UTF-8' encoding to copy filtered resources.
[INFO] Copying 2 resources

[INFO] Copying 6 resources to resources
[INFO] --- maven-resources-plugin:2.5:resources (default-resources) @ apacheds.configuration.v2
---
[INFO] Copying 1 resource
[INFO] Copying 3 resources
[INFO] Copying 3 resources
Downloading: file://<https://builds.apache.org/job/dir-studio-jdk16-ubuntu-deploy/ws/trunk/plugins/ldapbrowser.ui/org/apache/directory/studio/ldifeditor/2.0.0-SNAPSHOT/maven-metadata.xml>
Downloading: http://repository.apache.org/snapshots/org/apache/directory/studio/ldifeditor/2.0.0-SNAPSHOT/maven-metadata.xml
Downloaded: http://repository.apache.org/snapshots/org/apache/directory/studio/ldifeditor/2.0.0-SNAPSHOT/maven-metadata.xml
(793 B at 38.7 KB/sec)
Downloading: file://<https://builds.apache.org/job/dir-studio-jdk16-ubuntu-deploy/ws/trunk/plugins/ldapservers.apacheds.v153/org/apache/directory/studio/ldapservers/2.0.0-SNAPSHOT/maven-metadata.xml>
Downloading: http://repository.apache.org/snapshots/org/apache/directory/studio/ldapservers/2.0.0-SNAPSHOT/maven-metadata.xml
Downloaded: http://repository.apache.org/snapshots/org/apache/directory/studio/ldapservers/2.0.0-SNAPSHOT/maven-metadata.xml
(794 B at 40.8 KB/sec)
Downloading: file://<https://builds.apache.org/job/dir-studio-jdk16-ubuntu-deploy/ws/trunk/plugins/ldapservers.apacheds.v154/org/apache/directory/studio/ldapservers/2.0.0-SNAPSHOT/maven-metadata.xml>
Downloading: http://repository.apache.org/snapshots/org/apache/directory/studio/ldapservers/2.0.0-SNAPSHOT/maven-metadata.xml
Downloaded: http://repository.apache.org/snapshots/org/apache/directory/studio/ldapservers/2.0.0-SNAPSHOT/maven-metadata.xml
(794 B at 48.5 KB/sec)
Downloading: file://<https://builds.apache.org/job/dir-studio-jdk16-ubuntu-deploy/ws/trunk/plugins/ldapservers.apacheds.v155/org/apache/directory/studio/ldapservers/2.0.0-SNAPSHOT/maven-metadata.xml>
Downloading: http://repository.apache.org/snapshots/org/apache/directory/studio/ldapservers/2.0.0-SNAPSHOT/maven-metadata.xml
Downloaded: http://repository.apache.org/snapshots/org/apache/directory/studio/ldapservers/2.0.0-SNAPSHOT/maven-metadata.xml
(794 B at 45.6 KB/sec)
Downloading: file://<https://builds.apache.org/job/dir-studio-jdk16-ubuntu-deploy/ws/trunk/plugins/ldapservers.apacheds.v156/org/apache/directory/studio/ldapservers/2.0.0-SNAPSHOT/maven-metadata.xml>
Downloading: http://repository.apache.org/snapshots/org/apache/directory/studio/ldapservers/2.0.0-SNAPSHOT/maven-metadata.xml
Downloaded: http://repository.apache.org/snapshots/org/apache/directory/studio/ldapservers/2.0.0-SNAPSHOT/maven-metadata.xml
(794 B at 40.8 KB/sec)
Downloading: file://<https://builds.apache.org/job/dir-studio-jdk16-ubuntu-deploy/ws/trunk/plugins/ldapservers.apacheds.v157/org/apache/directory/studio/ldapservers/2.0.0-SNAPSHOT/maven-metadata.xml>
Downloading: http://repository.apache.org/snapshots/org/apache/directory/studio/ldapservers/2.0.0-SNAPSHOT/maven-metadata.xml
Downloaded: http://repository.apache.org/snapshots/org/apache/directory/studio/ldapservers/2.0.0-SNAPSHOT/maven-metadata.xml
(794 B at 43.1 KB/sec)
[INFO] 
[INFO] --- studio-maven-plugin:1.0.4:prepare-jar-package (default) @ apacheds.configuration.v2
---
[INFO] 
[INFO] --- maven-compiler-plugin:2.3.2:compile (default-compile) @ apacheds.configuration.v2
---
[INFO] Compiling 29 source files to <https://builds.apache.org/job/dir-studio-jdk16-ubuntu-deploy/ws/trunk/plugins/apacheds.configuration.v2/target/classes>
[INFO] -------------------------------------------------------------
[ERROR] COMPILATION ERROR : 
[INFO] -------------------------------------------------------------
[ERROR] <https://builds.apache.org/job/dir-studio-jdk16-ubuntu-deploy/ws/trunk/plugins/apacheds.configuration.v2/src/main/java/org/apache/directory/studio/apacheds/configuration/v2/jobs/LoadConfigurationRunnable.java>:[335,42]
cannot find symbol
symbol  : method setContextEntry(org.apache.directory.shared.ldap.model.entry.Entry)
location: class org.apache.directory.studio.apacheds.configuration.v2.jobs.EntryBasedConfigurationPartition
[INFO] 1 error
[INFO] -------------------------------------------------------------
mojoFailed org.apache.maven.plugins:maven-compiler-plugin:2.3.2(default-compile)
projectFailed org.apache.directory.studio:apacheds.configuration.v2:2.0.0-SNAPSHOT
[JENKINS] Archiving <https://builds.apache.org/job/dir-studio-jdk16-ubuntu-deploy/ws/trunk/plugins/apacheds.configuration.v2/pom.xml>
to /home/hudson/hudson/jobs/dir-studio-jdk16-ubuntu-deploy/modules/org.apache.directory.studio$apacheds.configuration.v2/builds/2011-07-24_04-03-09/archive/org.apache.directory.studio/apacheds.configuration.v2/2.0.0-SNAPSHOT/apacheds.configuration.v2-2.0.0-SNAPSHOT.pom
sessionEnded
[INFO] ------------------------------------------------------------------------
[INFO] Reactor Summary:
[INFO] 
[INFO] Apache Directory Studio ........................... SUCCESS [22.251s]
[INFO] Apache Directory Studio Repository ................ SUCCESS [4.849s]
[INFO] Apache Directory Studio Libraries Plugins ......... SUCCESS [0.684s]
[INFO] SLF4J API Module (for Apache Directory Studio) .... SUCCESS [15.574s]
[INFO] Ehcache Core (for Apache Directory Studio) ........ SUCCESS [4.340s]
[INFO] AntLR Parser Generator (for Apache Directory Studio)  SUCCESS [8.102s]
[INFO] Apache Commons Codec (for Apache Directory Studio)  SUCCESS [6.991s]
[INFO] Apache Commons Collections (for Apache Directory Studio)  SUCCESS [7.994s]
[INFO] Apache Commons IO (for Apache Directory Studio) ... SUCCESS [7.944s]
[INFO] Apache Commons Lang (for Apache Directory Studio) . SUCCESS [6.038s]
[INFO] Apache Commons Logging (for Apache Directory Studio)  SUCCESS [6.208s]
[INFO] Apache Commons Pool (for Apache Directory Studio) . SUCCESS [4.551s]
[INFO] ApacheDS Core Constants (for Apache Directory Studio)  SUCCESS [5.392s]
[INFO] ApacheDS I18n (for Apache Directory Studio) ....... SUCCESS [4.596s]
[INFO] ApacheDS Core API (for Apache Directory Studio) ... SUCCESS [6.849s]
[INFO] ApacheDS Core AVL (for Apache Directory Studio) ... SUCCESS [6.825s]
[INFO] ApacheDS Generalized (X) DBM Partition (for Apache Directory Studio)  SUCCESS [7.083s]
[INFO] ApacheDS Server Config (for Apache Directory Studio)  SUCCESS [7.091s]
[INFO] Legion of the Bouncy Castle Java Cryptography APIs (for Apache Directory Studio)  SUCCESS
[6.190s]
[INFO] ApacheDS Core (for Apache Directory Studio) ....... SUCCESS [7.513s]
[INFO] ApacheDS LDIF Partition (for Apache Directory Studio)  SUCCESS [7.000s]
[INFO] Apache HttpComponents Core (for Apache Directory Studio)  SUCCESS [5.256s]
[INFO] Apache HttpComponents Client (for Apache Directory Studio)  SUCCESS [4.930s]
[INFO] Log4j (for Apache Directory Studio) ............... SUCCESS [5.013s]
[INFO] Apache MINA Core (for Apache Directory Studio) .... SUCCESS [5.242s]
[INFO] dom4j (for Apache Directory Studio) ............... SUCCESS [4.294s]
[INFO] SLF4J LOG4J-12 Binding (for Apache Directory Studio)  SUCCESS [3.253s]
[INFO] XPP3 (for Apache Directory Studio) ................ SUCCESS [3.277s]
[INFO] Apache Directory Studio Plugins ................... SUCCESS [3.891s]
[INFO] Apache Directory Studio Common UI ................. SUCCESS [5.655s]
[INFO] Apache Directory Studio Common Core ............... SUCCESS [4.801s]
[INFO] Apache Directory Studio LDIF Parser ............... SUCCESS [7.445s]
[INFO] Apache Directory Studio Connection Core ........... SUCCESS [6.437s]
[INFO] Apache Directory Studio Connection UI ............. SUCCESS [4.624s]
[INFO] Apache Directory Studio LDAP Browser Core ......... SUCCESS [8.551s]
[INFO] Apache Directory Studio LDAP Browser Common ....... SUCCESS [6.274s]
[INFO] Apache Directory Studio Value Editors ............. SUCCESS [4.468s]
[INFO] Apache Directory Studio ACI Item Editor ........... SUCCESS [5.320s]
[INFO] Apache Directory Studio Apache DS Configuration ... SUCCESS [7.131s]
[INFO] Apache Directory Studio Apache DS ................. SUCCESS [10.712s]
[INFO] Apache Directory Studio Apache DS Launcher ........ SUCCESS [4.545s]
[INFO] Apache Directory Studio Apache DS 2.0 Configuration  FAILURE [2.794s]
[INFO] Apache Directory Studio LDIF Editor ............... SKIPPED
[INFO] Apache Directory Studio LDAP Browser UI ........... SKIPPED
[INFO] Apache Directory Studio LDAP Servers .............. SKIPPED
[INFO] Apache Directory Studio ApacheDS 1.5.3 LDAP Server Adapter  SKIPPED
[INFO] Apache Directory Studio ApacheDS 1.5.4 LDAP Server Adapter  SKIPPED
[INFO] Apache Directory Studio ApacheDS 1.5.5 LDAP Server Adapter  SKIPPED
[INFO] Apache Directory Studio ApacheDS 1.5.6 LDAP Server Adapter  SKIPPED
[INFO] Apache Directory Studio ApacheDS 1.5.7 LDAP Server Adapter  SKIPPED
[INFO] Apache Directory Studio RCP ....................... SKIPPED
[INFO] Apache Directory Studio Schema Editor ............. SKIPPED
[INFO] Apache Directory Studio Apache DS Help ............ SKIPPED
[INFO] Apache Directory Studio Apache DS Configuration Help  SKIPPED
[INFO] Apache Directory Studio LDAP Browser Help ......... SKIPPED
[INFO] Apache Directory Studio LDIF Editor Help .......... SKIPPED
[INFO] Apache Directory Studio RCP Help .................. SKIPPED
[INFO] Apache Directory Studio Schema Editor Help ........ SKIPPED
[INFO] Apache Directory Studio Help Plugins .............. SKIPPED
[INFO] Apache Directory Studio Feature Plugins ........... SKIPPED
[INFO] Apache Directory Studio Apache DS Configuration Feature  SKIPPED
[INFO] Apache Directory Studio Apache DS Feature ......... SKIPPED
[INFO] Apache Directory Studio LDAP Browser Feature ...... SKIPPED
[INFO] Apache Directory Studio LDIF Editor Feature ....... SKIPPED
[INFO] Apache Directory Studio RCP Feature ............... SKIPPED
[INFO] Apache Directory Studio Schema Editor Feature ..... SKIPPED
[INFO] Apache Directory Studio Application ............... SKIPPED
[INFO] Apache Directory Studio Application Plugins ....... SKIPPED
[INFO] Apache Directory Studio Application Features ...... SKIPPED
[INFO] Apache Directory Studio Application Eclipse Plugins  SKIPPED
[INFO] ------------------------------------------------------------------------
[INFO] BUILD FAILURE
[INFO] ------------------------------------------------------------------------
[INFO] Total time: 6:39.226s
[INFO] Finished at: Sun Jul 24 04:02:19 UTC 2011
[INFO] [WARNING] The requested profile "studio-full" could not be activated because it does
not exist.
Final Memory: 143M/353M
[INFO] ------------------------------------------------------------------------
maven builder waiting
mavenExecutionResult exceptions not empty
message : Failed to execute goal org.apache.maven.plugins:maven-compiler-plugin:2.3.2:compile
(default-compile) on project apacheds.configuration.v2: Compilation failure
<https://builds.apache.org/job/dir-studio-jdk16-ubuntu-deploy/ws/trunk/plugins/apacheds.configuration.v2/src/main/java/org/apache/directory/studio/apacheds/configuration/v2/jobs/LoadConfigurationRunnable.java>:[335,42]
cannot find symbol
symbol  : method setContextEntry(org.apache.directory.shared.ldap.model.entry.Entry)
location: class org.apache.directory.studio.apacheds.configuration.v2.jobs.EntryBasedConfigurationPartition

cause : Compilation failure
<https://builds.apache.org/job/dir-studio-jdk16-ubuntu-deploy/ws/trunk/plugins/apacheds.configuration.v2/src/main/java/org/apache/directory/studio/apacheds/configuration/v2/jobs/LoadConfigurationRunnable.java>:[335,42]
cannot find symbol
symbol  : method setContextEntry(org.apache.directory.shared.ldap.model.entry.Entry)
location: class org.apache.directory.studio.apacheds.configuration.v2.jobs.EntryBasedConfigurationPartition

Stack trace : 
org.apache.maven.lifecycle.LifecycleExecutionException: Failed to execute goal org.apache.maven.plugins:maven-compiler-plugin:2.3.2:compile
(default-compile) on project apacheds.configuration.v2: Compilation failure
<https://builds.apache.org/job/dir-studio-jdk16-ubuntu-deploy/ws/trunk/plugins/apacheds.configuration.v2/src/main/java/org/apache/directory/studio/apacheds/configuration/v2/jobs/LoadConfigurationRunnable.java>:[335,42]
cannot find symbol
symbol  : method setContextEntry(org.apache.directory.shared.ldap.model.entry.Entry)
location: class org.apache.directory.studio.apacheds.configuration.v2.jobs.EntryBasedConfigurationPartition

	at org.apache.maven.lifecycle.internal.MojoExecutor.execute(MojoExecutor.java:213)
	at org.apache.maven.lifecycle.internal.MojoExecutor.execute(MojoExecutor.java:153)
	at org.apache.maven.lifecycle.internal.MojoExecutor.execute(MojoExecutor.java:145)
	at org.apache.maven.lifecycle.internal.LifecycleModuleBuilder.buildProject(LifecycleModuleBuilder.java:84)
	at org.apache.maven.lifecycle.internal.LifecycleModuleBuilder.buildProject(LifecycleModuleBuilder.java:59)
	at org.apache.maven.lifecycle.internal.LifecycleStarter.singleThreadedBuild(LifecycleStarter.java:183)
	at org.apache.maven.lifecycle.internal.LifecycleStarter.execute(LifecycleStarter.java:161)
	at org.apache.maven.DefaultMaven.doExecute(DefaultMaven.java:319)
	at org.apache.maven.DefaultMaven.execute(DefaultMaven.java:156)
	at org.jvnet.hudson.maven3.launcher.Maven3Launcher.main(Maven3Launcher.java:79)
	at sun.reflect.NativeMethodAccessorImpl.invoke0(Native Method)
	at sun.reflect.NativeMethodAccessorImpl.invoke(NativeMethodAccessorImpl.java:39)
	at sun.reflect.DelegatingMethodAccessorImpl.invoke(DelegatingMethodAccessorImpl.java:25)
	at java.lang.reflect.Method.invoke(Method.java:597)
	at org.codehaus.plexus.classworlds.launcher.Launcher.launchStandard(Launcher.java:329)
	at org.codehaus.plexus.classworlds.launcher.Launcher.launch(Launcher.java:239)
	at org.jvnet.hudson.maven3.agent.Maven3Main.launch(Maven3Main.java:158)
	at hudson.maven.Maven3Builder.call(Maven3Builder.java:128)
	at hudson.maven.Maven3Builder.call(Maven3Builder.java:75)
	at hudson.remoting.UserRequest.perform(UserRequest.java:118)
	at hudson.remoting.UserRequest.perform(UserRequest.java:48)
	at hudson.remoting.Request$2.run(Request.java:270)
	at java.util.concurrent.Executors$RunnableAdapter.call(Executors.java:441)
	at java.util.concurrent.FutureTask$Sync.innerRun(FutureTask.java:303)
	at java.util.concurrent.FutureTask.run(FutureTask.java:138)
	at java.util.concurrent.ThreadPoolExecutor$Worker.runTask(ThreadPoolExecutor.java:886)
	at java.util.concurrent.ThreadPoolExecutor$Worker.run(ThreadPoolExecutor.java:908)
	at java.lang.Thread.run(Thread.java:619)
Caused by: org.apache.maven.plugin.CompilationFailureException: Compilation failure
<https://builds.apache.org/job/dir-studio-jdk16-ubuntu-deploy/ws/trunk/plugins/apacheds.configuration.v2/src/main/java/org/apache/directory/studio/apacheds/configuration/v2/jobs/LoadConfigurationRunnable.java>:[335,42]
cannot find symbol
symbol  : method setContextEntry(org.apache.directory.shared.ldap.model.entry.Entry)
location: class org.apache.directory.studio.apacheds.configuration.v2.jobs.EntryBasedConfigurationPartition

	at org.apache.maven.plugin.AbstractCompilerMojo.execute(AbstractCompilerMojo.java:656)
	at org.apache.maven.plugin.CompilerMojo.execute(CompilerMojo.java:128)
	at org.apache.maven.plugin.DefaultBuildPluginManager.executeMojo(DefaultBuildPluginManager.java:101)
	at org.apache.maven.lifecycle.internal.MojoExecutor.execute(MojoExecutor.java:209)
	... 27 more
Sending e-mails to: notifications@directory.apache.org
channel stopped


Mime
View raw message