directory-notifications mailing list archives

Site index · List index
Message view « Date » · « Thread »
Top « Date » · « Thread »
From Apache Jenkins Server <jenk...@builds.apache.org>
Subject Build failed in Jenkins: dir-apacheds-jdk16-ubuntu-deploy » ApacheDS Server Integration #342
Date Sat, 30 Jul 2011 04:14:46 GMT
See <https://builds.apache.org/job/dir-apacheds-jdk16-ubuntu-deploy/org.apache.directory.server$apacheds-server-integ/342/changes>

Changes:

[elecharny] Renamed the disconnet() method to disconnect()

[elecharny] o Added a test with 4 consumers
o Fixed a race condition making one test failing randomly

[elecharny] o Added a reset() method to clear up the number of added entries
o Added a test that stop and restart the consumer

[elecharny] o Added a test that do the initial update, and then receive one more entry
o

[kayyagari] o fixed a regression caused by an accidental removal of the default constructor
o removed the @Ignore annotation as the test passes now

[elecharny] o Stored the SchemaManager into the MockDirectoryService
o Improved the CLientInitialRequest test by isolating the consumer creation
o Make the MockSyncReplConsumer inherit from ReplicationConsumer

[elecharny] o Added a Mock object for SyncRepl consumer
o Added a test to check that we correctly load 1000 entries added in a producer

[elecharny] Fixed the jenckins regression : shut up the testReboot by @Ignoring it.

------------------------------------------
[JENKINS] Archiving /home/hudson/hudson-slave/workspace/dir-apacheds-jdk16-ubuntu-deploy/trunk/core-integ/pom.xml
to /home/hudson/hudson/jobs/dir-apacheds-jdk16-ubuntu-deploy/modules/org.apache.directory.server$apacheds-core-integ/builds/2011-07-30_04-01-10/archive/org.apache.directory.server/apacheds-core-integ/2.0.0-M2-SNAPSHOT/apacheds-core-integ-2.0.0-M2-SNAPSHOT.pom
[JENKINS] Archiving /home/hudson/hudson-slave/workspace/dir-apacheds-jdk16-ubuntu-deploy/trunk/core-integ/target/apacheds-core-integ-2.0.0-M2-SNAPSHOT.jar
to /home/hudson/hudson/jobs/dir-apacheds-jdk16-ubuntu-deploy/modules/org.apache.directory.server$apacheds-core-integ/builds/2011-07-30_04-01-10/archive/org.apache.directory.server/apacheds-core-integ/2.0.0-M2-20110730.041428-24/apacheds-core-integ-2.0.0-M2-20110730.041428-24.jar
[JENKINS] Archiving /home/hudson/hudson-slave/workspace/dir-apacheds-jdk16-ubuntu-deploy/trunk/core-integ/target/apacheds-core-integ-2.0.0-M2-SNAPSHOT-tests.jar
to /home/hudson/hudson/jobs/dir-apacheds-jdk16-ubuntu-deploy/modules/org.apache.directory.server$apacheds-core-integ/builds/2011-07-30_04-01-10/archive/org.apache.directory.server/apacheds-core-integ/2.0.0-M2-20110730.041428-24/apacheds-core-integ-2.0.0-M2-20110730.041428-24-tests.jar
[INFO]                                                                         
[INFO] ------------------------------------------------------------------------
Downloading: http://repository.apache.org/snapshots/org/apache/directory/shared/shared-dsml-engine/1.0.0-M6-SNAPSHOT/maven-metadata.xml
[INFO] Building ApacheDS Server Integration 2.0.0-M2-SNAPSHOT
[INFO] ------------------------------------------------------------------------
Downloaded: http://repository.apache.org/snapshots/org/apache/directory/shared/shared-dsml-engine/1.0.0-M6-SNAPSHOT/maven-metadata.xml
(807 B at 5.0 KB/sec)
Downloading: http://repository.apache.org/snapshots/org/apache/directory/shared/shared-dsml-engine/1.0.0-M6-SNAPSHOT/maven-metadata.xml
Downloaded: http://repository.apache.org/snapshots/org/apache/directory/shared/shared-dsml-engine/1.0.0-M6-SNAPSHOT/maven-metadata.xml
(807 B at 7.3 KB/sec)
Downloading: http://repository.apache.org/snapshots/org/apache/directory/shared/shared-dsml-parent/1.0.0-M6-SNAPSHOT/maven-metadata.xml
Downloaded: http://repository.apache.org/snapshots/org/apache/directory/shared/shared-dsml-parent/1.0.0-M6-SNAPSHOT/maven-metadata.xml
(630 B at 6.5 KB/sec)
Downloading: http://repository.apache.org/snapshots/org/apache/directory/shared/shared-dsml-parser/1.0.0-M6-SNAPSHOT/maven-metadata.xml
Downloaded: http://repository.apache.org/snapshots/org/apache/directory/shared/shared-dsml-parser/1.0.0-M6-SNAPSHOT/maven-metadata.xml
(807 B at 4.4 KB/sec)
[INFO] Deleting <https://builds.apache.org/job/dir-apacheds-jdk16-ubuntu-deploy/org.apache.directory.server$apacheds-server-integ/ws/target>
[INFO] 
[INFO] --- maven-clean-plugin:2.4.1:clean (default-clean) @ apacheds-server-integ ---
[INFO] 
[INFO] --- maven-remote-resources-plugin:1.2:process (default) @ apacheds-server-integ ---
Downloading: http://repository.apache.org/snapshots/org/apache/directory/shared/shared-dsml-parser/1.0.0-M6-SNAPSHOT/maven-metadata.xml
Downloaded: http://repository.apache.org/snapshots/org/apache/directory/shared/shared-dsml-parser/1.0.0-M6-SNAPSHOT/maven-metadata.xml
(807 B at 6.9 KB/sec)
[debug] execute contextualize
[INFO] [INFO] Using 'UTF-8' encoding to copy filtered resources.
[INFO] Copying 0 resource
[INFO] Copying 3 resources

[INFO] --- maven-resources-plugin:2.5:resources (default-resources) @ apacheds-server-integ
---
[INFO] [INFO] Compiling 1 source file to <https://builds.apache.org/job/dir-apacheds-jdk16-ubuntu-deploy/org.apache.directory.server$apacheds-server-integ/ws/target/classes>

[INFO] --- maven-compiler-plugin:2.3.2:compile (default-compile) @ apacheds-server-integ ---
[INFO] Configured Artifact: org.apache.directory.shared:shared-ldap-extras-codec:?:jar
[INFO] [INFO] Copying shared-ldap-extras-codec-1.0.0-M6-SNAPSHOT.jar to <https://builds.apache.org/job/dir-apacheds-jdk16-ubuntu-deploy/org.apache.directory.server$apacheds-server-integ/ws/target/pluginDirectory/shared-ldap-extras-codec-1.0.0-M6-20110730.030814-34.jar>

[INFO] --- maven-dependency-plugin:2.2:copy (copy) @ apacheds-server-integ ---
[debug] execute contextualize
[INFO] [INFO] Using 'UTF-8' encoding to copy filtered resources.
[INFO] Copying 7 resources
[INFO] Copying 3 resources

[INFO] --- maven-resources-plugin:2.5:testResources (default-testResources) @ apacheds-server-integ
---
[INFO] 
[INFO] --- maven-compiler-plugin:2.3.2:testCompile (default-testCompile) @ apacheds-server-integ
---
[INFO] Compiling 61 source files to <https://builds.apache.org/job/dir-apacheds-jdk16-ubuntu-deploy/org.apache.directory.server$apacheds-server-integ/ws/target/test-classes>
[INFO] -------------------------------------------------------------
[ERROR] COMPILATION ERROR : 
[INFO] -------------------------------------------------------------
[ERROR] <https://builds.apache.org/job/dir-apacheds-jdk16-ubuntu-deploy/org.apache.directory.server$apacheds-server-integ/ws/src/test/java/org/apache/directory/server/replication/ClientInitialRefreshIT.java>:[33,39]
cannot find symbol
symbol  : class MockDirectoryService
location: package org.apache.directory.server.core
[ERROR] <https://builds.apache.org/job/dir-apacheds-jdk16-ubuntu-deploy/org.apache.directory.server$apacheds-server-integ/ws/src/test/java/org/apache/directory/server/replication/ClientInitialRefreshIT.java>:[307,60]
cannot find symbol
symbol: class MockDirectoryService
                    DirectoryService directoryService = new MockDirectoryService();
[INFO] 2 errors 
[INFO] -------------------------------------------------------------
mojoFailed org.apache.maven.plugins:maven-compiler-plugin:2.3.2(default-testCompile)
projectFailed org.apache.directory.server:apacheds-server-integ:2.0.0-M2-SNAPSHOT


Mime
View raw message