directory-notifications mailing list archives

Site index · List index
Message view « Date » · « Thread »
Top « Date » · « Thread »
From Apache Jenkins Server <jenk...@builds.apache.org>
Subject Build failed in Jenkins: dir-apacheds-jdk16-ubuntu-deploy #339
Date Wed, 27 Jul 2011 04:17:07 GMT
See <https://builds.apache.org/job/dir-apacheds-jdk16-ubuntu-deploy/339/changes>

Changes:

[elecharny] o Added some Javadoc
o Some minor refactoring

[seelmann] Added two commented lines that are sometimes useful

[elecharny] Deleted those useless classes

[elecharny] The consumer is not erased in the testReboot test, we restart the existing one

[elecharny] o Minor refactoring
o Javadoc addition

------------------------------------------
[...truncated 3521 lines...]
[INFO] [INFO] Using 'UTF-8' encoding to copy filtered resources.
[INFO] Copying 7 resources

[INFO] --- maven-resources-plugin:2.5:testResources (default-testResources) @ apacheds-core-integ
---[INFO] Copying 3 resources

[INFO] 
[INFO] --- maven-dependency-plugin:2.2:copy (copy) @ apacheds-core-integ ---
[INFO] Configured Artifact: org.apache.directory.shared:shared-ldap-extras-codec:1.0.0-M6-SNAPSHOT:jar
[INFO] Copying shared-ldap-extras-codec-1.0.0-M6-SNAPSHOT.jar to <https://builds.apache.org/job/dir-apacheds-jdk16-ubuntu-deploy/ws/trunk/core-integ/target/pluginDirectory/shared-ldap-extras-codec-1.0.0-M6-20110727.025619-31.jar>
[INFO] 
[INFO] --- maven-compiler-plugin:2.3.2:testCompile (default-testCompile) @ apacheds-core-integ
---[INFO] Compiling 101 source files to <https://builds.apache.org/job/dir-apacheds-jdk16-ubuntu-deploy/ws/trunk/core-integ/target/test-classes>

[INFO] [INFO] Surefire report directory: <https://builds.apache.org/job/dir-apacheds-jdk16-ubuntu-deploy/ws/trunk/core-integ/target/surefire-reports>

[INFO] --- maven-surefire-plugin:2.8:test (default-test) @ apacheds-core-integ ---

-------------------------------------------------------
 T E S T S
-------------------------------------------------------
Running org.apache.directory.server.core.suites.MigratedStockCoreISuite
Tests run: 93, Failures: 0, Errors: 0, Skipped: 1, Time elapsed: 41.33 sec
Running org.apache.directory.server.core.suites.StockCoreISuite
Tests run: 566, Failures: 0, Errors: 0, Skipped: 127, Time elapsed: 148.884 sec

Results :

Tests run: 659, Failures: 0, Errors: 0, Skipped: 128

[JENKINS] Recording test results
[INFO] 
[INFO] --- maven-jar-plugin:2.3.1:jar (default-jar) @ apacheds-core-integ ---
[INFO] Building jar: <https://builds.apache.org/job/dir-apacheds-jdk16-ubuntu-deploy/ws/trunk/core-integ/target/apacheds-core-integ-2.0.0-M2-SNAPSHOT.jar>
[INFO] 
[INFO] --- maven-jar-plugin:2.3.1:test-jar (default) @ apacheds-core-integ ---
[INFO] Building jar: <https://builds.apache.org/job/dir-apacheds-jdk16-ubuntu-deploy/ws/trunk/core-integ/target/apacheds-core-integ-2.0.0-M2-SNAPSHOT-tests.jar>
[INFO] [INFO] Checking legal files in: apacheds-core-integ-2.0.0-M2-SNAPSHOT.jar
[INFO] Checking legal files in: apacheds-core-integ-2.0.0-M2-SNAPSHOT-tests.jar

[INFO] --- tools-maven-plugin:1.4:verify-legal-files (verify-legal-files) @ apacheds-core-integ
---
[INFO] [INFO] Exclude: **/target/**/*
[INFO] Exclude: **/cobertura.ser
[INFO] Exclude: **/.classpath
[INFO] Exclude: **/.project
[INFO] Exclude: **/.settings/**/*
[INFO] Exclude: **/ApacheDS.launch
[INFO] Exclude: **/*.iml
[INFO] Exclude: **/*.ipr
[INFO] Exclude: **/*.iws
[INFO] Exclude: **/MANIFEST.MF
[INFO] Exclude: **/dependency-reduced-pom.xml
[INFO] Exclude: **/*.ldif
[INFO] Exclude: **/*.pdu
[INFO] Exclude: jdbm/**/*
[INFO] Exclude: installers-maven-plugin/src/main/resources/org/apache/directory/server/installers/deb/control
[INFO] Exclude: installers-maven-plugin/src/main/resources/org/apache/directory/server/installers/macosxpkg/License.rtf
[INFO] Exclude: installers-maven-plugin/src/main/resources/org/apache/directory/server/installers/solarispkg/pkginfo
[INFO] Exclude: installers-maven-plugin/src/main/resources/org/apache/directory/server/installers/solarispkg/Prototype
[INFO] Exclude: osgi/src/main/resources/META-INF/spring.handlers
[INFO] Exclude: osgi/src/main/resources/META-INF/spring.schemas
[INFO] Exclude: **/*.log

[INFO] --- apache-rat-plugin:0.7:check (default) @ apacheds-core-integ ---
[INFO] [INFO] Installing <https://builds.apache.org/job/dir-apacheds-jdk16-ubuntu-deploy/ws/trunk/core-integ/target/apacheds-core-integ-2.0.0-M2-SNAPSHOT.jar>
to /home/hudson/.m2/repository/org/apache/directory/server/apacheds-core-integ/2.0.0-M2-SNAPSHOT/apacheds-core-integ-2.0.0-M2-SNAPSHOT.jar

[INFO] --- maven-install-plugin:2.3.1:install (default-install) @ apacheds-core-integ ---
[INFO] Installing <https://builds.apache.org/job/dir-apacheds-jdk16-ubuntu-deploy/ws/trunk/core-integ/pom.xml>
to /home/hudson/.m2/repository/org/apache/directory/server/apacheds-core-integ/2.0.0-M2-SNAPSHOT/apacheds-core-integ-2.0.0-M2-SNAPSHOT.pom
[INFO] Installing <https://builds.apache.org/job/dir-apacheds-jdk16-ubuntu-deploy/ws/trunk/core-integ/target/apacheds-core-integ-2.0.0-M2-SNAPSHOT-tests.jar>
to /home/hudson/.m2/repository/org/apache/directory/server/apacheds-core-integ/2.0.0-M2-SNAPSHOT/apacheds-core-integ-2.0.0-M2-SNAPSHOT-tests.jar
[INFO] Downloading: https://repository.apache.org/content/repositories/snapshots/org/apache/directory/server/apacheds-core-integ/2.0.0-M2-SNAPSHOT/maven-metadata.xml

[INFO] --- maven-deploy-plugin:2.5:deploy (default-deploy) @ apacheds-core-integ ---
Downloaded: https://repository.apache.org/content/repositories/snapshots/org/apache/directory/server/apacheds-core-integ/2.0.0-M2-SNAPSHOT/maven-metadata.xml
(1 KB at 3.3 KB/sec)
Uploading: https://repository.apache.org/content/repositories/snapshots/org/apache/directory/server/apacheds-core-integ/2.0.0-M2-SNAPSHOT/apacheds-core-integ-2.0.0-M2-20110727.041637-21.jar
Uploaded: https://repository.apache.org/content/repositories/snapshots/org/apache/directory/server/apacheds-core-integ/2.0.0-M2-SNAPSHOT/apacheds-core-integ-2.0.0-M2-20110727.041637-21.jar
(16 KB at 65.1 KB/sec)
Uploading: https://repository.apache.org/content/repositories/snapshots/org/apache/directory/server/apacheds-core-integ/2.0.0-M2-SNAPSHOT/apacheds-core-integ-2.0.0-M2-20110727.041637-21.pom
Uploaded: https://repository.apache.org/content/repositories/snapshots/org/apache/directory/server/apacheds-core-integ/2.0.0-M2-SNAPSHOT/apacheds-core-integ-2.0.0-M2-20110727.041637-21.pom
(14 KB at 68.8 KB/sec)
Downloading: https://repository.apache.org/content/repositories/snapshots/org/apache/directory/server/apacheds-core-integ/maven-metadata.xml
Downloaded: https://repository.apache.org/content/repositories/snapshots/org/apache/directory/server/apacheds-core-integ/maven-metadata.xml
(469 B at 2.2 KB/sec)
Uploading: https://repository.apache.org/content/repositories/snapshots/org/apache/directory/server/apacheds-core-integ/2.0.0-M2-SNAPSHOT/maven-metadata.xml
Uploaded: https://repository.apache.org/content/repositories/snapshots/org/apache/directory/server/apacheds-core-integ/2.0.0-M2-SNAPSHOT/maven-metadata.xml
(1 KB at 3.7 KB/sec)
Uploading: https://repository.apache.org/content/repositories/snapshots/org/apache/directory/server/apacheds-core-integ/maven-metadata.xml
Uploaded: https://repository.apache.org/content/repositories/snapshots/org/apache/directory/server/apacheds-core-integ/maven-metadata.xml
(469 B at 1.7 KB/sec)
Uploading: https://repository.apache.org/content/repositories/snapshots/org/apache/directory/server/apacheds-core-integ/2.0.0-M2-SNAPSHOT/apacheds-core-integ-2.0.0-M2-20110727.041637-21-tests.jar
Uploaded: https://repository.apache.org/content/repositories/snapshots/org/apache/directory/server/apacheds-core-integ/2.0.0-M2-SNAPSHOT/apacheds-core-integ-2.0.0-M2-20110727.041637-21-tests.jar
(358 KB at 615.8 KB/sec)
Uploading: https://repository.apache.org/content/repositories/snapshots/org/apache/directory/server/apacheds-core-integ/2.0.0-M2-SNAPSHOT/maven-metadata.xml
Uploaded: https://repository.apache.org/content/repositories/snapshots/org/apache/directory/server/apacheds-core-integ/2.0.0-M2-SNAPSHOT/maven-metadata.xml
(1 KB at 6.0 KB/sec)
projectSucceeded org.apache.directory.server:apacheds-core-integ:2.0.0-M2-SNAPSHOT
[JENKINS] Archiving <https://builds.apache.org/job/dir-apacheds-jdk16-ubuntu-deploy/ws/trunk/core-integ/pom.xml>
to /home/hudson/hudson/jobs/dir-apacheds-jdk16-ubuntu-deploy/modules/org.apache.directory.server$apacheds-core-integ/builds/2011-07-27_04-01-19/archive/org.apache.directory.server/apacheds-core-integ/2.0.0-M2-SNAPSHOT/apacheds-core-integ-2.0.0-M2-SNAPSHOT.pom
[JENKINS] Archiving <https://builds.apache.org/job/dir-apacheds-jdk16-ubuntu-deploy/ws/trunk/core-integ/target/apacheds-core-integ-2.0.0-M2-SNAPSHOT.jar>
to /home/hudson/hudson/jobs/dir-apacheds-jdk16-ubuntu-deploy/modules/org.apache.directory.server$apacheds-core-integ/builds/2011-07-27_04-01-19/archive/org.apache.directory.server/apacheds-core-integ/2.0.0-M2-20110727.041637-21/apacheds-core-integ-2.0.0-M2-20110727.041637-21.jar
[JENKINS] Archiving <https://builds.apache.org/job/dir-apacheds-jdk16-ubuntu-deploy/ws/trunk/core-integ/target/apacheds-core-integ-2.0.0-M2-SNAPSHOT-tests.jar>
to /home/hudson/hudson/jobs/dir-apacheds-jdk16-ubuntu-deploy/modules/org.apache.directory.server$apacheds-core-integ/builds/2011-07-27_04-01-19/archive/org.apache.directory.server/apacheds-core-integ/2.0.0-M2-20110727.041637-21/apacheds-core-integ-2.0.0-M2-20110727.041637-21-tests.jar
[INFO]                                                                         
[INFO] ------------------------------------------------------------------------
[INFO] Building ApacheDS Server Integration 2.0.0-M2-SNAPSHOT
[INFO] ------------------------------------------------------------------------
Downloading: http://repository.apache.org/snapshots/org/apache/directory/shared/shared-dsml-engine/1.0.0-M6-SNAPSHOT/maven-metadata.xml
Downloaded: http://repository.apache.org/snapshots/org/apache/directory/shared/shared-dsml-engine/1.0.0-M6-SNAPSHOT/maven-metadata.xml
(807 B at 4.7 KB/sec)
Downloading: http://repository.apache.org/snapshots/org/apache/directory/shared/shared-dsml-engine/1.0.0-M6-SNAPSHOT/shared-dsml-engine-1.0.0-M6-20110727.025735-30.pom
Downloaded: http://repository.apache.org/snapshots/org/apache/directory/shared/shared-dsml-engine/1.0.0-M6-SNAPSHOT/shared-dsml-engine-1.0.0-M6-20110727.025735-30.pom
(3 KB at 32.3 KB/sec)
Downloading: http://repository.apache.org/snapshots/org/apache/directory/shared/shared-dsml-parent/1.0.0-M6-SNAPSHOT/maven-metadata.xml
Downloaded: http://repository.apache.org/snapshots/org/apache/directory/shared/shared-dsml-parent/1.0.0-M6-SNAPSHOT/maven-metadata.xml
(630 B at 6.9 KB/sec)
Downloading: http://repository.apache.org/snapshots/org/apache/directory/shared/shared-dsml-parent/1.0.0-M6-SNAPSHOT/shared-dsml-parent-1.0.0-M6-20110727.025629-30.pom
Downloaded: http://repository.apache.org/snapshots/org/apache/directory/shared/shared-dsml-parent/1.0.0-M6-SNAPSHOT/shared-dsml-parent-1.0.0-M6-20110727.025629-30.pom
(2 KB at 17.9 KB/sec)
Downloading: http://repository.apache.org/snapshots/org/apache/directory/shared/shared-dsml-parser/1.0.0-M6-SNAPSHOT/maven-metadata.xml
Downloaded: http://repository.apache.org/snapshots/org/apache/directory/shared/shared-dsml-parser/1.0.0-M6-SNAPSHOT/maven-metadata.xml
(807 B at 8.6 KB/sec)
Downloading: http://repository.apache.org/snapshots/org/apache/directory/shared/shared-dsml-parser/1.0.0-M6-SNAPSHOT/shared-dsml-parser-1.0.0-M6-20110727.025638-30.pom
Downloaded: http://repository.apache.org/snapshots/org/apache/directory/shared/shared-dsml-parser/1.0.0-M6-SNAPSHOT/shared-dsml-parser-1.0.0-M6-20110727.025638-30.pom
(4 KB at 3.9 KB/sec)
Downloading: http://repository.apache.org/snapshots/org/apache/directory/shared/shared-dsml-engine/1.0.0-M6-SNAPSHOT/shared-dsml-engine-1.0.0-M6-20110727.025735-30.jar
Downloading: http://repository.apache.org/snapshots/org/apache/directory/shared/shared-dsml-parser/1.0.0-M6-SNAPSHOT/shared-dsml-parser-1.0.0-M6-20110727.025638-30.jar
Downloaded: http://repository.apache.org/snapshots/org/apache/directory/shared/shared-dsml-engine/1.0.0-M6-SNAPSHOT/shared-dsml-engine-1.0.0-M6-20110727.025735-30.jar
(16 KB at 93.0 KB/sec)
Downloaded: http://repository.apache.org/snapshots/org/apache/directory/shared/shared-dsml-parser/1.0.0-M6-SNAPSHOT/shared-dsml-parser-1.0.0-M6-20110727.025638-30.jar
(205 KB at 424.1 KB/sec)
[INFO] [INFO] Deleting <https://builds.apache.org/job/dir-apacheds-jdk16-ubuntu-deploy/ws/trunk/server-integ/target>

[INFO] --- maven-clean-plugin:2.4.1:clean (default-clean) @ apacheds-server-integ ---
[INFO] 
[INFO] --- maven-remote-resources-plugin:1.2:process (default) @ apacheds-server-integ ---
Downloading: http://repository.apache.org/snapshots/org/apache/directory/shared/shared-dsml-parser/1.0.0-M6-SNAPSHOT/maven-metadata.xml
Downloaded: http://repository.apache.org/snapshots/org/apache/directory/shared/shared-dsml-parser/1.0.0-M6-SNAPSHOT/maven-metadata.xml
(807 B at 3.5 KB/sec)
Downloading: http://repository.apache.org/snapshots/org/apache/directory/shared/shared-dsml-engine/1.0.0-M6-SNAPSHOT/maven-metadata.xml
Downloaded: http://repository.apache.org/snapshots/org/apache/directory/shared/shared-dsml-engine/1.0.0-M6-SNAPSHOT/maven-metadata.xml
(807 B at 9.3 KB/sec)
[debug] execute contextualize
[INFO] [INFO] Using 'UTF-8' encoding to copy filtered resources.
[INFO] Copying 0 resource
[INFO] Copying 3 resources

[INFO] --- maven-resources-plugin:2.5:resources (default-resources) @ apacheds-server-integ
---
[INFO] [INFO] Compiling 1 source file to <https://builds.apache.org/job/dir-apacheds-jdk16-ubuntu-deploy/ws/trunk/server-integ/target/classes>

[INFO] --- maven-compiler-plugin:2.3.2:compile (default-compile) @ apacheds-server-integ ---
[INFO] [INFO] Configured Artifact: org.apache.directory.shared:shared-ldap-extras-codec:?:jar
[INFO] Copying shared-ldap-extras-codec-1.0.0-M6-SNAPSHOT.jar to <https://builds.apache.org/job/dir-apacheds-jdk16-ubuntu-deploy/ws/trunk/server-integ/target/pluginDirectory/shared-ldap-extras-codec-1.0.0-M6-20110727.025619-31.jar>

[INFO] --- maven-dependency-plugin:2.2:copy (copy) @ apacheds-server-integ ---
[debug] execute contextualize
[INFO] [INFO] Using 'UTF-8' encoding to copy filtered resources.
[INFO] Copying 7 resources
[INFO] Copying 3 resources

[INFO] --- maven-resources-plugin:2.5:testResources (default-testResources) @ apacheds-server-integ
---
[INFO] [INFO] Compiling 59 source files to <https://builds.apache.org/job/dir-apacheds-jdk16-ubuntu-deploy/ws/trunk/server-integ/target/test-classes>

[INFO] --- maven-compiler-plugin:2.3.2:testCompile (default-testCompile) @ apacheds-server-integ
---
[INFO] -------------------------------------------------------------
[ERROR] COMPILATION ERROR : 
[INFO] -------------------------------------------------------------
[ERROR] <https://builds.apache.org/job/dir-apacheds-jdk16-ubuntu-deploy/ws/trunk/server-integ/src/test/java/org/apache/directory/server/replication/ClientServerReplicationIT.java>:[404,14]
cannot find symbol
symbol  : method setProviderHost(java.lang.String)
location: class org.apache.directory.server.ldap.replication.SyncreplConfiguration
[ERROR] <https://builds.apache.org/job/dir-apacheds-jdk16-ubuntu-deploy/ws/trunk/server-integ/src/test/java/org/apache/directory/server/replication/ClientServerReplicationIT.java>:[405,14]
cannot find symbol
symbol  : method setPort(int)
location: class org.apache.directory.server.ldap.replication.SyncreplConfiguration
[ERROR] <https://builds.apache.org/job/dir-apacheds-jdk16-ubuntu-deploy/ws/trunk/server-integ/src/test/java/org/apache/directory/server/replication/ClientServerReplicationIT.java>:[436,71]
cannot find symbol
symbol  : method getProviderHost()
location: class org.apache.directory.server.ldap.replication.SyncreplConfiguration
[ERROR] <https://builds.apache.org/job/dir-apacheds-jdk16-ubuntu-deploy/ws/trunk/server-integ/src/test/java/org/apache/directory/server/replication/ClientServerReplicationIT.java>:[437,83]
cannot find symbol
symbol  : method getPort()
location: class org.apache.directory.server.ldap.replication.SyncreplConfiguration
[INFO] 4 errors 
[INFO] -------------------------------------------------------------
mojoFailed org.apache.maven.plugins:maven-compiler-plugin:2.3.2(default-testCompile)
projectFailed org.apache.directory.server:apacheds-server-integ:2.0.0-M2-SNAPSHOT
[JENKINS] Archiving <https://builds.apache.org/job/dir-apacheds-jdk16-ubuntu-deploy/ws/trunk/server-integ/pom.xml>
to /home/hudson/hudson/jobs/dir-apacheds-jdk16-ubuntu-deploy/modules/org.apache.directory.server$apacheds-server-integ/builds/2011-07-27_04-01-19/archive/org.apache.directory.server/apacheds-server-integ/2.0.0-M2-SNAPSHOT/apacheds-server-integ-2.0.0-M2-SNAPSHOT.pom
sessionEnded
[INFO] ------------------------------------------------------------------------
[INFO] Reactor Summary:
[INFO] 
[INFO] ApacheDS .......................................... SUCCESS [1:14.723s]
[INFO] ApacheDS I18n ..................................... SUCCESS [6.721s]
[INFO] ApacheDS Core Constants ........................... SUCCESS [11.180s]
[INFO] ApacheDS Core API ................................. SUCCESS [39.991s]
[INFO] ApacheDS Core ..................................... SUCCESS [28.877s]
[INFO] ApacheDS Core AVL ................................. SUCCESS [10.004s]
[INFO] ApacheDS Generalized (X) DBM Partition ............ SUCCESS [23.188s]
[INFO] ApacheDS LDIF Partition ........................... SUCCESS [22.522s]
[INFO] ApacheDS JDBM implementation ...................... SUCCESS [18.264s]
[INFO] ApacheDS JDBM Partition ........................... SUCCESS [35.226s]
[INFO] ApacheDS Core Annotations ......................... SUCCESS [16.894s]
[INFO] ApacheDS Core JNDI ................................ SUCCESS [9.999s]
[INFO] ApacheDS Protocol Shared .......................... SUCCESS [13.749s]
[INFO] ApacheDS Protocol Kerberos Codec .................. SUCCESS [25.566s]
[INFO] ApacheDS Interceptors for Kerberos ................ SUCCESS [8.409s]
[INFO] ApacheDS Protocol Dhcp ............................ SUCCESS [8.503s]
[INFO] ApacheDS Protocol Dns ............................. SUCCESS [11.180s]
[INFO] ApacheDS Protocol Kerberos ........................ SUCCESS [12.055s]
[INFO] ApacheDS Protocol Ldap ............................ SUCCESS [20.929s]
[INFO] ApacheDS Protocol Ntp ............................. SUCCESS [10.905s]
[INFO] Apacheds Server Annotations ....................... SUCCESS [19.303s]
[INFO] ApacheDS Server Config ............................ SUCCESS [16.172s]
[INFO] ApacheDS Server JNDI .............................. SUCCESS [12.168s]
[INFO] ApacheDS Server Replication Service ............... SUCCESS [12.536s]
[INFO] ApacheDS Test Framework ........................... SUCCESS [37.822s]
[INFO] ApacheDS Generalized (X) DBM Tools ................ SUCCESS [9.435s]
[INFO] ApacheDS All ...................................... SUCCESS [30.116s]
[INFO] ApacheDS Core Integration ......................... SUCCESS [3:31.395s]
[INFO] ApacheDS Server Integration ....................... FAILURE [18.189s]
[INFO] ApacheDS DirectoryService-WebApp bridge ........... SKIPPED
[INFO] ApacheDS Jetty HTTP Server Integration ............ SKIPPED
[INFO] ApacheDS Service Builder .......................... SKIPPED
[INFO] ApacheDS Protocol Kerberos Test ................... SKIPPED
[INFO] Apache Directory LDAP Client API test ............. SKIPPED
[INFO] ApacheDS Service .................................. SKIPPED
[INFO] ApacheDS Wrapper .................................. SKIPPED
[INFO] ------------------------------------------------------------------------
[INFO] BUILD FAILURE
[INFO] ------------------------------------------------------------------------
[INFO] Total time: 15:29.767s
[INFO] Finished at: Wed Jul 27 04:17:01 UTC 2011
[INFO] Final Memory: 210M/369M
[INFO] ------------------------------------------------------------------------
maven builder waiting
mavenExecutionResult exceptions not empty
message : Failed to execute goal org.apache.maven.plugins:maven-compiler-plugin:2.3.2:testCompile
(default-testCompile) on project apacheds-server-integ: Compilation failure
cause : Compilation failure
Stack trace : 
org.apache.maven.lifecycle.LifecycleExecutionException: Failed to execute goal org.apache.maven.plugins:maven-compiler-plugin:2.3.2:testCompile
(default-testCompile) on project apacheds-server-integ: Compilation failure
	at org.apache.maven.lifecycle.internal.MojoExecutor.execute(MojoExecutor.java:213)
	at org.apache.maven.lifecycle.internal.MojoExecutor.execute(MojoExecutor.java:153)
	at org.apache.maven.lifecycle.internal.MojoExecutor.execute(MojoExecutor.java:145)
	at org.apache.maven.lifecycle.internal.LifecycleModuleBuilder.buildProject(LifecycleModuleBuilder.java:84)
	at org.apache.maven.lifecycle.internal.LifecycleModuleBuilder.buildProject(LifecycleModuleBuilder.java:59)
	at org.apache.maven.lifecycle.internal.LifecycleStarter.singleThreadedBuild(LifecycleStarter.java:183)
	at org.apache.maven.lifecycle.internal.LifecycleStarter.execute(LifecycleStarter.java:161)
	at org.apache.maven.DefaultMaven.doExecute(DefaultMaven.java:319)
	at org.apache.maven.DefaultMaven.execute(DefaultMaven.java:156)
	at org.jvnet.hudson.maven3.launcher.Maven3Launcher.main(Maven3Launcher.java:79)
	at sun.reflect.NativeMethodAccessorImpl.invoke0(Native Method)
	at sun.reflect.NativeMethodAccessorImpl.invoke(NativeMethodAccessorImpl.java:39)
	at sun.reflect.DelegatingMethodAccessorImpl.invoke(DelegatingMethodAccessorImpl.java:25)
	at java.lang.reflect.Method.invoke(Method.java:597)
	at org.codehaus.plexus.classworlds.launcher.Launcher.launchStandard(Launcher.java:329)
	at org.codehaus.plexus.classworlds.launcher.Launcher.launch(Launcher.java:239)
	at org.jvnet.hudson.maven3.agent.Maven3Main.launch(Maven3Main.java:158)
	at hudson.maven.Maven3Builder.call(Maven3Builder.java:128)
	at hudson.maven.Maven3Builder.call(Maven3Builder.java:75)
	at hudson.remoting.UserRequest.perform(UserRequest.java:118)
	at hudson.remoting.UserRequest.perform(UserRequest.java:48)
	at hudson.remoting.Request$2.run(Request.java:270)
	at java.util.concurrent.Executors$RunnableAdapter.call(Executors.java:441)
	at java.util.concurrent.FutureTask$Sync.innerRun(FutureTask.java:303)
	at java.util.concurrent.FutureTask.run(FutureTask.java:138)
	at java.util.concurrent.ThreadPoolExecutor$Worker.runTask(ThreadPoolExecutor.java:886)
	at java.util.concurrent.ThreadPoolExecutor$Worker.run(ThreadPoolExecutor.java:908)
	at java.lang.Thread.run(Thread.java:619)
Caused by: org.apache.maven.plugin.CompilationFailureException: Compilation failure
	at org.apache.maven.plugin.AbstractCompilerMojo.execute(AbstractCompilerMojo.java:656)
	at org.apache.maven.plugin.TestCompilerMojo.execute(TestCompilerMojo.java:161)
	at org.apache.maven.plugin.DefaultBuildPluginManager.executeMojo(DefaultBuildPluginManager.java:101)
	at org.apache.maven.lifecycle.internal.MojoExecutor.execute(MojoExecutor.java:209)
	... 27 more
Sending e-mails to: notifications@directory.apache.org
channel stopped


Mime
View raw message