directory-notifications mailing list archives

Site index · List index
Message view « Date » · « Thread »
Top « Date » · « Thread »
From Apache Jenkins Server <jenk...@builds.apache.org>
Subject Build failed in Jenkins: dir-studio-jdk16-win #312
Date Mon, 25 Jul 2011 04:03:50 GMT
See <https://builds.apache.org/job/dir-studio-jdk16-win/312/>

------------------------------------------
[...truncated 3804 lines...]
[INFO] 
[INFO] --- maven-remote-resources-plugin:1.2:process (default) @ apacheds-launcher ---
[WARNING] While downloading org.slf4j:jcl104-over-slf4j:1.5.6
  This artifact has been relocated to org.slf4j:jcl-over-slf4j:1.5.6.
  As it now supports JCL versions 1.0.4, 1.1 and 1.1.1, the jcl104-over-slf4j module has been
renamed as jcl-over-slf4j.


[debug] execute contextualize
[INFO] [INFO] Using 'UTF-8' encoding to copy filtered resources.

[INFO] --- maven-resources-plugin:2.5:resources (default-resources) @ apacheds-launcher ---
[INFO] Copying 0 resource
[INFO] Copying 3 resources
[INFO] 
[INFO] --- maven-compiler-plugin:2.3.2:compile (default-compile) @ apacheds-launcher ---
[INFO] Compiling 2 source files to F:\hudson\hudson-slave\workspace\dir-studio-jdk16-win\trunk\plugins\apacheds-launcher\target\classes
[INFO] [debug] execute contextualize

[INFO] --- maven-resources-plugin:2.5:testResources (default-testResources) @ apacheds-launcher
---[INFO] Using 'UTF-8' encoding to copy filtered resources.
[INFO] skip non existing resourceDirectory F:\hudson\hudson-slave\workspace\dir-studio-jdk16-win\trunk\plugins\apacheds-launcher\src\test\resources

[INFO] Copying 3 resources
[INFO] 
[INFO] --- maven-compiler-plugin:2.3.2:testCompile (default-testCompile) @ apacheds-launcher
---
[INFO] No sources to compile
[INFO] 
[INFO] --- maven-surefire-plugin:2.8:test (default-test) @ apacheds-launcher ---
[INFO] Surefire report directory: F:\hudson\hudson-slave\workspace\dir-studio-jdk16-win\trunk\plugins\apacheds-launcher\target\surefire-reports

-------------------------------------------------------
 T E S T S
-------------------------------------------------------
There are no tests to run.

Results :

Tests run: 0, Failures: 0, Errors: 0, Skipped: 0

[JENKINS] Recording test results
[INFO] 
[INFO] --- maven-jar-plugin:2.3.1:jar (default-jar) @ apacheds-launcher ---
[INFO] Building jar: F:\hudson\hudson-slave\workspace\dir-studio-jdk16-win\trunk\plugins\apacheds-launcher\target\apacheds-launcher-2.0.0-SNAPSHOT.jar
[INFO] 
[INFO] --- tools-maven-plugin:1.4:verify-legal-files (verify-legal-files) @ apacheds-launcher
---
[INFO] Checking legal files in: apacheds-launcher-2.0.0-SNAPSHOT.jar
[INFO] 
[INFO] --- apache-rat-plugin:0.7:check (default) @ apacheds-launcher ---
[INFO] Exclude: **/target/**/*
[INFO] Exclude: **/cobertura.ser
[INFO] Exclude: **/.classpath
[INFO] Exclude: **/.project
[INFO] Exclude: **/.settings/**/*
[INFO] Exclude: **/*.iml
[INFO] Exclude: **/*.ipr
[INFO] Exclude: **/*.iws
[INFO] Exclude: **/MANIFEST.MF
[INFO] Exclude: **/dependency-reduced-pom.xml
[INFO] Exclude: **/.gitignore
[INFO] Exclude: **/about.ini
[INFO] Exclude: **/about_files/*
[INFO] Exclude: **/*.log
[INFO] Exclude: **/*.vm
[INFO] Exclude: apacheds.configuration/src/main/resources/org/apache/directory/studio/apacheds/configuration/spring-beans.dtd
[INFO] Exclude: apacheds.configuration.v2/src/main/resources/org/apache/directory/studio/apacheds/configuration/v2/config.ldif
[INFO] Exclude: common.ui/src/main/java/org/apache/directory/studio/common/ui/filesystem/PathEditorInput.java
[INFO] Exclude: ldapbrowser.core/src/main/resources/default_schema.ldif
[INFO] Exclude: rcp/resources/icons/linux/studio.xpm
[INFO] Exclude: schemaeditor/resources/schemas/openldap/*.xml
[INFO] [INFO] Installing F:\hudson\hudson-slave\workspace\dir-studio-jdk16-win\trunk\plugins\apacheds-launcher\target\apacheds-launcher-2.0.0-SNAPSHOT.jar
to C:\Users\hudson\.m2\repository\org\apache\directory\studio\apacheds-launcher\2.0.0-SNAPSHOT\apacheds-launcher-2.0.0-SNAPSHOT.jar

[INFO] --- maven-install-plugin:2.3.1:install (default-install) @ apacheds-launcher ---
[INFO] Installing F:\hudson\hudson-slave\workspace\dir-studio-jdk16-win\trunk\plugins\apacheds-launcher\pom.xml
to C:\Users\hudson\.m2\repository\org\apache\directory\studio\apacheds-launcher\2.0.0-SNAPSHOT\apacheds-launcher-2.0.0-SNAPSHOT.pom
projectSucceeded org.apache.directory.studio:apacheds-launcher:2.0.0-SNAPSHOT
[JENKINS] Archiving disabled - not archiving F:\hudson\hudson-slave\workspace\dir-studio-jdk16-win\trunk\plugins\apacheds-launcher\pom.xml
[JENKINS] Archiving disabled - not archiving F:\hudson\hudson-slave\workspace\dir-studio-jdk16-win\trunk\plugins\apacheds-launcher\target\apacheds-launcher-2.0.0-SNAPSHOT.jar
[INFO]                                                                         
[INFO] ------------------------------------------------------------------------
[INFO] Building Apache Directory Studio Apache DS 2.0 Configuration 2.0.0-SNAPSHOT
[INFO] ------------------------------------------------------------------------
[INFO] Deleting F:\hudson\hudson-slave\workspace\dir-studio-jdk16-win\trunk\plugins\apacheds.configuration.v2\target
[INFO] 
[INFO] --- maven-clean-plugin:2.4.1:clean (default-clean) @ apacheds.configuration.v2 ---
[INFO] 
[INFO] --- maven-remote-resources-plugin:1.2:process (default) @ apacheds.configuration.v2
---
[debug] execute contextualize
[INFO] [INFO] Using 'UTF-8' encoding to copy filtered resources.

[INFO] --- maven-resources-plugin:2.5:resources (default-resources) @ apacheds.configuration.v2
---
[INFO] Copying 2 resources
[INFO] Copying 6 resources to resources
[INFO] Copying 1 resource
[INFO] Copying 3 resources
[INFO] Copying 3 resources
[INFO] 
[INFO] --- studio-maven-plugin:1.0.4:prepare-jar-package (default) @ apacheds.configuration.v2
---
[INFO] Compiling 29 source files to F:\hudson\hudson-slave\workspace\dir-studio-jdk16-win\trunk\plugins\apacheds.configuration.v2\target\classes
[INFO] 
[INFO] --- maven-compiler-plugin:2.3.2:compile (default-compile) @ apacheds.configuration.v2
---
[INFO] -------------------------------------------------------------
[ERROR] COMPILATION ERROR : 
[INFO] -------------------------------------------------------------
[ERROR] \hudson\hudson-slave\workspace\dir-studio-jdk16-win\trunk\plugins\apacheds.configuration.v2\src\main\java\org\apache\directory\studio\apacheds\configuration\v2\jobs\LoadConfigurationRunnable.java:[335,42]
cannot find symbol
symbol  : method setContextEntry(org.apache.directory.shared.ldap.model.entry.Entry)
location: class org.apache.directory.studio.apacheds.configuration.v2.jobs.EntryBasedConfigurationPartition
[INFO] 1 error
[INFO] -------------------------------------------------------------
mojoFailed org.apache.maven.plugins:maven-compiler-plugin:2.3.2(default-compile)
projectFailed org.apache.directory.studio:apacheds.configuration.v2:2.0.0-SNAPSHOT
[JENKINS] Archiving disabled - not archiving F:\hudson\hudson-slave\workspace\dir-studio-jdk16-win\trunk\plugins\apacheds.configuration.v2\pom.xml
sessionEnded
[INFO] ------------------------------------------------------------------------
[INFO] Reactor Summary:
[INFO] 
[INFO] Apache Directory Studio ........................... SUCCESS [27.110s]
[INFO] Apache Directory Studio Repository ................ SUCCESS [2.628s]
[INFO] Apache Directory Studio Libraries Plugins ......... SUCCESS [0.288s]
[INFO] SLF4J API Module (for Apache Directory Studio) .... SUCCESS [12.450s]
[INFO] Ehcache Core (for Apache Directory Studio) ........ SUCCESS [1.502s]
[INFO] AntLR Parser Generator (for Apache Directory Studio)  SUCCESS [1.614s]
[INFO] Apache Commons Codec (for Apache Directory Studio)  SUCCESS [0.951s]
[INFO] Apache Commons Collections (for Apache Directory Studio)  SUCCESS [1.719s]
[INFO] Apache Commons IO (for Apache Directory Studio) ... SUCCESS [0.742s]
[INFO] Apache Commons Lang (for Apache Directory Studio) . SUCCESS [0.769s]
[INFO] Apache Commons Logging (for Apache Directory Studio)  SUCCESS [0.731s]
[INFO] Apache Commons Pool (for Apache Directory Studio) . SUCCESS [0.705s]
[INFO] ApacheDS Core Constants (for Apache Directory Studio)  SUCCESS [0.884s]
[INFO] ApacheDS I18n (for Apache Directory Studio) ....... SUCCESS [0.657s]
[INFO] ApacheDS Core API (for Apache Directory Studio) ... SUCCESS [1.222s]
[INFO] ApacheDS Core AVL (for Apache Directory Studio) ... SUCCESS [0.805s]
[INFO] ApacheDS Generalized (X) DBM Partition (for Apache Directory Studio)  SUCCESS [0.974s]
[INFO] ApacheDS Server Config (for Apache Directory Studio)  SUCCESS [0.828s]
[INFO] Legion of the Bouncy Castle Java Cryptography APIs (for Apache Directory Studio)  SUCCESS
[1.087s]
[INFO] ApacheDS Core (for Apache Directory Studio) ....... SUCCESS [1.133s]
[INFO] ApacheDS LDIF Partition (for Apache Directory Studio)  SUCCESS [0.913s]
[INFO] Apache HttpComponents Core (for Apache Directory Studio)  SUCCESS [0.743s]
[INFO] Apache HttpComponents Client (for Apache Directory Studio)  SUCCESS [1.045s]
[INFO] Log4j (for Apache Directory Studio) ............... SUCCESS [0.762s]
[INFO] Apache MINA Core (for Apache Directory Studio) .... SUCCESS [0.722s]
[INFO] dom4j (for Apache Directory Studio) ............... SUCCESS [0.704s]
[INFO] SLF4J LOG4J-12 Binding (for Apache Directory Studio)  SUCCESS [0.727s]
[INFO] XPP3 (for Apache Directory Studio) ................ SUCCESS [0.593s]
[INFO] Apache Directory Studio Plugins ................... SUCCESS [3.180s]
[INFO] Apache Directory Studio Common UI ................. SUCCESS [3.159s]
[INFO] Apache Directory Studio Common Core ............... SUCCESS [1.564s]
[INFO] Apache Directory Studio LDIF Parser ............... SUCCESS [3.462s]
[INFO] Apache Directory Studio Connection Core ........... SUCCESS [4.674s]
[INFO] Apache Directory Studio Connection UI ............. SUCCESS [4.333s]
[INFO] Apache Directory Studio LDAP Browser Core ......... SUCCESS [7.923s]
[INFO] Apache Directory Studio LDAP Browser Common ....... SUCCESS [6.954s]
[INFO] Apache Directory Studio Value Editors ............. SUCCESS [3.334s]
[INFO] Apache Directory Studio ACI Item Editor ........... SUCCESS [4.012s]
[INFO] Apache Directory Studio Apache DS Configuration ... SUCCESS [9.383s]
[INFO] Apache Directory Studio Apache DS ................. SUCCESS [9.818s]
[INFO] Apache Directory Studio Apache DS Launcher ........ SUCCESS [2.567s]
[INFO] Apache Directory Studio Apache DS 2.0 Configuration  FAILURE [2.887s]
[INFO] Apache Directory Studio LDIF Editor ............... SKIPPED
[INFO] Apache Directory Studio LDAP Browser UI ........... SKIPPED
[INFO] Apache Directory Studio LDAP Servers .............. SKIPPED
[INFO] Apache Directory Studio ApacheDS 1.5.3 LDAP Server Adapter  SKIPPED
[INFO] Apache Directory Studio ApacheDS 1.5.4 LDAP Server Adapter  SKIPPED
[INFO] Apache Directory Studio ApacheDS 1.5.5 LDAP Server Adapter  SKIPPED
[INFO] Apache Directory Studio ApacheDS 1.5.6 LDAP Server Adapter  SKIPPED
[INFO] Apache Directory Studio ApacheDS 1.5.7 LDAP Server Adapter  SKIPPED
[INFO] Apache Directory Studio RCP ....................... SKIPPED
[INFO] Apache Directory Studio Schema Editor ............. SKIPPED
[INFO] Apache Directory Studio Apache DS Help ............ SKIPPED
[INFO] Apache Directory Studio Apache DS Configuration Help  SKIPPED
[INFO] Apache Directory Studio LDAP Browser Help ......... SKIPPED
[INFO] Apache Directory Studio LDIF Editor Help .......... SKIPPED
[INFO] Apache Directory Studio RCP Help .................. SKIPPED
[INFO] Apache Directory Studio Schema Editor Help ........ SKIPPED
[INFO] Apache Directory Studio Help Plugins .............. SKIPPED
[INFO] Apache Directory Studio Feature Plugins ........... SKIPPED
[INFO] Apache Directory Studio Apache DS Configuration Feature  SKIPPED
[INFO] Apache Directory Studio Apache DS Feature ......... SKIPPED
[INFO] Apache Directory Studio LDAP Browser Feature ...... SKIPPED
[INFO] Apache Directory Studio LDIF Editor Feature ....... SKIPPED
[INFO] Apache Directory Studio RCP Feature ............... SKIPPED
[INFO] Apache Directory Studio Schema Editor Feature ..... SKIPPED
[INFO] Apache Directory Studio Application ............... SKIPPED
[INFO] Apache Directory Studio Application Plugins ....... SKIPPED
[INFO] Apache Directory Studio Application Features ...... SKIPPED
[INFO] Apache Directory Studio Application Eclipse Plugins  SKIPPED
[INFO] Apache Directory Studio Application Win32 x86_64 .. SKIPPED
[INFO] ------------------------------------------------------------------------
[INFO] BUILD FAILURE
[INFO] ------------------------------------------------------------------------
[INFO] Total time: 2:20.395s
[INFO] Finished at: Mon Jul 25 05:03:46 BST 2011
[INFO] [WARNING] The requested profile "studio-full" could not be activated because it does
not exist.
Final Memory: 204M/336M
[INFO] ------------------------------------------------------------------------
mavenExecutionResult exceptions not empty
message : Failed to execute goal org.apache.maven.plugins:maven-compiler-plugin:2.3.2:compile
(default-compile) on project apacheds.configuration.v2: Compilation failure
\hudson\hudson-slave\workspace\dir-studio-jdk16-win\trunk\plugins\apacheds.configuration.v2\src\main\java\org\apache\directory\studio\apacheds\configuration\v2\jobs\LoadConfigurationRunnable.java:[335,42]
cannot find symbol
symbol  : method setContextEntry(org.apache.directory.shared.ldap.model.entry.Entry)
location: class org.apache.directory.studio.apacheds.configuration.v2.jobs.EntryBasedConfigurationPartition

cause : Compilation failure
\hudson\hudson-slave\workspace\dir-studio-jdk16-win\trunk\plugins\apacheds.configuration.v2\src\main\java\org\apache\directory\studio\apacheds\configuration\v2\jobs\LoadConfigurationRunnable.java:[335,42]
cannot find symbol
symbol  : method setContextEntry(org.apache.directory.shared.ldap.model.entry.Entry)
location: class org.apache.directory.studio.apacheds.configuration.v2.jobs.EntryBasedConfigurationPartition

Stack trace : 
org.apache.maven.lifecycle.LifecycleExecutionException: Failed to execute goal org.apache.maven.plugins:maven-compiler-plugin:2.3.2:compile
(default-compile) on project apacheds.configuration.v2: Compilation failure
\hudson\hudson-slave\workspace\dir-studio-jdk16-win\trunk\plugins\apacheds.configuration.v2\src\main\java\org\apache\directory\studio\apacheds\configuration\v2\jobs\LoadConfigurationRunnable.java:[335,42]
cannot find symbol
symbol  : method setContextEntry(org.apache.directory.shared.ldap.model.entry.Entry)
location: class org.apache.directory.studio.apacheds.configuration.v2.jobs.EntryBasedConfigurationPartition

	at org.apache.maven.lifecycle.internal.MojoExecutor.execute(MojoExecutor.java:213)
	at org.apache.maven.lifecycle.internal.MojoExecutor.execute(MojoExecutor.java:153)
	at org.apache.maven.lifecycle.internal.MojoExecutor.execute(MojoExecutor.java:145)
	at org.apache.maven.lifecycle.internal.LifecycleModuleBuilder.buildProject(LifecycleModuleBuilder.java:84)
	at org.apache.maven.lifecycle.internal.LifecycleModuleBuilder.buildProject(LifecycleModuleBuilder.java:59)
	at org.apache.maven.lifecycle.internal.LifecycleStarter.singleThreadedBuild(LifecycleStarter.java:183)
	at org.apache.maven.lifecycle.internal.LifecycleStarter.execute(LifecycleStarter.java:161)
	at org.apache.maven.DefaultMaven.doExecute(DefaultMaven.java:319)
	at org.apache.maven.DefaultMaven.execute(DefaultMaven.java:156)
	at org.jvnet.hudson.maven3.launcher.Maven3Launcher.main(Maven3Launcher.java:79)
	at sun.reflect.NativeMethodAccessorImpl.invoke0(Native Method)
	at sun.reflect.NativeMethodAccessorImpl.invoke(NativeMethodAccessorImpl.java:39)
	at sun.reflect.DelegatingMethodAccessorImpl.invoke(DelegatingMethodAccessorImpl.java:25)
	at java.lang.reflect.Method.invoke(Method.java:597)
	at org.codehaus.plexus.classworlds.launcher.Launcher.launchStandard(Launcher.java:329)
	at org.codehaus.plexus.classworlds.launcher.Launcher.launch(Launcher.java:239)
	at org.jvnet.hudson.maven3.agent.Maven3Main.launch(Maven3Main.java:158)
	at hudson.maven.Maven3Builder.call(Maven3Builder.java:128)
	at hudson.maven.Maven3Builder.call(Maven3Builder.java:75)
	at hudson.remoting.UserRequest.perform(UserRequest.java:118)
	at hudson.remoting.UserRequest.perform(UserRequest.java:48)
	at hudson.remoting.Request$2.run(Request.java:270)
	at java.util.concurrent.Executors$RunnableAdapter.call(Executors.java:441)
	at java.util.concurrent.FutureTask$Sync.innerRun(FutureTask.java:303)
	at java.util.concurrent.FutureTask.run(FutureTask.java:138)
	at java.util.concurrent.ThreadPoolExecutor$Worker.runTask(ThreadPoolExecutor.java:886)
	at java.util.concurrent.ThreadPoolExecutor$Worker.run(ThreadPoolExecutor.java:908)
	at java.lang.Thread.run(Thread.java:619)
Caused by: org.apache.maven.plugin.CompilationFailureException: Compilation failure
\hudson\hudson-slave\workspace\dir-studio-jdk16-win\trunk\plugins\apacheds.configuration.v2\src\main\java\org\apache\directory\studio\apacheds\configuration\v2\jobs\LoadConfigurationRunnable.java:[335,42]
cannot find symbol
symbol  : method setContextEntry(org.apache.directory.shared.ldap.model.entry.Entry)
location: class org.apache.directory.studio.apacheds.configuration.v2.jobs.EntryBasedConfigurationPartition

	at org.apache.maven.plugin.AbstractCompilerMojo.execute(AbstractCompilerMojo.java:656)
	at org.apache.maven.plugin.CompilerMojo.execute(CompilerMojo.java:128)
	at org.apache.maven.plugin.DefaultBuildPluginManager.executeMojo(DefaultBuildPluginManager.java:107)
	at org.apache.maven.lifecycle.internal.MojoExecutor.execute(MojoExecutor.java:209)
	... 27 more
Sending e-mails to: notifications@directory.apache.org
channel stopped


Mime
View raw message