directory-notifications mailing list archives

Site index · List index
Message view « Date » · « Thread »
Top « Date » · « Thread »
From Apache Hudson Server <hud...@hudson.apache.org>
Subject Build failed in Jenkins: dir-apacheds-jdk15-ubuntu-deploy #228
Date Mon, 04 Apr 2011 04:03:53 GMT
See <https://hudson.apache.org/hudson/job/dir-apacheds-jdk15-ubuntu-deploy/228/changes>

Changes:

[elecharny] Removed useless methods

[elecharny] Removed the contains( String ) method. It's a duplicate of the containAttributes(
String...) method.

[kayyagari] o renamed ReplicationProvider to ReplicationReqHandler to avoid the confusion
with provider/consumer semantics while configuring the server

------------------------------------------
[...truncated 511 lines...]
location: class org.apache.directory.server.core.schema.DescriptionParsers
[ERROR] <https://hudson.apache.org/hudson/job/dir-apacheds-jdk15-ubuntu-deploy/ws/trunk/core-api/src/main/java/org/apache/directory/server/core/schema/DescriptionParsers.java>:[382,52]
cannot find symbol
symbol  : class Attribute
location: class org.apache.directory.server.core.schema.DescriptionParsers
[ERROR] <https://hudson.apache.org/hudson/job/dir-apacheds-jdk15-ubuntu-deploy/ws/trunk/core-api/src/main/java/org/apache/directory/server/core/schema/DescriptionParsers.java>:[425,43]
cannot find symbol
symbol  : class Attribute
location: class org.apache.directory.server.core.schema.DescriptionParsers
[ERROR] <https://hudson.apache.org/hudson/job/dir-apacheds-jdk15-ubuntu-deploy/ws/trunk/core-api/src/main/java/org/apache/directory/server/core/schema/DescriptionParsers.java>:[474,46]
cannot find symbol
symbol  : class Attribute
location: class org.apache.directory.server.core.schema.DescriptionParsers
[ERROR] <https://hudson.apache.org/hudson/job/dir-apacheds-jdk15-ubuntu-deploy/ws/trunk/core-api/src/main/java/org/apache/directory/server/core/schema/DescriptionParsers.java>:[523,54]
cannot find symbol
symbol  : class Attribute
location: class org.apache.directory.server.core.schema.DescriptionParsers
[ERROR] <https://hudson.apache.org/hudson/job/dir-apacheds-jdk15-ubuntu-deploy/ws/trunk/core-api/src/main/java/org/apache/directory/server/core/schema/DescriptionParsers.java>:[566,50]
cannot find symbol
symbol  : class Attribute
location: class org.apache.directory.server.core.schema.DescriptionParsers
[ERROR] <https://hudson.apache.org/hudson/job/dir-apacheds-jdk15-ubuntu-deploy/ws/trunk/core-api/src/main/java/org/apache/directory/server/core/schema/DescriptionParsers.java>:[609,38]
cannot find symbol
symbol  : class Attribute
location: class org.apache.directory.server.core.schema.DescriptionParsers
[ERROR] <https://hudson.apache.org/hudson/job/dir-apacheds-jdk15-ubuntu-deploy/ws/trunk/core-api/src/main/java/org/apache/directory/server/core/entry/ServerEntryUtils.java>:[39,52]
cannot find symbol
symbol  : class Attribute
location: package org.apache.directory.shared.ldap.model.entry
[ERROR] <https://hudson.apache.org/hudson/job/dir-apacheds-jdk15-ubuntu-deploy/ws/trunk/core-api/src/main/java/org/apache/directory/server/core/entry/ServerEntryUtils.java>:[41,52]
cannot find symbol
symbol  : class DefaultAttribute
location: package org.apache.directory.shared.ldap.model.entry
[ERROR] <https://hudson.apache.org/hudson/job/dir-apacheds-jdk15-ubuntu-deploy/ws/trunk/core-api/src/main/java/org/apache/directory/server/core/entry/ServerEntryUtils.java>:[70,69]
cannot find symbol
symbol  : class Attribute
location: class org.apache.directory.server.core.entry.ServerEntryUtils
[ERROR] <https://hudson.apache.org/hudson/job/dir-apacheds-jdk15-ubuntu-deploy/ws/trunk/core-api/src/main/java/org/apache/directory/server/core/entry/ServerEntryUtils.java>:[128,18]
cannot find symbol
symbol  : class Attribute
location: class org.apache.directory.server.core.entry.ServerEntryUtils
[ERROR] <https://hudson.apache.org/hudson/job/dir-apacheds-jdk15-ubuntu-deploy/ws/trunk/core-api/src/main/java/org/apache/directory/server/core/entry/ServerEntryUtils.java>:[330,38]
cannot find symbol
symbol  : class Attribute
location: class org.apache.directory.server.core.entry.ServerEntryUtils
[ERROR] <https://hudson.apache.org/hudson/job/dir-apacheds-jdk15-ubuntu-deploy/ws/trunk/core-api/src/main/java/org/apache/directory/server/core/entry/ServerEntryUtils.java>:[330,55]
cannot find symbol
symbol  : class Attribute
location: class org.apache.directory.server.core.entry.ServerEntryUtils
[ERROR] <https://hudson.apache.org/hudson/job/dir-apacheds-jdk15-ubuntu-deploy/ws/trunk/core-api/src/main/java/org/apache/directory/server/core/entry/ServerEntryUtils.java>:[330,18]
cannot find symbol
symbol  : class Attribute
location: class org.apache.directory.server.core.entry.ServerEntryUtils
[ERROR] <https://hudson.apache.org/hudson/job/dir-apacheds-jdk15-ubuntu-deploy/ws/trunk/core-api/src/main/java/org/apache/directory/server/core/entry/ServerEntryUtils.java>:[568,18]
cannot find symbol
symbol  : class Attribute
location: class org.apache.directory.server.core.entry.ServerEntryUtils
[ERROR] <https://hudson.apache.org/hudson/job/dir-apacheds-jdk15-ubuntu-deploy/ws/trunk/core-api/src/main/java/org/apache/directory/server/core/schema/SchemaPartitionDaoImpl.java>:[42,52]
cannot find symbol
symbol  : class DefaultAttribute
location: package org.apache.directory.shared.ldap.model.entry
[ERROR] <https://hudson.apache.org/hudson/job/dir-apacheds-jdk15-ubuntu-deploy/ws/trunk/core-api/src/main/java/org/apache/directory/server/core/schema/SchemaPartitionDaoImpl.java>:[45,52]
cannot find symbol
symbol  : class Attribute
location: package org.apache.directory.shared.ldap.model.entry
[ERROR] <https://hudson.apache.org/hudson/job/dir-apacheds-jdk15-ubuntu-deploy/ws/trunk/core-api/src/main/java/org/apache/directory/server/core/schema/registries/synchronizers/AbstractRegistrySynchronizer.java>:[343,8]
cannot find symbol
symbol  : class Attribute
location: class org.apache.directory.server.core.schema.registries.synchronizers.AbstractRegistrySynchronizer
[ERROR] <https://hudson.apache.org/hudson/job/dir-apacheds-jdk15-ubuntu-deploy/ws/trunk/core-api/src/main/java/org/apache/directory/server/core/interceptor/context/ModifyOperationContext.java>:[124,14]
cannot find symbol
symbol  : class Attribute
location: class org.apache.directory.server.core.interceptor.context.ModifyOperationContext
[ERROR] <https://hudson.apache.org/hudson/job/dir-apacheds-jdk15-ubuntu-deploy/ws/trunk/core-api/src/main/java/org/apache/directory/server/core/entry/ClonedServerEntry.java>:[46,7]
org.apache.directory.server.core.entry.ClonedServerEntry is not abstract and does not override
abstract method contains(java.lang.String) in org.apache.directory.shared.ldap.model.entry.Entry
[ERROR] <https://hudson.apache.org/hudson/job/dir-apacheds-jdk15-ubuntu-deploy/ws/trunk/core-api/src/main/java/org/apache/directory/server/core/entry/ClonedServerEntry.java>:[400,14]
cannot find symbol
symbol  : class Attribute
location: class org.apache.directory.server.core.entry.ClonedServerEntry
[ERROR] <https://hudson.apache.org/hudson/job/dir-apacheds-jdk15-ubuntu-deploy/ws/trunk/core-api/src/main/java/org/apache/directory/server/core/entry/ClonedServerEntry.java>:[402,12]
cannot find symbol
symbol  : class Attribute
location: class org.apache.directory.server.core.entry.ClonedServerEntry
[ERROR] <https://hudson.apache.org/hudson/job/dir-apacheds-jdk15-ubuntu-deploy/ws/trunk/core-api/src/main/java/org/apache/directory/server/core/schema/SchemaPartition.java>:[463,88]
cannot find symbol
symbol  : class DefaultAttribute
location: class org.apache.directory.server.core.schema.SchemaPartition
[ERROR] <https://hudson.apache.org/hudson/job/dir-apacheds-jdk15-ubuntu-deploy/ws/trunk/core-api/src/main/java/org/apache/directory/server/core/schema/SchemaPartition.java>:[467,88]
cannot find symbol
symbol  : class DefaultAttribute
location: class org.apache.directory.server.core.schema.SchemaPartition
[ERROR] <https://hudson.apache.org/hudson/job/dir-apacheds-jdk15-ubuntu-deploy/ws/trunk/core-api/src/main/java/org/apache/directory/server/core/schema/registries/synchronizers/RegistrySynchronizerAdaptor.java>:[157,8]
cannot find symbol
symbol  : class Attribute
location: class org.apache.directory.server.core.schema.registries.synchronizers.RegistrySynchronizerAdaptor
[ERROR] <https://hudson.apache.org/hudson/job/dir-apacheds-jdk15-ubuntu-deploy/ws/trunk/core-api/src/main/java/org/apache/directory/server/core/schema/registries/synchronizers/RegistrySynchronizerAdaptor.java>:[225,8]
cannot find symbol
symbol  : class Attribute
location: class org.apache.directory.server.core.schema.registries.synchronizers.RegistrySynchronizerAdaptor
[ERROR] <https://hudson.apache.org/hudson/job/dir-apacheds-jdk15-ubuntu-deploy/ws/trunk/core-api/src/main/java/org/apache/directory/server/core/schema/registries/synchronizers/RegistrySynchronizerAdaptor.java>:[279,8]
cannot find symbol
symbol  : class Attribute
location: class org.apache.directory.server.core.schema.registries.synchronizers.RegistrySynchronizerAdaptor
[ERROR] <https://hudson.apache.org/hudson/job/dir-apacheds-jdk15-ubuntu-deploy/ws/trunk/core-api/src/main/java/org/apache/directory/server/core/schema/registries/synchronizers/RegistrySynchronizerAdaptor.java>:[321,8]
cannot find symbol
symbol  : class Attribute
location: class org.apache.directory.server.core.schema.registries.synchronizers.RegistrySynchronizerAdaptor
[ERROR] <https://hudson.apache.org/hudson/job/dir-apacheds-jdk15-ubuntu-deploy/ws/trunk/core-api/src/main/java/org/apache/directory/server/core/schema/registries/synchronizers/RegistrySynchronizerAdaptor.java>:[350,8]
cannot find symbol
symbol  : class Attribute
location: class org.apache.directory.server.core.schema.registries.synchronizers.RegistrySynchronizerAdaptor
[ERROR] <https://hudson.apache.org/hudson/job/dir-apacheds-jdk15-ubuntu-deploy/ws/trunk/core-api/src/main/java/org/apache/directory/server/core/schema/registries/synchronizers/RegistrySynchronizerAdaptor.java>:[379,8]
cannot find symbol
symbol  : class Attribute
location: class org.apache.directory.server.core.schema.registries.synchronizers.RegistrySynchronizerAdaptor
[ERROR] <https://hudson.apache.org/hudson/job/dir-apacheds-jdk15-ubuntu-deploy/ws/trunk/core-api/src/main/java/org/apache/directory/server/core/schema/registries/synchronizers/SchemaSynchronizer.java>:[123,8]
cannot find symbol
symbol  : class Attribute
location: class org.apache.directory.server.core.schema.registries.synchronizers.SchemaSynchronizer
[ERROR] <https://hudson.apache.org/hudson/job/dir-apacheds-jdk15-ubuntu-deploy/ws/trunk/core-api/src/main/java/org/apache/directory/server/core/schema/registries/synchronizers/SchemaSynchronizer.java>:[133,12]
cannot find symbol
symbol  : class Attribute
location: class org.apache.directory.server.core.schema.registries.synchronizers.SchemaSynchronizer
[ERROR] <https://hudson.apache.org/hudson/job/dir-apacheds-jdk15-ubuntu-deploy/ws/trunk/core-api/src/main/java/org/apache/directory/server/core/schema/registries/synchronizers/SchemaSynchronizer.java>:[172,8]
cannot find symbol
symbol  : class Attribute
location: class org.apache.directory.server.core.schema.registries.synchronizers.SchemaSynchronizer
[ERROR] <https://hudson.apache.org/hudson/job/dir-apacheds-jdk15-ubuntu-deploy/ws/trunk/core-api/src/main/java/org/apache/directory/server/core/schema/registries/synchronizers/SchemaSynchronizer.java>:[229,8]
cannot find symbol
symbol  : class Attribute
location: class org.apache.directory.server.core.schema.registries.synchronizers.SchemaSynchronizer
[ERROR] <https://hudson.apache.org/hudson/job/dir-apacheds-jdk15-ubuntu-deploy/ws/trunk/core-api/src/main/java/org/apache/directory/server/core/schema/registries/synchronizers/SchemaSynchronizer.java>:[561,8]
cannot find symbol
symbol  : class Attribute
location: class org.apache.directory.server.core.schema.registries.synchronizers.SchemaSynchronizer
[ERROR] <https://hudson.apache.org/hudson/job/dir-apacheds-jdk15-ubuntu-deploy/ws/trunk/core-api/src/main/java/org/apache/directory/server/core/LdapCoreSessionConnection.java>:[651,21]
cannot find symbol
symbol  : class Attribute
location: class org.apache.directory.server.core.LdapCoreSessionConnection
[ERROR] <https://hudson.apache.org/hudson/job/dir-apacheds-jdk15-ubuntu-deploy/ws/trunk/core-api/src/main/java/org/apache/directory/server/core/entry/ServerEntryUtils.java>:[103,12]
cannot find symbol
symbol  : class Attribute
location: class org.apache.directory.server.core.entry.ServerEntryUtils
[ERROR] <https://hudson.apache.org/hudson/job/dir-apacheds-jdk15-ubuntu-deploy/ws/trunk/core-api/src/main/java/org/apache/directory/server/core/entry/ServerEntryUtils.java>:[137,12]
cannot find symbol
symbol  : class Attribute
location: class org.apache.directory.server.core.entry.ServerEntryUtils
[ERROR] <https://hudson.apache.org/hudson/job/dir-apacheds-jdk15-ubuntu-deploy/ws/trunk/core-api/src/main/java/org/apache/directory/server/core/entry/ServerEntryUtils.java>:[137,44]
cannot find symbol
symbol  : class DefaultAttribute
location: class org.apache.directory.server.core.entry.ServerEntryUtils
[ERROR] <https://hudson.apache.org/hudson/job/dir-apacheds-jdk15-ubuntu-deploy/ws/trunk/core-api/src/main/java/org/apache/directory/server/core/entry/ServerEntryUtils.java>:[223,20]
cannot find symbol
symbol  : class Attribute
location: class org.apache.directory.server.core.entry.ServerEntryUtils
[ERROR] <https://hudson.apache.org/hudson/job/dir-apacheds-jdk15-ubuntu-deploy/ws/trunk/core-api/src/main/java/org/apache/directory/server/core/entry/ServerEntryUtils.java>:[268,16]
cannot find symbol
symbol  : class Attribute
location: class org.apache.directory.server.core.entry.ServerEntryUtils
[ERROR] <https://hudson.apache.org/hudson/job/dir-apacheds-jdk15-ubuntu-deploy/ws/trunk/core-api/src/main/java/org/apache/directory/server/core/entry/ServerEntryUtils.java>:[276,20]
cannot find symbol
symbol  : class Attribute
location: class org.apache.directory.server.core.entry.ServerEntryUtils
[ERROR] <https://hudson.apache.org/hudson/job/dir-apacheds-jdk15-ubuntu-deploy/ws/trunk/core-api/src/main/java/org/apache/directory/server/core/entry/ServerEntryUtils.java>:[289,16]
cannot find symbol
symbol  : class Attribute
location: class org.apache.directory.server.core.entry.ServerEntryUtils
[ERROR] <https://hudson.apache.org/hudson/job/dir-apacheds-jdk15-ubuntu-deploy/ws/trunk/core-api/src/main/java/org/apache/directory/server/core/entry/ServerEntryUtils.java>:[289,41]
cannot find symbol
symbol  : class DefaultAttribute
location: class org.apache.directory.server.core.entry.ServerEntryUtils
[ERROR] <https://hudson.apache.org/hudson/job/dir-apacheds-jdk15-ubuntu-deploy/ws/trunk/core-api/src/main/java/org/apache/directory/server/core/entry/ServerEntryUtils.java>:[290,16]
cannot find symbol
symbol  : class Attribute
location: class org.apache.directory.server.core.entry.ServerEntryUtils
[ERROR] <https://hudson.apache.org/hudson/job/dir-apacheds-jdk15-ubuntu-deploy/ws/trunk/core-api/src/main/java/org/apache/directory/server/core/entry/ServerEntryUtils.java>:[291,16]
cannot find symbol
symbol  : class Attribute
location: class org.apache.directory.server.core.entry.ServerEntryUtils
[ERROR] <https://hudson.apache.org/hudson/job/dir-apacheds-jdk15-ubuntu-deploy/ws/trunk/core-api/src/main/java/org/apache/directory/server/core/entry/ServerEntryUtils.java>:[349,8]
cannot find symbol
symbol  : class Attribute
location: class org.apache.directory.server.core.entry.ServerEntryUtils
[ERROR] <https://hudson.apache.org/hudson/job/dir-apacheds-jdk15-ubuntu-deploy/ws/trunk/core-api/src/main/java/org/apache/directory/server/core/entry/ServerEntryUtils.java>:[440,16]
cannot find symbol
symbol  : class DefaultAttribute
location: class org.apache.directory.server.core.entry.ServerEntryUtils
[ERROR] <https://hudson.apache.org/hudson/job/dir-apacheds-jdk15-ubuntu-deploy/ws/trunk/core-api/src/main/java/org/apache/directory/server/core/entry/ServerEntryUtils.java>:[549,12]
cannot find symbol
symbol  : class Attribute
location: class org.apache.directory.server.core.entry.ServerEntryUtils
[ERROR] <https://hudson.apache.org/hudson/job/dir-apacheds-jdk15-ubuntu-deploy/ws/trunk/core-api/src/main/java/org/apache/directory/server/core/schema/SchemaPartitionDaoImpl.java>:[571,8]
cannot find symbol
symbol  : class Attribute
location: class org.apache.directory.server.core.schema.SchemaPartitionDaoImpl
[ERROR] <https://hudson.apache.org/hudson/job/dir-apacheds-jdk15-ubuntu-deploy/ws/trunk/core-api/src/main/java/org/apache/directory/server/core/schema/SchemaPartitionDaoImpl.java>:[588,87]
cannot find symbol
symbol  : class DefaultAttribute
location: class org.apache.directory.server.core.schema.SchemaPartitionDaoImpl
[ERROR] <https://hudson.apache.org/hudson/job/dir-apacheds-jdk15-ubuntu-deploy/ws/trunk/core-api/src/main/java/org/apache/directory/server/core/schema/SchemaPartitionDaoImpl.java>:[591,84]
cannot find symbol
symbol  : class DefaultAttribute
location: class org.apache.directory.server.core.schema.SchemaPartitionDaoImpl
[ERROR] <https://hudson.apache.org/hudson/job/dir-apacheds-jdk15-ubuntu-deploy/ws/trunk/core-api/src/main/java/org/apache/directory/server/core/schema/SchemaPartitionDaoImpl.java>:[595,84]
cannot find symbol
symbol  : class DefaultAttribute
location: class org.apache.directory.server.core.schema.SchemaPartitionDaoImpl
[ERROR] <https://hudson.apache.org/hudson/job/dir-apacheds-jdk15-ubuntu-deploy/ws/trunk/core-api/src/main/java/org/apache/directory/server/core/schema/SchemaPartitionDaoImpl.java>:[875,16]
cannot find symbol
symbol  : class Attribute
location: class org.apache.directory.server.core.schema.SchemaPartitionDaoImpl
[INFO] 93 errors 
[INFO] -------------------------------------------------------------
mojoFailed org.apache.maven.plugins:maven-compiler-plugin:2.3.2(default-compile)
projectFailed org.apache.directory.server:apacheds-core-api:1.5.8-SNAPSHOT
[JENKINS] Archiving <https://hudson.apache.org/hudson/job/dir-apacheds-jdk15-ubuntu-deploy/ws/trunk/core-api/pom.xml>
to /home/hudson/hudson/jobs/dir-apacheds-jdk15-ubuntu-deploy/modules/org.apache.directory.server$apacheds-core-api/builds/2011-04-04_04-02-40/archive/org.apache.directory.server/apacheds-core-api/1.5.8-SNAPSHOT/pom.xml
sessionEnded
[INFO] ------------------------------------------------------------------------
[INFO] Reactor Summary:
[INFO] 
[INFO] ApacheDS .......................................... SUCCESS [34.277s]
[INFO] ApacheDS I18n ..................................... SUCCESS [7.420s]
[INFO] ApacheDS Core Constants ........................... SUCCESS [4.026s]
[INFO] ApacheDS Core API ................................. FAILURE [9.187s]
[INFO] ApacheDS Core ..................................... SKIPPED
[INFO] ApacheDS Core AVL ................................. SKIPPED
[INFO] ApacheDS Generalized (X) DBM Partition ............ SKIPPED
[INFO] ApacheDS LDIF Partition ........................... SKIPPED
[INFO] ApacheDS JDBM implementation ...................... SKIPPED
[INFO] ApacheDS JDBM Partition ........................... SKIPPED
[INFO] ApacheDS Core Annotations ......................... SKIPPED
[INFO] ApacheDS Core JNDI ................................ SKIPPED
[INFO] ApacheDS Protocol Shared .......................... SKIPPED
[INFO] ApacheDS Protocol Kerberos Codec .................. SKIPPED
[INFO] ApacheDS Interceptors for Kerberos ................ SKIPPED
[INFO] ApacheDS Protocol Dhcp ............................ SKIPPED
[INFO] ApacheDS Protocol Dns ............................. SKIPPED
[INFO] ApacheDS Protocol Kerberos ........................ SKIPPED
[INFO] ApacheDS Protocol Ldap ............................ SKIPPED
[INFO] ApacheDS Protocol Ntp ............................. SKIPPED
[INFO] Apacheds Server Annotations ....................... SKIPPED
[INFO] ApacheDS Server Config ............................ SKIPPED
[INFO] ApacheDS Server JNDI .............................. SKIPPED
[INFO] ApacheDS Server Replication Service ............... SKIPPED
[INFO] ApacheDS Test Framework ........................... SKIPPED
[INFO] ApacheDS Generalized (X) DBM Tools ................ SKIPPED
[INFO] ApacheDS All ...................................... SKIPPED
[INFO] ApacheDS Core Integration ......................... SKIPPED
[INFO] ApacheDS Server Integration ....................... SKIPPED
[INFO] ApacheDS DirectoryService-WebApp bridge ........... SKIPPED
[INFO] ApacheDS Jetty HTTP Server Integration ............ SKIPPED
[INFO] ApacheDS Service Builder .......................... SKIPPED
[INFO] ApacheDS Protocol Kerberos Test ................... SKIPPED
[INFO] Apache Directory LDAP Client API test ............. SKIPPED
[INFO] ApacheDS Service .................................. SKIPPED
[INFO] ApacheDS Wrapper .................................. SKIPPED
[INFO] ------------------------------------------------------------------------
[INFO] BUILD FAILURE
[INFO] ------------------------------------------------------------------------
[INFO] Total time: 1:01.302s
[INFO] Finished at: Mon Apr 04 04:03:52 UTC 2011
[INFO] Final Memory: 23M/73M
[INFO] ------------------------------------------------------------------------
maven builder waiting
mavenExecutionResult exceptions not empty
org.apache.maven.lifecycle.LifecycleExecutionException: Failed to execute goal org.apache.maven.plugins:maven-compiler-plugin:2.3.2:compile
(default-compile) on project apacheds-core-api: Compilation failure
	at org.apache.maven.lifecycle.internal.MojoExecutor.execute(MojoExecutor.java:213)
	at org.apache.maven.lifecycle.internal.MojoExecutor.execute(MojoExecutor.java:153)
	at org.apache.maven.lifecycle.internal.MojoExecutor.execute(MojoExecutor.java:145)
	at org.apache.maven.lifecycle.internal.LifecycleModuleBuilder.buildProject(LifecycleModuleBuilder.java:84)
	at org.apache.maven.lifecycle.internal.LifecycleModuleBuilder.buildProject(LifecycleModuleBuilder.java:59)
	at org.apache.maven.lifecycle.internal.LifecycleStarter.singleThreadedBuild(LifecycleStarter.java:183)
	at org.apache.maven.lifecycle.internal.LifecycleStarter.execute(LifecycleStarter.java:161)
	at org.apache.maven.DefaultMaven.doExecute(DefaultMaven.java:319)
	at org.apache.maven.DefaultMaven.execute(DefaultMaven.java:156)
	at org.jvnet.hudson.maven3.launcher.Maven3Launcher.main(Maven3Launcher.java:79)
	at sun.reflect.NativeMethodAccessorImpl.invoke0(Native Method)
	at sun.reflect.NativeMethodAccessorImpl.invoke(NativeMethodAccessorImpl.java:39)
	at sun.reflect.DelegatingMethodAccessorImpl.invoke(DelegatingMethodAccessorImpl.java:25)
	at java.lang.reflect.Method.invoke(Method.java:592)
	at org.codehaus.plexus.classworlds.launcher.Launcher.launchStandard(Launcher.java:329)
	at org.codehaus.plexus.classworlds.launcher.Launcher.launch(Launcher.java:239)
	at org.jvnet.hudson.maven3.agent.Maven3Main.launch(Maven3Main.java:146)
	at hudson.maven.Maven3Builder.call(Maven3Builder.java:124)
	at hudson.maven.Maven3Builder.call(Maven3Builder.java:71)
	at hudson.remoting.UserRequest.perform(UserRequest.java:114)
	at hudson.remoting.UserRequest.perform(UserRequest.java:48)
	at hudson.remoting.Request$2.run(Request.java:270)
	at java.util.concurrent.Executors$RunnableAdapter.call(Executors.java:417)
	at java.util.concurrent.FutureTask$Sync.innerRun(FutureTask.java:269)
	at java.util.concurrent.FutureTask.run(FutureTask.java:123)
	at java.util.concurrent.ThreadPoolExecutor$Worker.runTask(ThreadPoolExecutor.java:651)
	at java.util.concurrent.ThreadPoolExecutor$Worker.run(ThreadPoolExecutor.java:676)
	at java.lang.Thread.run(Thread.java:595)
Caused by: org.apache.maven.plugin.CompilationFailureException: Compilation failure
	at org.apache.maven.plugin.AbstractCompilerMojo.execute(AbstractCompilerMojo.java:656)
	at org.apache.maven.plugin.CompilerMojo.execute(CompilerMojo.java:128)
	at org.apache.maven.plugin.DefaultBuildPluginManager.executeMojo(DefaultBuildPluginManager.java:101)
	at org.apache.maven.lifecycle.internal.MojoExecutor.execute(MojoExecutor.java:209)
	... 27 more
Sending e-mails to: notifications@directory.apache.org
channel stopped


Mime
View raw message