directory-notifications mailing list archives

Site index · List index
Message view « Date » · « Thread »
Top « Date » · « Thread »
From Apache Jenkins Server <hud...@hudson.apache.org>
Subject Build failed in Jenkins: dir-apacheds-jdk15-ubuntu-deploy #247
Date Sat, 23 Apr 2011 04:02:28 GMT
See <https://builds.apache.org/hudson/job/dir-apacheds-jdk15-ubuntu-deploy/247/changes>

Changes:

[elecharny] o Changed the get/setErrorMessage to get/setDiagnosticMessage, as define din the
RFC 4511

[elecharny] Moved the PPolicy elements from DS to AuthenticationInterceptor

[elecharny] Added some more tests

[elecharny] Removed the ppolicy empty package

[elecharny] Added an exists( String dn ) method

------------------------------------------
[...truncated 269 lines...]

[INFO] --- tools-maven-plugin:1.4:verify-legal-files (verify-legal-files) @ apacheds-core-constants
---
[INFO] [INFO] Exclude: **/target/**/*
[INFO] Exclude: **/cobertura.ser
[INFO] Exclude: **/.classpath
[INFO] Exclude: **/.project
[INFO] Exclude: **/.settings/**/*
[INFO] Exclude: **/ApacheDS.launch
[INFO] Exclude: **/*.iml
[INFO] Exclude: **/*.ipr
[INFO] Exclude: **/*.iws
[INFO] Exclude: **/MANIFEST.MF
[INFO] Exclude: **/dependency-reduced-pom.xml
[INFO] Exclude: **/*.ldif
[INFO] Exclude: **/*.pdu
[INFO] Exclude: jdbm/**/*
[INFO] Exclude: installers-maven-plugin/src/main/resources/org/apache/directory/server/installers/deb/control
[INFO] Exclude: installers-maven-plugin/src/main/resources/org/apache/directory/server/installers/macosxpkg/License.rtf
[INFO] Exclude: installers-maven-plugin/src/main/resources/org/apache/directory/server/installers/solarispkg/pkginfo
[INFO] Exclude: installers-maven-plugin/src/main/resources/org/apache/directory/server/installers/solarispkg/Prototype
[INFO] Exclude: osgi/src/main/resources/META-INF/spring.handlers
[INFO] Exclude: osgi/src/main/resources/META-INF/spring.schemas
[INFO] Exclude: **/*.log

[INFO] --- apache-rat-plugin:0.7:check (default) @ apacheds-core-constants ---
[INFO] Installing <https://builds.apache.org/hudson/job/dir-apacheds-jdk15-ubuntu-deploy/ws/trunk/core-constants/target/apacheds-core-constants-1.5.8-SNAPSHOT.jar>
to /home/hudson/.m2/repository/org/apache/directory/server/apacheds-core-constants/1.5.8-SNAPSHOT/apacheds-core-constants-1.5.8-SNAPSHOT.jar
[INFO] 
[INFO] --- maven-install-plugin:2.3.1:install (default-install) @ apacheds-core-constants
---
[INFO] Installing <https://builds.apache.org/hudson/job/dir-apacheds-jdk15-ubuntu-deploy/ws/trunk/core-constants/pom.xml>
to /home/hudson/.m2/repository/org/apache/directory/server/apacheds-core-constants/1.5.8-SNAPSHOT/apacheds-core-constants-1.5.8-SNAPSHOT.pom
[INFO] Downloading: https://repository.apache.org/content/repositories/snapshots/org/apache/directory/server/apacheds-core-constants/1.5.8-SNAPSHOT/maven-metadata.xml

[INFO] --- maven-deploy-plugin:2.5:deploy (default-deploy) @ apacheds-core-constants ---
Downloaded: https://repository.apache.org/content/repositories/snapshots/org/apache/directory/server/apacheds-core-constants/1.5.8-SNAPSHOT/maven-metadata.xml
(806 B at 0.4 KB/sec)
Uploading: https://repository.apache.org/content/repositories/snapshots/org/apache/directory/server/apacheds-core-constants/1.5.8-SNAPSHOT/apacheds-core-constants-1.5.8-20110423.040217-215.jar
Uploaded: https://repository.apache.org/content/repositories/snapshots/org/apache/directory/server/apacheds-core-constants/1.5.8-SNAPSHOT/apacheds-core-constants-1.5.8-20110423.040217-215.jar
(11 KB at 30.3 KB/sec)
Uploading: https://repository.apache.org/content/repositories/snapshots/org/apache/directory/server/apacheds-core-constants/1.5.8-SNAPSHOT/apacheds-core-constants-1.5.8-20110423.040217-215.pom
Uploaded: https://repository.apache.org/content/repositories/snapshots/org/apache/directory/server/apacheds-core-constants/1.5.8-SNAPSHOT/apacheds-core-constants-1.5.8-20110423.040217-215.pom
(2 KB at 6.2 KB/sec)
Downloading: https://repository.apache.org/content/repositories/snapshots/org/apache/directory/server/apacheds-core-constants/maven-metadata.xml
Downloaded: https://repository.apache.org/content/repositories/snapshots/org/apache/directory/server/apacheds-core-constants/maven-metadata.xml
(430 B at 3.1 KB/sec)
Uploading: https://repository.apache.org/content/repositories/snapshots/org/apache/directory/server/apacheds-core-constants/1.5.8-SNAPSHOT/maven-metadata.xml
Uploaded: https://repository.apache.org/content/repositories/snapshots/org/apache/directory/server/apacheds-core-constants/1.5.8-SNAPSHOT/maven-metadata.xml
(806 B at 3.9 KB/sec)
Uploading: https://repository.apache.org/content/repositories/snapshots/org/apache/directory/server/apacheds-core-constants/maven-metadata.xml
Uploaded: https://repository.apache.org/content/repositories/snapshots/org/apache/directory/server/apacheds-core-constants/maven-metadata.xml
(430 B at 2.0 KB/sec)
projectSucceeded org.apache.directory.server:apacheds-core-constants:1.5.8-SNAPSHOT
[JENKINS] Archiving <https://builds.apache.org/hudson/job/dir-apacheds-jdk15-ubuntu-deploy/ws/trunk/core-constants/pom.xml>
to /home/hudson/hudson/jobs/dir-apacheds-jdk15-ubuntu-deploy/modules/org.apache.directory.server$apacheds-core-constants/builds/2011-04-23_04-01-04/archive/org.apache.directory.server/apacheds-core-constants/1.5.8-SNAPSHOT/apacheds-core-constants-1.5.8-SNAPSHOT.pom
[JENKINS] Archiving <https://builds.apache.org/hudson/job/dir-apacheds-jdk15-ubuntu-deploy/ws/trunk/core-constants/target/apacheds-core-constants-1.5.8-SNAPSHOT.jar>
to /home/hudson/hudson/jobs/dir-apacheds-jdk15-ubuntu-deploy/modules/org.apache.directory.server$apacheds-core-constants/builds/2011-04-23_04-01-04/archive/org.apache.directory.server/apacheds-core-constants/1.5.8-20110423.040217-215/apacheds-core-constants-1.5.8-20110423.040217-215.jar
[INFO]                                                                         
[INFO] ------------------------------------------------------------------------
[INFO] Building ApacheDS Core API 1.5.8-SNAPSHOT
[INFO] ------------------------------------------------------------------------
Downloading: http://repository.apache.org/snapshots/org/apache/directory/shared/shared-ldap-client-api/1.0.0-M3-SNAPSHOT/maven-metadata.xml
Downloaded: http://repository.apache.org/snapshots/org/apache/directory/shared/shared-ldap-client-api/1.0.0-M3-SNAPSHOT/maven-metadata.xml
(811 B at 5.7 KB/sec)
Downloading: http://repository.apache.org/snapshots/org/apache/directory/shared/shared-ldap-client-parent/1.0.0-M3-SNAPSHOT/maven-metadata.xml
Downloaded: http://repository.apache.org/snapshots/org/apache/directory/shared/shared-ldap-client-parent/1.0.0-M3-SNAPSHOT/maven-metadata.xml
(637 B at 4.9 KB/sec)
Downloading: http://repository.apache.org/snapshots/org/apache/directory/shared/shared-ldap-parent/1.0.0-M3-SNAPSHOT/maven-metadata.xml
Downloaded: http://repository.apache.org/snapshots/org/apache/directory/shared/shared-ldap-parent/1.0.0-M3-SNAPSHOT/maven-metadata.xml
(630 B at 5.4 KB/sec)
Downloading: http://repository.apache.org/snapshots/org/apache/directory/shared/shared-parent/1.0.0-M3-SNAPSHOT/maven-metadata.xml
Downloaded: http://repository.apache.org/snapshots/org/apache/directory/shared/shared-parent/1.0.0-M3-SNAPSHOT/maven-metadata.xml
(625 B at 7.5 KB/sec)
Downloading: http://repository.apache.org/snapshots/org/apache/directory/shared/shared-ldap-schema-data/1.0.0-M3-SNAPSHOT/maven-metadata.xml
Downloaded: http://repository.apache.org/snapshots/org/apache/directory/shared/shared-ldap-schema-data/1.0.0-M3-SNAPSHOT/maven-metadata.xml
(812 B at 8.9 KB/sec)
Downloading: http://repository.apache.org/snapshots/org/apache/directory/shared/shared-ldap-schema-parent/1.0.0-M3-SNAPSHOT/maven-metadata.xml
Downloaded: http://repository.apache.org/snapshots/org/apache/directory/shared/shared-ldap-schema-parent/1.0.0-M3-SNAPSHOT/maven-metadata.xml
(637 B at 7.5 KB/sec)
Downloading: http://repository.apache.org/snapshots/org/apache/directory/shared/shared-i18n/1.0.0-M3-SNAPSHOT/maven-metadata.xml
Downloaded: http://repository.apache.org/snapshots/org/apache/directory/shared/shared-i18n/1.0.0-M3-SNAPSHOT/maven-metadata.xml
(800 B at 4.8 KB/sec)
Downloading: http://repository.apache.org/snapshots/org/apache/directory/shared/shared-ldap-extras-aci/1.0.0-M3-SNAPSHOT/maven-metadata.xml
Downloaded: http://repository.apache.org/snapshots/org/apache/directory/shared/shared-ldap-extras-aci/1.0.0-M3-SNAPSHOT/maven-metadata.xml
(811 B at 7.6 KB/sec)
Downloading: http://repository.apache.org/snapshots/org/apache/directory/shared/shared-ldap-extras-parent/1.0.0-M3-SNAPSHOT/maven-metadata.xml
Downloaded: http://repository.apache.org/snapshots/org/apache/directory/shared/shared-ldap-extras-parent/1.0.0-M3-SNAPSHOT/maven-metadata.xml
(637 B at 6.5 KB/sec)
Downloading: http://repository.apache.org/snapshots/org/apache/directory/shared/shared-util/1.0.0-M3-SNAPSHOT/maven-metadata.xml
Downloaded: http://repository.apache.org/snapshots/org/apache/directory/shared/shared-util/1.0.0-M3-SNAPSHOT/maven-metadata.xml
(800 B at 8.7 KB/sec)
Downloading: http://repository.apache.org/snapshots/org/apache/directory/shared/shared-ldap-model/1.0.0-M3-SNAPSHOT/maven-metadata.xml
Downloaded: http://repository.apache.org/snapshots/org/apache/directory/shared/shared-ldap-model/1.0.0-M3-SNAPSHOT/maven-metadata.xml
(806 B at 5.6 KB/sec)
Downloading: http://repository.apache.org/snapshots/org/apache/directory/shared/shared-asn1-api/1.0.0-M3-SNAPSHOT/maven-metadata.xml
Downloaded: http://repository.apache.org/snapshots/org/apache/directory/shared/shared-asn1-api/1.0.0-M3-SNAPSHOT/maven-metadata.xml
(804 B at 8.6 KB/sec)
Downloading: http://repository.apache.org/snapshots/org/apache/directory/shared/shared-asn1-parent/1.0.0-M3-SNAPSHOT/maven-metadata.xml
Downloaded: http://repository.apache.org/snapshots/org/apache/directory/shared/shared-asn1-parent/1.0.0-M3-SNAPSHOT/maven-metadata.xml
(630 B at 6.0 KB/sec)
Downloading: http://repository.apache.org/snapshots/org/apache/directory/shared/shared-asn1-ber/1.0.0-M3-SNAPSHOT/maven-metadata.xml
Downloaded: http://repository.apache.org/snapshots/org/apache/directory/shared/shared-asn1-ber/1.0.0-M3-SNAPSHOT/maven-metadata.xml
(804 B at 9.9 KB/sec)
Downloading: http://repository.apache.org/snapshots/org/apache/directory/shared/shared-ldap-codec-core/1.0.0-M3-SNAPSHOT/maven-metadata.xml
Downloaded: http://repository.apache.org/snapshots/org/apache/directory/shared/shared-ldap-codec-core/1.0.0-M3-SNAPSHOT/maven-metadata.xml
(811 B at 9.5 KB/sec)
Downloading: http://repository.apache.org/snapshots/org/apache/directory/shared/shared-ldap-codec-parent/1.0.0-M3-SNAPSHOT/maven-metadata.xml
Downloaded: http://repository.apache.org/snapshots/org/apache/directory/shared/shared-ldap-codec-parent/1.0.0-M3-SNAPSHOT/maven-metadata.xml
(636 B at 7.9 KB/sec)
Downloading: http://repository.apache.org/snapshots/org/apache/directory/shared/shared-ldap-codec-standalone/1.0.0-M3-SNAPSHOT/maven-metadata.xml
Downloaded: http://repository.apache.org/snapshots/org/apache/directory/shared/shared-ldap-codec-standalone/1.0.0-M3-SNAPSHOT/maven-metadata.xml
(817 B at 10.2 KB/sec)
Downloading: http://repository.apache.org/snapshots/org/apache/directory/shared/shared-ldap-net-mina/1.0.0-M3-SNAPSHOT/maven-metadata.xml
Downloaded: http://repository.apache.org/snapshots/org/apache/directory/shared/shared-ldap-net-mina/1.0.0-M3-SNAPSHOT/maven-metadata.xml
(809 B at 9.6 KB/sec)
Downloading: http://repository.apache.org/snapshots/org/apache/directory/shared/shared-ldap-net-parent/1.0.0-M3-SNAPSHOT/maven-metadata.xml
Downloaded: http://repository.apache.org/snapshots/org/apache/directory/shared/shared-ldap-net-parent/1.0.0-M3-SNAPSHOT/maven-metadata.xml
(634 B at 7.6 KB/sec)
Downloading: http://repository.apache.org/snapshots/org/apache/directory/shared/shared-ldap-extras-util/1.0.0-M3-SNAPSHOT/maven-metadata.xml
Downloaded: http://repository.apache.org/snapshots/org/apache/directory/shared/shared-ldap-extras-util/1.0.0-M3-SNAPSHOT/maven-metadata.xml
(812 B at 9.6 KB/sec)
[INFO] [INFO] Deleting <https://builds.apache.org/hudson/job/dir-apacheds-jdk15-ubuntu-deploy/ws/trunk/core-api/target>

[INFO] --- maven-clean-plugin:2.4.1:clean (default-clean) @ apacheds-core-api ---
[INFO] 
[INFO] --- maven-remote-resources-plugin:1.2:process (default) @ apacheds-core-api ---Downloading:
http://repository.apache.org/snapshots/org/apache/directory/shared/shared-ldap-schema-data/1.0.0-M3-SNAPSHOT/maven-metadata.xml

Downloaded: http://repository.apache.org/snapshots/org/apache/directory/shared/shared-ldap-schema-data/1.0.0-M3-SNAPSHOT/maven-metadata.xml
(812 B at 9.7 KB/sec)
Downloading: http://repository.apache.org/snapshots/org/apache/directory/shared/shared-i18n/1.0.0-M3-SNAPSHOT/maven-metadata.xml
Downloaded: http://repository.apache.org/snapshots/org/apache/directory/shared/shared-i18n/1.0.0-M3-SNAPSHOT/maven-metadata.xml
(800 B at 8.9 KB/sec)
Downloading: http://repository.apache.org/snapshots/org/apache/directory/shared/shared-ldap-extras-aci/1.0.0-M3-SNAPSHOT/maven-metadata.xml
Downloaded: http://repository.apache.org/snapshots/org/apache/directory/shared/shared-ldap-extras-aci/1.0.0-M3-SNAPSHOT/maven-metadata.xml
(811 B at 9.9 KB/sec)
Downloading: http://repository.apache.org/snapshots/org/apache/directory/shared/shared-util/1.0.0-M3-SNAPSHOT/maven-metadata.xml
Downloaded: http://repository.apache.org/snapshots/org/apache/directory/shared/shared-util/1.0.0-M3-SNAPSHOT/maven-metadata.xml
(800 B at 10.1 KB/sec)
Downloading: http://repository.apache.org/snapshots/org/apache/directory/shared/shared-ldap-model/1.0.0-M3-SNAPSHOT/maven-metadata.xml
Downloaded: http://repository.apache.org/snapshots/org/apache/directory/shared/shared-ldap-model/1.0.0-M3-SNAPSHOT/maven-metadata.xml
(806 B at 10.0 KB/sec)
Downloading: http://repository.apache.org/snapshots/org/apache/directory/shared/shared-asn1-api/1.0.0-M3-SNAPSHOT/maven-metadata.xml
Downloaded: http://repository.apache.org/snapshots/org/apache/directory/shared/shared-asn1-api/1.0.0-M3-SNAPSHOT/maven-metadata.xml
(804 B at 9.0 KB/sec)
Downloading: http://repository.apache.org/snapshots/org/apache/directory/shared/shared-asn1-ber/1.0.0-M3-SNAPSHOT/maven-metadata.xml
Downloaded: http://repository.apache.org/snapshots/org/apache/directory/shared/shared-asn1-ber/1.0.0-M3-SNAPSHOT/maven-metadata.xml
(804 B at 9.9 KB/sec)
Downloading: http://repository.apache.org/snapshots/org/apache/directory/shared/shared-ldap-codec-core/1.0.0-M3-SNAPSHOT/maven-metadata.xml
Downloaded: http://repository.apache.org/snapshots/org/apache/directory/shared/shared-ldap-codec-core/1.0.0-M3-SNAPSHOT/maven-metadata.xml
(811 B at 9.5 KB/sec)
Downloading: http://repository.apache.org/snapshots/org/apache/directory/shared/shared-ldap-net-mina/1.0.0-M3-SNAPSHOT/maven-metadata.xml
Downloaded: http://repository.apache.org/snapshots/org/apache/directory/shared/shared-ldap-net-mina/1.0.0-M3-SNAPSHOT/maven-metadata.xml
(809 B at 9.6 KB/sec)
Downloading: http://repository.apache.org/snapshots/org/apache/directory/shared/shared-ldap-codec-standalone/1.0.0-M3-SNAPSHOT/maven-metadata.xml
Downloaded: http://repository.apache.org/snapshots/org/apache/directory/shared/shared-ldap-codec-standalone/1.0.0-M3-SNAPSHOT/maven-metadata.xml
(817 B at 9.6 KB/sec)
Downloading: http://repository.apache.org/snapshots/org/apache/directory/shared/shared-ldap-client-api/1.0.0-M3-SNAPSHOT/maven-metadata.xml
Downloaded: http://repository.apache.org/snapshots/org/apache/directory/shared/shared-ldap-client-api/1.0.0-M3-SNAPSHOT/maven-metadata.xml
(811 B at 9.4 KB/sec)
Downloading: http://repository.apache.org/snapshots/org/apache/directory/shared/shared-ldap-extras-util/1.0.0-M3-SNAPSHOT/maven-metadata.xml
Downloaded: http://repository.apache.org/snapshots/org/apache/directory/shared/shared-ldap-extras-util/1.0.0-M3-SNAPSHOT/maven-metadata.xml
(812 B at 9.6 KB/sec)
[debug] execute contextualize
[INFO] [INFO] Using 'UTF-8' encoding to copy filtered resources.
[INFO] Copying 1 resource
[INFO] Copying 3 resources

[INFO] --- maven-resources-plugin:2.5:resources (default-resources) @ apacheds-core-api ---
[INFO] 
[INFO] --- maven-compiler-plugin:2.3.2:compile (default-compile) @ apacheds-core-api ---
[INFO] Compiling 119 source files to <https://builds.apache.org/hudson/job/dir-apacheds-jdk15-ubuntu-deploy/ws/trunk/core-api/target/classes>
[INFO] -------------------------------------------------------------
[ERROR] COMPILATION ERROR : 
[INFO] -------------------------------------------------------------
[ERROR] <https://builds.apache.org/hudson/job/dir-apacheds-jdk15-ubuntu-deploy/ws/trunk/core-api/src/main/java/org/apache/directory/server/core/LdapCoreSessionConnection.java>:[201,30]
cannot find symbol
symbol  : method setDiagnosticMessage(java.lang.String)
location: interface org.apache.directory.shared.ldap.model.message.LdapResult
[ERROR] <https://builds.apache.org/hudson/job/dir-apacheds-jdk15-ubuntu-deploy/ws/trunk/core-api/src/main/java/org/apache/directory/server/core/LdapCoreSessionConnection.java>:[361,30]
cannot find symbol
symbol  : method setDiagnosticMessage(java.lang.String)
location: interface org.apache.directory.shared.ldap.model.message.LdapResult
[ERROR] <https://builds.apache.org/hudson/job/dir-apacheds-jdk15-ubuntu-deploy/ws/trunk/core-api/src/main/java/org/apache/directory/server/core/LdapCoreSessionConnection.java>:[614,30]
cannot find symbol
symbol  : method setDiagnosticMessage(java.lang.String)
location: interface org.apache.directory.shared.ldap.model.message.LdapResult
[ERROR] <https://builds.apache.org/hudson/job/dir-apacheds-jdk15-ubuntu-deploy/ws/trunk/core-api/src/main/java/org/apache/directory/server/core/LdapCoreSessionConnection.java>:[666,30]
cannot find symbol
symbol  : method setDiagnosticMessage(java.lang.String)
location: interface org.apache.directory.shared.ldap.model.message.LdapResult
[ERROR] <https://builds.apache.org/hudson/job/dir-apacheds-jdk15-ubuntu-deploy/ws/trunk/core-api/src/main/java/org/apache/directory/server/core/LdapCoreSessionConnection.java>:[701,30]
cannot find symbol
symbol  : method setDiagnosticMessage(java.lang.String)
location: interface org.apache.directory.shared.ldap.model.message.LdapResult
[ERROR] <https://builds.apache.org/hudson/job/dir-apacheds-jdk15-ubuntu-deploy/ws/trunk/core-api/src/main/java/org/apache/directory/server/core/LdapCoreSessionConnection.java>:[732,18]
cannot find symbol
symbol  : method setDiagnosticMessage(java.lang.String)
location: interface org.apache.directory.shared.ldap.model.message.LdapResult
[ERROR] <https://builds.apache.org/hudson/job/dir-apacheds-jdk15-ubuntu-deploy/ws/trunk/core-api/src/main/java/org/apache/directory/server/core/LdapCoreSessionConnection.java>:[768,22]
cannot find symbol
symbol  : method setDiagnosticMessage(java.lang.String)
location: interface org.apache.directory.shared.ldap.model.message.LdapResult
[ERROR] <https://builds.apache.org/hudson/job/dir-apacheds-jdk15-ubuntu-deploy/ws/trunk/core-api/src/main/java/org/apache/directory/server/core/LdapCoreSessionConnection.java>:[779,30]
cannot find symbol
symbol  : method setDiagnosticMessage(java.lang.String)
location: interface org.apache.directory.shared.ldap.model.message.LdapResult
[ERROR] <https://builds.apache.org/hudson/job/dir-apacheds-jdk15-ubuntu-deploy/ws/trunk/core-api/src/main/java/org/apache/directory/server/core/LdapCoreSessionConnection.java>:[1201,15]
cannot find symbol
symbol  : method setDiagnosticMessage(java.lang.String)
location: interface org.apache.directory.shared.ldap.model.message.LdapResult
[INFO] 9 errors 
[INFO] -------------------------------------------------------------
mojoFailed org.apache.maven.plugins:maven-compiler-plugin:2.3.2(default-compile)
projectFailed org.apache.directory.server:apacheds-core-api:1.5.8-SNAPSHOT
[JENKINS] Archiving <https://builds.apache.org/hudson/job/dir-apacheds-jdk15-ubuntu-deploy/ws/trunk/core-api/pom.xml>
to /home/hudson/hudson/jobs/dir-apacheds-jdk15-ubuntu-deploy/modules/org.apache.directory.server$apacheds-core-api/builds/2011-04-23_04-01-04/archive/org.apache.directory.server/apacheds-core-api/1.5.8-SNAPSHOT/apacheds-core-api-1.5.8-SNAPSHOT.pom
sessionEnded
[INFO] ------------------------------------------------------------------------
[INFO] Reactor Summary:
[INFO] 
[INFO] ApacheDS .......................................... SUCCESS [46.166s]
[INFO] ApacheDS I18n ..................................... SUCCESS [6.622s]
[INFO] ApacheDS Core Constants ........................... SUCCESS [5.691s]
[INFO] ApacheDS Core API ................................. FAILURE [7.145s]
[INFO] ApacheDS Core ..................................... SKIPPED
[INFO] ApacheDS Core AVL ................................. SKIPPED
[INFO] ApacheDS Generalized (X) DBM Partition ............ SKIPPED
[INFO] ApacheDS LDIF Partition ........................... SKIPPED
[INFO] ApacheDS JDBM implementation ...................... SKIPPED
[INFO] ApacheDS JDBM Partition ........................... SKIPPED
[INFO] ApacheDS Core Annotations ......................... SKIPPED
[INFO] ApacheDS Core JNDI ................................ SKIPPED
[INFO] ApacheDS Protocol Shared .......................... SKIPPED
[INFO] ApacheDS Protocol Kerberos Codec .................. SKIPPED
[INFO] ApacheDS Interceptors for Kerberos ................ SKIPPED
[INFO] ApacheDS Protocol Dhcp ............................ SKIPPED
[INFO] ApacheDS Protocol Dns ............................. SKIPPED
[INFO] ApacheDS Protocol Kerberos ........................ SKIPPED
[INFO] ApacheDS Protocol Ldap ............................ SKIPPED
[INFO] ApacheDS Protocol Ntp ............................. SKIPPED
[INFO] Apacheds Server Annotations ....................... SKIPPED
[INFO] ApacheDS Server Config ............................ SKIPPED
[INFO] ApacheDS Server JNDI .............................. SKIPPED
[INFO] ApacheDS Server Replication Service ............... SKIPPED
[INFO] ApacheDS Test Framework ........................... SKIPPED
[INFO] ApacheDS Generalized (X) DBM Tools ................ SKIPPED
[INFO] ApacheDS All ...................................... SKIPPED
[INFO] ApacheDS Core Integration ......................... SKIPPED
[INFO] ApacheDS Server Integration ....................... SKIPPED
[INFO] ApacheDS DirectoryService-WebApp bridge ........... SKIPPED
[INFO] ApacheDS Jetty HTTP Server Integration ............ SKIPPED
[INFO] ApacheDS Service Builder .......................... SKIPPED
[INFO] ApacheDS Protocol Kerberos Test ................... SKIPPED
[INFO] Apache Directory LDAP Client API test ............. SKIPPED
[INFO] ApacheDS Service .................................. SKIPPED
[INFO] ApacheDS Wrapper .................................. SKIPPED
[INFO] ------------------------------------------------------------------------
[INFO] BUILD FAILURE
[INFO] ------------------------------------------------------------------------
[INFO] Total time: 1:11.326s
[INFO] Finished at: Sat Apr 23 04:02:27 UTC 2011
[INFO] Final Memory: 24M/69M
[INFO] ------------------------------------------------------------------------
maven builder waiting
mavenExecutionResult exceptions not empty
org.apache.maven.lifecycle.LifecycleExecutionException: Failed to execute goal org.apache.maven.plugins:maven-compiler-plugin:2.3.2:compile
(default-compile) on project apacheds-core-api: Compilation failure
	at org.apache.maven.lifecycle.internal.MojoExecutor.execute(MojoExecutor.java:213)
	at org.apache.maven.lifecycle.internal.MojoExecutor.execute(MojoExecutor.java:153)
	at org.apache.maven.lifecycle.internal.MojoExecutor.execute(MojoExecutor.java:145)
	at org.apache.maven.lifecycle.internal.LifecycleModuleBuilder.buildProject(LifecycleModuleBuilder.java:84)
	at org.apache.maven.lifecycle.internal.LifecycleModuleBuilder.buildProject(LifecycleModuleBuilder.java:59)
	at org.apache.maven.lifecycle.internal.LifecycleStarter.singleThreadedBuild(LifecycleStarter.java:183)
	at org.apache.maven.lifecycle.internal.LifecycleStarter.execute(LifecycleStarter.java:161)
	at org.apache.maven.DefaultMaven.doExecute(DefaultMaven.java:319)
	at org.apache.maven.DefaultMaven.execute(DefaultMaven.java:156)
	at org.jvnet.hudson.maven3.launcher.Maven3Launcher.main(Maven3Launcher.java:79)
	at sun.reflect.NativeMethodAccessorImpl.invoke0(Native Method)
	at sun.reflect.NativeMethodAccessorImpl.invoke(NativeMethodAccessorImpl.java:39)
	at sun.reflect.DelegatingMethodAccessorImpl.invoke(DelegatingMethodAccessorImpl.java:25)
	at java.lang.reflect.Method.invoke(Method.java:592)
	at org.codehaus.plexus.classworlds.launcher.Launcher.launchStandard(Launcher.java:329)
	at org.codehaus.plexus.classworlds.launcher.Launcher.launch(Launcher.java:239)
	at org.jvnet.hudson.maven3.agent.Maven3Main.launch(Maven3Main.java:146)
	at hudson.maven.Maven3Builder.call(Maven3Builder.java:126)
	at hudson.maven.Maven3Builder.call(Maven3Builder.java:73)
	at hudson.remoting.UserRequest.perform(UserRequest.java:118)
	at hudson.remoting.UserRequest.perform(UserRequest.java:48)
	at hudson.remoting.Request$2.run(Request.java:270)
	at java.util.concurrent.Executors$RunnableAdapter.call(Executors.java:417)
	at java.util.concurrent.FutureTask$Sync.innerRun(FutureTask.java:269)
	at java.util.concurrent.FutureTask.run(FutureTask.java:123)
	at java.util.concurrent.ThreadPoolExecutor$Worker.runTask(ThreadPoolExecutor.java:651)
	at java.util.concurrent.ThreadPoolExecutor$Worker.run(ThreadPoolExecutor.java:676)
	at java.lang.Thread.run(Thread.java:595)
Caused by: org.apache.maven.plugin.CompilationFailureException: Compilation failure
	at org.apache.maven.plugin.AbstractCompilerMojo.execute(AbstractCompilerMojo.java:656)
	at org.apache.maven.plugin.CompilerMojo.execute(CompilerMojo.java:128)
	at org.apache.maven.plugin.DefaultBuildPluginManager.executeMojo(DefaultBuildPluginManager.java:101)
	at org.apache.maven.lifecycle.internal.MojoExecutor.execute(MojoExecutor.java:209)
	... 27 more
Sending e-mails to: notifications@directory.apache.org
channel stopped


Mime
View raw message