directory-notifications mailing list archives

Site index · List index
Message view « Date » · « Thread »
Top « Date » · « Thread »
From Apache Hudson Server <hud...@hudson.apache.org>
Subject Build failed in Jenkins: dir-apacheds-jdk15-ubuntu-deploy #201
Date Wed, 09 Mar 2011 04:13:56 GMT
See <https://hudson.apache.org/hudson/job/dir-apacheds-jdk15-ubuntu-deploy/201/changes>

Changes:

[elecharny] Reworked the Serialization to remove the duplicated code, and to have the Externalizable
interface implemented correctly.
Done for Values, Ava, Rdn, Dn.

------------------------------------------
[...truncated 3215 lines...]
[INFO] Including org.apache.directory.server:apacheds-server-annotations:jar:1.5.8-SNAPSHOT
in the shaded jar.
[INFO] Including org.apache.directory.server:apacheds-server-config:jar:1.5.8-SNAPSHOT in
the shaded jar.
[INFO] Including org.apache.directory.server:apacheds-server-jndi:jar:1.5.8-SNAPSHOT in the
shaded jar.
[INFO] Including org.apache.directory.server:apacheds-server-replication:jar:1.5.8-SNAPSHOT
in the shaded jar.
[INFO] Including org.apache.directory.server:apacheds-test-framework:jar:1.5.8-SNAPSHOT in
the shaded jar.
[INFO] Including org.apache.directory.server:apacheds-xdbm-partition:jar:1.5.8-SNAPSHOT in
the shaded jar.
[INFO] Including org.apache.directory.server:apacheds-xdbm-tools:jar:1.5.8-SNAPSHOT in the
shaded jar.
[INFO] Including org.slf4j:slf4j-api:jar:1.6.1 in the shaded jar.
[INFO] Including log4j:log4j:jar:1.2.16 in the shaded jar.
[WARNING] We have a duplicate org/apache/commons/logging/Log.class in /home/hudson/.m2/repository/commons-logging/commons-logging/1.1/commons-logging-1.1.jar
[WARNING] We have a duplicate org/apache/commons/logging/LogConfigurationException.class in
/home/hudson/.m2/repository/commons-logging/commons-logging/1.1/commons-logging-1.1.jar
[WARNING] We have a duplicate org/apache/commons/logging/LogFactory$1.class in /home/hudson/.m2/repository/commons-logging/commons-logging/1.1/commons-logging-1.1.jar
[WARNING] We have a duplicate org/apache/commons/logging/LogFactory$2.class in /home/hudson/.m2/repository/commons-logging/commons-logging/1.1/commons-logging-1.1.jar
[WARNING] We have a duplicate org/apache/commons/logging/LogFactory$3.class in /home/hudson/.m2/repository/commons-logging/commons-logging/1.1/commons-logging-1.1.jar
[WARNING] We have a duplicate org/apache/commons/logging/LogFactory$4.class in /home/hudson/.m2/repository/commons-logging/commons-logging/1.1/commons-logging-1.1.jar
[WARNING] We have a duplicate org/apache/commons/logging/LogFactory$5.class in /home/hudson/.m2/repository/commons-logging/commons-logging/1.1/commons-logging-1.1.jar
[WARNING] We have a duplicate org/apache/commons/logging/LogFactory.class in /home/hudson/.m2/repository/commons-logging/commons-logging/1.1/commons-logging-1.1.jar
[WARNING] We have a duplicate org/apache/commons/logging/LogSource.class in /home/hudson/.m2/repository/commons-logging/commons-logging/1.1/commons-logging-1.1.jar
[WARNING] We have a duplicate org/apache/commons/logging/impl/Jdk14Logger.class in /home/hudson/.m2/repository/commons-logging/commons-logging/1.1/commons-logging-1.1.jar
[WARNING] We have a duplicate org/apache/commons/logging/impl/LogFactoryImpl.class in /home/hudson/.m2/repository/commons-logging/commons-logging/1.1/commons-logging-1.1.jar
[WARNING] We have a duplicate org/apache/commons/logging/impl/NoOpLog.class in /home/hudson/.m2/repository/commons-logging/commons-logging/1.1/commons-logging-1.1.jar
[WARNING] We have a duplicate org/apache/commons/logging/impl/SimpleLog$1.class in /home/hudson/.m2/repository/commons-logging/commons-logging/1.1/commons-logging-1.1.jar
[WARNING] We have a duplicate org/apache/commons/logging/impl/SimpleLog.class in /home/hudson/.m2/repository/commons-logging/commons-logging/1.1/commons-logging-1.1.jar
[WARNING] We have a duplicate org/apache/commons/logging/impl/WeakHashtable$1.class in /home/hudson/.m2/repository/commons-logging/commons-logging/1.1/commons-logging-1.1.jar
[WARNING] We have a duplicate org/apache/commons/logging/impl/WeakHashtable$2.class in /home/hudson/.m2/repository/commons-logging/commons-logging/1.1/commons-logging-1.1.jar
[WARNING] We have a duplicate org/apache/commons/logging/impl/WeakHashtable$Entry.class in
/home/hudson/.m2/repository/commons-logging/commons-logging/1.1/commons-logging-1.1.jar
[WARNING] We have a duplicate org/apache/commons/logging/impl/WeakHashtable$Referenced.class
in /home/hudson/.m2/repository/commons-logging/commons-logging/1.1/commons-logging-1.1.jar
[WARNING] We have a duplicate org/apache/commons/logging/impl/WeakHashtable$WeakKey.class
in /home/hudson/.m2/repository/commons-logging/commons-logging/1.1/commons-logging-1.1.jar
[WARNING] We have a duplicate org/apache/commons/logging/impl/WeakHashtable.class in /home/hudson/.m2/repository/commons-logging/commons-logging/1.1/commons-logging-1.1.jar
[WARNING] We have a duplicate org/apache/activemq/protobuf/AsciiBuffer.class in /home/hudson/.m2/repository/org/apache/activemq/protobuf/activemq-protobuf/1.0/activemq-protobuf-1.0.jar
[WARNING] We have a duplicate org/apache/activemq/protobuf/BaseMessage.class in /home/hudson/.m2/repository/org/apache/activemq/protobuf/activemq-protobuf/1.0/activemq-protobuf-1.0.jar
[WARNING] We have a duplicate org/apache/activemq/protobuf/Buffer.class in /home/hudson/.m2/repository/org/apache/activemq/protobuf/activemq-protobuf/1.0/activemq-protobuf-1.0.jar
[WARNING] We have a duplicate org/apache/activemq/protobuf/BufferInputStream.class in /home/hudson/.m2/repository/org/apache/activemq/protobuf/activemq-protobuf/1.0/activemq-protobuf-1.0.jar
[WARNING] We have a duplicate org/apache/activemq/protobuf/BufferOutputStream.class in /home/hudson/.m2/repository/org/apache/activemq/protobuf/activemq-protobuf/1.0/activemq-protobuf-1.0.jar
[WARNING] We have a duplicate org/apache/activemq/protobuf/CodedInputStream.class in /home/hudson/.m2/repository/org/apache/activemq/protobuf/activemq-protobuf/1.0/activemq-protobuf-1.0.jar
[WARNING] We have a duplicate org/apache/activemq/protobuf/CodedOutputStream.class in /home/hudson/.m2/repository/org/apache/activemq/protobuf/activemq-protobuf/1.0/activemq-protobuf-1.0.jar
[WARNING] We have a duplicate org/apache/activemq/protobuf/compiler/AltJavaGenerator$1.class
in /home/hudson/.m2/repository/org/apache/activemq/protobuf/activemq-protobuf/1.0/activemq-protobuf-1.0.jar
[WARNING] We have a duplicate org/apache/activemq/protobuf/compiler/AltJavaGenerator$2.class
in /home/hudson/.m2/repository/org/apache/activemq/protobuf/activemq-protobuf/1.0/activemq-protobuf-1.0.jar
[WARNING] We have a duplicate org/apache/activemq/protobuf/compiler/AltJavaGenerator$3.class
in /home/hudson/.m2/repository/org/apache/activemq/protobuf/activemq-protobuf/1.0/activemq-protobuf-1.0.jar
[WARNING] We have a duplicate org/apache/activemq/protobuf/compiler/AltJavaGenerator$Closure.class
in /home/hudson/.m2/repository/org/apache/activemq/protobuf/activemq-protobuf/1.0/activemq-protobuf-1.0.jar
[WARNING] We have a duplicate org/apache/activemq/protobuf/compiler/AltJavaGenerator.class
in /home/hudson/.m2/repository/org/apache/activemq/protobuf/activemq-protobuf/1.0/activemq-protobuf-1.0.jar
[WARNING] We have a duplicate org/apache/activemq/protobuf/compiler/CommandLineSupport.class
in /home/hudson/.m2/repository/org/apache/activemq/protobuf/activemq-protobuf/1.0/activemq-protobuf-1.0.jar
[WARNING] We have a duplicate org/apache/activemq/protobuf/compiler/CompilerException.class
in /home/hudson/.m2/repository/org/apache/activemq/protobuf/activemq-protobuf/1.0/activemq-protobuf-1.0.jar
[WARNING] We have a duplicate org/apache/activemq/protobuf/compiler/EnumDescriptor.class in
/home/hudson/.m2/repository/org/apache/activemq/protobuf/activemq-protobuf/1.0/activemq-protobuf-1.0.jar
[WARNING] We have a duplicate org/apache/activemq/protobuf/compiler/EnumFieldDescriptor.class
in /home/hudson/.m2/repository/org/apache/activemq/protobuf/activemq-protobuf/1.0/activemq-protobuf-1.0.jar
[WARNING] We have a duplicate org/apache/activemq/protobuf/compiler/ExtensionsDescriptor.class
in /home/hudson/.m2/repository/org/apache/activemq/protobuf/activemq-protobuf/1.0/activemq-protobuf-1.0.jar
[WARNING] We have a duplicate org/apache/activemq/protobuf/compiler/FieldDescriptor.class
in /home/hudson/.m2/repository/org/apache/activemq/protobuf/activemq-protobuf/1.0/activemq-protobuf-1.0.jar
[WARNING] We have a duplicate org/apache/activemq/protobuf/compiler/IntrospectionSupport.class
in /home/hudson/.m2/repository/org/apache/activemq/protobuf/activemq-protobuf/1.0/activemq-protobuf-1.0.jar
[WARNING] We have a duplicate org/apache/activemq/protobuf/compiler/JavaGenerator$1.class
in /home/hudson/.m2/repository/org/apache/activemq/protobuf/activemq-protobuf/1.0/activemq-protobuf-1.0.jar
[WARNING] We have a duplicate org/apache/activemq/protobuf/compiler/JavaGenerator$2.class
in /home/hudson/.m2/repository/org/apache/activemq/protobuf/activemq-protobuf/1.0/activemq-protobuf-1.0.jar
[WARNING] We have a duplicate org/apache/activemq/protobuf/compiler/JavaGenerator$3.class
in /home/hudson/.m2/repository/org/apache/activemq/protobuf/activemq-protobuf/1.0/activemq-protobuf-1.0.jar
[WARNING] We have a duplicate org/apache/activemq/protobuf/compiler/JavaGenerator$Closure.class
in /home/hudson/.m2/repository/org/apache/activemq/protobuf/activemq-protobuf/1.0/activemq-protobuf-1.0.jar
[WARNING] We have a duplicate org/apache/activemq/protobuf/compiler/JavaGenerator.class in
/home/hudson/.m2/repository/org/apache/activemq/protobuf/activemq-protobuf/1.0/activemq-protobuf-1.0.jar
[WARNING] We have a duplicate org/apache/activemq/protobuf/compiler/MessageDescriptor.class
in /home/hudson/.m2/repository/org/apache/activemq/protobuf/activemq-protobuf/1.0/activemq-protobuf-1.0.jar
[WARNING] We have a duplicate org/apache/activemq/protobuf/compiler/MethodDescriptor.class
in /home/hudson/.m2/repository/org/apache/activemq/protobuf/activemq-protobuf/1.0/activemq-protobuf-1.0.jar
[WARNING] We have a duplicate org/apache/activemq/protobuf/compiler/OptionDescriptor.class
in /home/hudson/.m2/repository/org/apache/activemq/protobuf/activemq-protobuf/1.0/activemq-protobuf-1.0.jar
[WARNING] We have a duplicate org/apache/activemq/protobuf/compiler/parser/ParseException.class
in /home/hudson/.m2/repository/org/apache/activemq/protobuf/activemq-protobuf/1.0/activemq-protobuf-1.0.jar
[WARNING] We have a duplicate org/apache/activemq/protobuf/compiler/parser/ProtoParser$1.class
in /home/hudson/.m2/repository/org/apache/activemq/protobuf/activemq-protobuf/1.0/activemq-protobuf-1.0.jar
[WARNING] We have a duplicate org/apache/activemq/protobuf/compiler/parser/ProtoParser$JJCalls.class
in /home/hudson/.m2/repository/org/apache/activemq/protobuf/activemq-protobuf/1.0/activemq-protobuf-1.0.jar
[WARNING] We have a duplicate org/apache/activemq/protobuf/compiler/parser/ProtoParser$LookaheadSuccess.class
in /home/hudson/.m2/repository/org/apache/activemq/protobuf/activemq-protobuf/1.0/activemq-protobuf-1.0.jar
[WARNING] We have a duplicate org/apache/activemq/protobuf/compiler/parser/ProtoParser.class
in /home/hudson/.m2/repository/org/apache/activemq/protobuf/activemq-protobuf/1.0/activemq-protobuf-1.0.jar
[WARNING] We have a duplicate org/apache/activemq/protobuf/compiler/parser/ProtoParserConstants.class
in /home/hudson/.m2/repository/org/apache/activemq/protobuf/activemq-protobuf/1.0/activemq-protobuf-1.0.jar
[WARNING] We have a duplicate org/apache/activemq/protobuf/compiler/parser/ProtoParserTokenManager.class
in /home/hudson/.m2/repository/org/apache/activemq/protobuf/activemq-protobuf/1.0/activemq-protobuf-1.0.jar
[WARNING] We have a duplicate org/apache/activemq/protobuf/compiler/parser/SimpleCharStream.class
in /home/hudson/.m2/repository/org/apache/activemq/protobuf/activemq-protobuf/1.0/activemq-protobuf-1.0.jar
[WARNING] We have a duplicate org/apache/activemq/protobuf/compiler/parser/Token.class in
/home/hudson/.m2/repository/org/apache/activemq/protobuf/activemq-protobuf/1.0/activemq-protobuf-1.0.jar
[WARNING] We have a duplicate org/apache/activemq/protobuf/compiler/parser/TokenMgrError.class
in /home/hudson/.m2/repository/org/apache/activemq/protobuf/activemq-protobuf/1.0/activemq-protobuf-1.0.jar
[WARNING] We have a duplicate org/apache/activemq/protobuf/compiler/ParserSupport.class in
/home/hudson/.m2/repository/org/apache/activemq/protobuf/activemq-protobuf/1.0/activemq-protobuf-1.0.jar
[WARNING] We have a duplicate org/apache/activemq/protobuf/compiler/ProtoDescriptor.class
in /home/hudson/.m2/repository/org/apache/activemq/protobuf/activemq-protobuf/1.0/activemq-protobuf-1.0.jar
[WARNING] We have a duplicate org/apache/activemq/protobuf/compiler/ProtoMojo$1.class in /home/hudson/.m2/repository/org/apache/activemq/protobuf/activemq-protobuf/1.0/activemq-protobuf-1.0.jar
[WARNING] We have a duplicate org/apache/activemq/protobuf/compiler/ProtoMojo.class in /home/hudson/.m2/repository/org/apache/activemq/protobuf/activemq-protobuf/1.0/activemq-protobuf-1.0.jar
[WARNING] We have a duplicate org/apache/activemq/protobuf/compiler/ServiceDescriptor.class
in /home/hudson/.m2/repository/org/apache/activemq/protobuf/activemq-protobuf/1.0/activemq-protobuf-1.0.jar
[WARNING] We have a duplicate org/apache/activemq/protobuf/compiler/TextFormat$InvalidEscapeSequence.class
in /home/hudson/.m2/repository/org/apache/activemq/protobuf/activemq-protobuf/1.0/activemq-protobuf-1.0.jar
[WARNING] We have a duplicate org/apache/activemq/protobuf/compiler/TextFormat$ParseException.class
in /home/hudson/.m2/repository/org/apache/activemq/protobuf/activemq-protobuf/1.0/activemq-protobuf-1.0.jar
[WARNING] We have a duplicate org/apache/activemq/protobuf/compiler/TextFormat$Tokenizer.class
in /home/hudson/.m2/repository/org/apache/activemq/protobuf/activemq-protobuf/1.0/activemq-protobuf-1.0.jar
[WARNING] We have a duplicate org/apache/activemq/protobuf/compiler/TextFormat.class in /home/hudson/.m2/repository/org/apache/activemq/protobuf/activemq-protobuf/1.0/activemq-protobuf-1.0.jar
[WARNING] We have a duplicate org/apache/activemq/protobuf/compiler/TypeDescriptor.class in
/home/hudson/.m2/repository/org/apache/activemq/protobuf/activemq-protobuf/1.0/activemq-protobuf-1.0.jar
[WARNING] We have a duplicate org/apache/activemq/protobuf/DeferredDecodeMessage.class in
/home/hudson/.m2/repository/org/apache/activemq/protobuf/activemq-protobuf/1.0/activemq-protobuf-1.0.jar
[WARNING] We have a duplicate org/apache/activemq/protobuf/InvalidProtocolBufferException.class
in /home/hudson/.m2/repository/org/apache/activemq/protobuf/activemq-protobuf/1.0/activemq-protobuf-1.0.jar
[WARNING] We have a duplicate org/apache/activemq/protobuf/Message.class in /home/hudson/.m2/repository/org/apache/activemq/protobuf/activemq-protobuf/1.0/activemq-protobuf-1.0.jar
[WARNING] We have a duplicate org/apache/activemq/protobuf/MessageBuffer.class in /home/hudson/.m2/repository/org/apache/activemq/protobuf/activemq-protobuf/1.0/activemq-protobuf-1.0.jar
[WARNING] We have a duplicate org/apache/activemq/protobuf/MessageBufferSupport.class in /home/hudson/.m2/repository/org/apache/activemq/protobuf/activemq-protobuf/1.0/activemq-protobuf-1.0.jar
[WARNING] We have a duplicate org/apache/activemq/protobuf/PBMessage.class in /home/hudson/.m2/repository/org/apache/activemq/protobuf/activemq-protobuf/1.0/activemq-protobuf-1.0.jar
[WARNING] We have a duplicate org/apache/activemq/protobuf/UninitializedMessageException.class
in /home/hudson/.m2/repository/org/apache/activemq/protobuf/activemq-protobuf/1.0/activemq-protobuf-1.0.jar
[WARNING] We have a duplicate org/apache/activemq/protobuf/UTF8Buffer.class in /home/hudson/.m2/repository/org/apache/activemq/protobuf/activemq-protobuf/1.0/activemq-protobuf-1.0.jar
[WARNING] We have a duplicate org/apache/activemq/protobuf/WireFormat.class in /home/hudson/.m2/repository/org/apache/activemq/protobuf/activemq-protobuf/1.0/activemq-protobuf-1.0.jar
[INFO] Attaching shaded artifact.
[INFO] [INFO] Checking legal files in: apacheds-all-1.5.8-SNAPSHOT.jar
[INFO] Checking legal files in: apacheds-all-1.5.8-SNAPSHOT-app.jar

[INFO] --- tools-maven-plugin:1.4:verify-legal-files (verify-legal-files) @ apacheds-all ---
[INFO] [INFO] Exclude: **/target/**/*
[INFO] Exclude: **/cobertura.ser
[INFO] Exclude: **/.classpath
[INFO] Exclude: **/.project
[INFO] Exclude: **/.settings/**/*
[INFO] Exclude: **/*.iml
[INFO] Exclude: **/*.ipr
[INFO] Exclude: **/*.iws
[INFO] Exclude: **/MANIFEST.MF
[INFO] Exclude: **/dependency-reduced-pom.xml
[INFO] Exclude: **/*.ldif
[INFO] Exclude: **/*.pdu
[INFO] Exclude: jdbm/**/*
[INFO] Exclude: installers-maven-plugin/src/main/resources/org/apache/directory/server/installers/deb/control
[INFO] Exclude: installers-maven-plugin/src/main/resources/org/apache/directory/server/installers/macosxpkg/License.rtf
[INFO] Exclude: installers-maven-plugin/src/main/resources/org/apache/directory/server/installers/solarispkg/pkginfo
[INFO] Exclude: installers-maven-plugin/src/main/resources/org/apache/directory/server/installers/solarispkg/Prototype
[INFO] Exclude: osgi/src/main/resources/META-INF/spring.handlers
[INFO] Exclude: osgi/src/main/resources/META-INF/spring.schemas
[INFO] Exclude: **/*.log

[INFO] --- apache-rat-plugin:0.7:check (default) @ apacheds-all ---
[INFO] [INFO] Installing <https://hudson.apache.org/hudson/job/dir-apacheds-jdk15-ubuntu-deploy/ws/trunk/all/target/apacheds-all-1.5.8-SNAPSHOT.jar>
to /home/hudson/.m2/repository/org/apache/directory/server/apacheds-all/1.5.8-SNAPSHOT/apacheds-all-1.5.8-SNAPSHOT.jar

[INFO] --- maven-install-plugin:2.3.1:install (default-install) @ apacheds-all ---
[INFO] Installing <https://hudson.apache.org/hudson/job/dir-apacheds-jdk15-ubuntu-deploy/ws/trunk/all/pom.xml>
to /home/hudson/.m2/repository/org/apache/directory/server/apacheds-all/1.5.8-SNAPSHOT/apacheds-all-1.5.8-SNAPSHOT.pom
[INFO] Installing <https://hudson.apache.org/hudson/job/dir-apacheds-jdk15-ubuntu-deploy/ws/trunk/all/target/apacheds-all-1.5.8-SNAPSHOT-app.jar>
to /home/hudson/.m2/repository/org/apache/directory/server/apacheds-all/1.5.8-SNAPSHOT/apacheds-all-1.5.8-SNAPSHOT-app.jar
[INFO] Downloading: https://repository.apache.org/content/repositories/snapshots/org/apache/directory/server/apacheds-all/1.5.8-SNAPSHOT/maven-metadata.xml

[INFO] --- maven-deploy-plugin:2.5:deploy (default-deploy) @ apacheds-all ---
Downloaded: https://repository.apache.org/content/repositories/snapshots/org/apache/directory/server/apacheds-all/1.5.8-SNAPSHOT/maven-metadata.xml
(1007 B at 0.7 KB/sec)
Uploading: https://repository.apache.org/content/repositories/snapshots/org/apache/directory/server/apacheds-all/1.5.8-SNAPSHOT/apacheds-all-1.5.8-20110309.041235-159.jar
Uploaded: https://repository.apache.org/content/repositories/snapshots/org/apache/directory/server/apacheds-all/1.5.8-SNAPSHOT/apacheds-all-1.5.8-20110309.041235-159.jar
(9 KB at 41.7 KB/sec)
Uploading: https://repository.apache.org/content/repositories/snapshots/org/apache/directory/server/apacheds-all/1.5.8-SNAPSHOT/apacheds-all-1.5.8-20110309.041235-159.pom
Uploaded: https://repository.apache.org/content/repositories/snapshots/org/apache/directory/server/apacheds-all/1.5.8-SNAPSHOT/apacheds-all-1.5.8-20110309.041235-159.pom
(6 KB at 29.3 KB/sec)
Downloading: https://repository.apache.org/content/repositories/snapshots/org/apache/directory/server/apacheds-all/maven-metadata.xml
Downloaded: https://repository.apache.org/content/repositories/snapshots/org/apache/directory/server/apacheds-all/maven-metadata.xml
(419 B at 2.4 KB/sec)
Uploading: https://repository.apache.org/content/repositories/snapshots/org/apache/directory/server/apacheds-all/1.5.8-SNAPSHOT/maven-metadata.xml
Uploaded: https://repository.apache.org/content/repositories/snapshots/org/apache/directory/server/apacheds-all/1.5.8-SNAPSHOT/maven-metadata.xml
(1007 B at 3.8 KB/sec)
Uploading: https://repository.apache.org/content/repositories/snapshots/org/apache/directory/server/apacheds-all/maven-metadata.xml
Uploaded: https://repository.apache.org/content/repositories/snapshots/org/apache/directory/server/apacheds-all/maven-metadata.xml
(419 B at 2.1 KB/sec)
Uploading: https://repository.apache.org/content/repositories/snapshots/org/apache/directory/server/apacheds-all/1.5.8-SNAPSHOT/apacheds-all-1.5.8-20110309.041235-159-app.jar
mojoFailed org.apache.maven.plugins:maven-deploy-plugin:2.5(default-deploy)
projectFailed org.apache.directory.server:apacheds-all:1.5.8-SNAPSHOT
[JENKINS] Archiving <https://hudson.apache.org/hudson/job/dir-apacheds-jdk15-ubuntu-deploy/ws/trunk/all/pom.xml>
to /home/hudson/hudson/jobs/dir-apacheds-jdk15-ubuntu-deploy/modules/org.apache.directory.server$apacheds-all/builds/2011-03-09_04-04-05/archive/org.apache.directory.server/apacheds-all/1.5.8-SNAPSHOT/pom.xml
[JENKINS] Archiving <https://hudson.apache.org/hudson/job/dir-apacheds-jdk15-ubuntu-deploy/ws/trunk/all/target/apacheds-all-1.5.8-SNAPSHOT.jar>
to /home/hudson/hudson/jobs/dir-apacheds-jdk15-ubuntu-deploy/modules/org.apache.directory.server$apacheds-all/builds/2011-03-09_04-04-05/archive/org.apache.directory.server/apacheds-all/1.5.8-20110309.041235-159/apacheds-all-1.5.8-SNAPSHOT.jar
[JENKINS] Archiving <https://hudson.apache.org/hudson/job/dir-apacheds-jdk15-ubuntu-deploy/ws/trunk/all/target/apacheds-all-1.5.8-SNAPSHOT-app.jar>
to /home/hudson/hudson/jobs/dir-apacheds-jdk15-ubuntu-deploy/modules/org.apache.directory.server$apacheds-all/builds/2011-03-09_04-04-05/archive/org.apache.directory.server/apacheds-all/1.5.8-20110309.041235-159/apacheds-all-1.5.8-SNAPSHOT-app.jar
sessionEnded
[INFO] ------------------------------------------------------------------------
[INFO] Reactor Summary:
[INFO] 
[INFO] ApacheDS .......................................... SUCCESS [46.666s]
[INFO] ApacheDS I18n ..................................... SUCCESS [6.298s]
[INFO] ApacheDS Core Constants ........................... SUCCESS [4.522s]
[INFO] ApacheDS Core API ................................. SUCCESS [30.282s]
[INFO] ApacheDS Core ..................................... SUCCESS [17.451s]
[INFO] ApacheDS Core AVL ................................. SUCCESS [10.452s]
[INFO] ApacheDS Generalized (X) DBM Partition ............ SUCCESS [18.363s]
[INFO] ApacheDS LDIF Partition ........................... SUCCESS [14.027s]
[INFO] ApacheDS JDBM implementation ...................... SUCCESS [17.291s]
[INFO] ApacheDS JDBM Partition ........................... SUCCESS [30.009s]
[INFO] ApacheDS Core Annotations ......................... SUCCESS [17.124s]
[INFO] ApacheDS Core JNDI ................................ SUCCESS [8.496s]
[INFO] ApacheDS Protocol Shared .......................... SUCCESS [7.484s]
[INFO] ApacheDS Protocol Kerberos Codec .................. SUCCESS [23.733s]
[INFO] ApacheDS Interceptors for Kerberos ................ SUCCESS [9.968s]
[INFO] ApacheDS Protocol Dhcp ............................ SUCCESS [10.074s]
[INFO] ApacheDS Protocol Dns ............................. SUCCESS [11.617s]
[INFO] ApacheDS Protocol Kerberos ........................ SUCCESS [12.288s]
[INFO] ApacheDS Protocol Ldap ............................ SUCCESS [13.455s]
[INFO] ApacheDS Protocol Ntp ............................. SUCCESS [12.671s]
[INFO] Apacheds Server Annotations ....................... SUCCESS [22.373s]
[INFO] ApacheDS Server Config ............................ SUCCESS [16.720s]
[INFO] ApacheDS Server JNDI .............................. SUCCESS [11.838s]
[INFO] ApacheDS Server Replication Service ............... SUCCESS [7.762s]
[INFO] ApacheDS Test Framework ........................... SUCCESS [41.240s]
[INFO] ApacheDS Generalized (X) DBM Tools ................ SUCCESS [9.191s]
[INFO] ApacheDS All ...................................... FAILURE [20.725s]
[INFO] ApacheDS Core Integration ......................... SKIPPED
[INFO] ApacheDS Server Integration ....................... SKIPPED
[INFO] ApacheDS DirectoryService-WebApp bridge ........... SKIPPED
[INFO] ApacheDS Jetty HTTP Server Integration ............ SKIPPED
[INFO] ApacheDS Service Builder .......................... SKIPPED
[INFO] ApacheDS Protocol Kerberos Test ................... SKIPPED
[INFO] Apache Directory LDAP Client API test ............. SKIPPED
[INFO] ApacheDS Service .................................. SKIPPED
[INFO] ApacheDS Wrapper .................................. SKIPPED
[INFO] ------------------------------------------------------------------------
[INFO] BUILD FAILURE
[INFO] ------------------------------------------------------------------------
[INFO] Total time: 9:33.519s
[INFO] Finished at: Wed Mar 09 04:13:50 UTC 2011
[INFO] Final Memory: 73M/133M
[INFO] ------------------------------------------------------------------------
maven builder waiting
mavenExecutionResult exceptions not empty
org.apache.maven.lifecycle.LifecycleExecutionException: Failed to execute goal org.apache.maven.plugins:maven-deploy-plugin:2.5:deploy
(default-deploy) on project apacheds-all: Failed to deploy artifacts: Could not transfer artifact
org.apache.directory.server:apacheds-all:jar:app:1.5.8-20110309.041235-159 from/to apache.snapshots.https
(https://repository.apache.org/content/repositories/snapshots): Failed to transfer file: https://repository.apache.org/content/repositories/snapshots/org/apache/directory/server/apacheds-all/1.5.8-SNAPSHOT/apacheds-all-1.5.8-20110309.041235-159-app.jar.
Return code is: 500
	at org.apache.maven.lifecycle.internal.MojoExecutor.execute(MojoExecutor.java:217)
	at org.apache.maven.lifecycle.internal.MojoExecutor.execute(MojoExecutor.java:153)
	at org.apache.maven.lifecycle.internal.MojoExecutor.execute(MojoExecutor.java:145)
	at org.apache.maven.lifecycle.internal.LifecycleModuleBuilder.buildProject(LifecycleModuleBuilder.java:84)
	at org.apache.maven.lifecycle.internal.LifecycleModuleBuilder.buildProject(LifecycleModuleBuilder.java:59)
	at org.apache.maven.lifecycle.internal.LifecycleStarter.singleThreadedBuild(LifecycleStarter.java:183)
	at org.apache.maven.lifecycle.internal.LifecycleStarter.execute(LifecycleStarter.java:161)
	at org.apache.maven.DefaultMaven.doExecute(DefaultMaven.java:319)
	at org.apache.maven.DefaultMaven.execute(DefaultMaven.java:156)
	at org.jvnet.hudson.maven3.launcher.Maven3Launcher.main(Maven3Launcher.java:79)
	at sun.reflect.NativeMethodAccessorImpl.invoke0(Native Method)
	at sun.reflect.NativeMethodAccessorImpl.invoke(NativeMethodAccessorImpl.java:39)
	at sun.reflect.DelegatingMethodAccessorImpl.invoke(DelegatingMethodAccessorImpl.java:25)
	at java.lang.reflect.Method.invoke(Method.java:592)
	at org.codehaus.plexus.classworlds.launcher.Launcher.launchStandard(Launcher.java:329)
	at org.codehaus.plexus.classworlds.launcher.Launcher.launch(Launcher.java:239)
	at org.jvnet.hudson.maven3.agent.Maven3Main.launch(Maven3Main.java:145)
	at hudson.maven.Maven3Builder.call(Maven3Builder.java:124)
	at hudson.maven.Maven3Builder.call(Maven3Builder.java:71)
	at hudson.remoting.UserRequest.perform(UserRequest.java:114)
	at hudson.remoting.UserRequest.perform(UserRequest.java:48)
	at hudson.remoting.Request$2.run(Request.java:270)
	at java.util.concurrent.Executors$RunnableAdapter.call(Executors.java:417)
	at java.util.concurrent.FutureTask$Sync.innerRun(FutureTask.java:269)
	at java.util.concurrent.FutureTask.run(FutureTask.java:123)
	at java.util.concurrent.ThreadPoolExecutor$Worker.runTask(ThreadPoolExecutor.java:651)
	at java.util.concurrent.ThreadPoolExecutor$Worker.run(ThreadPoolExecutor.java:676)
	at java.lang.Thread.run(Thread.java:595)
Caused by: org.apache.maven.plugin.MojoExecutionException: Failed to deploy artifacts: Could
not transfer artifact org.apache.directory.server:apacheds-all:jar:app:1.5.8-20110309.041235-159
from/to apache.snapshots.https (https://repository.apache.org/content/repositories/snapshots):
Failed to transfer file: https://repository.apache.org/content/repositories/snapshots/org/apache/directory/server/apacheds-all/1.5.8-SNAPSHOT/apacheds-all-1.5.8-20110309.041235-159-app.jar.
Return code is: 500
	at org.apache.maven.plugin.deploy.DeployMojo.execute(DeployMojo.java:189)
	at org.apache.maven.plugin.DefaultBuildPluginManager.executeMojo(DefaultBuildPluginManager.java:107)
	at org.apache.maven.lifecycle.internal.MojoExecutor.execute(MojoExecutor.java:209)
	... 27 more
Caused by: org.apache.maven.artifact.deployer.ArtifactDeploymentException: Failed to deploy
artifacts: Could not transfer artifact org.apache.directory.server:apacheds-all:jar:app:1.5.8-20110309.041235-159
from/to apache.snapshots.https (https://repository.apache.org/content/repositories/snapshots):
Failed to transfer file: https://repository.apache.org/content/repositories/snapshots/org/apache/directory/server/apacheds-all/1.5.8-SNAPSHOT/apacheds-all-1.5.8-20110309.041235-159-app.jar.
Return code is: 500
	at org.apache.maven.artifact.deployer.DefaultArtifactDeployer.deploy(DefaultArtifactDeployer.java:140)
	at org.apache.maven.plugin.deploy.DeployMojo.execute(DeployMojo.java:184)
	... 29 more
Caused by: org.sonatype.aether.deployment.DeploymentException: Failed to deploy artifacts:
Could not transfer artifact org.apache.directory.server:apacheds-all:jar:app:1.5.8-20110309.041235-159
from/to apache.snapshots.https (https://repository.apache.org/content/repositories/snapshots):
Failed to transfer file: https://repository.apache.org/content/repositories/snapshots/org/apache/directory/server/apacheds-all/1.5.8-SNAPSHOT/apacheds-all-1.5.8-20110309.041235-159-app.jar.
Return code is: 500
	at org.sonatype.aether.impl.internal.DefaultDeployer.deploy(DefaultDeployer.java:259)
	at org.sonatype.aether.impl.internal.DefaultRepositorySystem.deploy(DefaultRepositorySystem.java:380)
	at org.apache.maven.artifact.deployer.DefaultArtifactDeployer.deploy(DefaultArtifactDeployer.java:136)
	... 30 more
Caused by: org.sonatype.aether.transfer.ArtifactTransferException: Could not transfer artifact
org.apache.directory.server:apacheds-all:jar:app:1.5.8-20110309.041235-159 from/to apache.snapshots.https
(https://repository.apache.org/content/repositories/snapshots): Failed to transfer file: https://repository.apache.org/content/repositories/snapshots/org/apache/directory/server/apacheds-all/1.5.8-SNAPSHOT/apacheds-all-1.5.8-20110309.041235-159-app.jar.
Return code is: 500
	at org.sonatype.aether.connector.wagon.WagonRepositoryConnector$4.wrap(WagonRepositoryConnector.java:949)
	at org.sonatype.aether.connector.wagon.WagonRepositoryConnector$4.wrap(WagonRepositoryConnector.java:940)
	at org.sonatype.aether.connector.wagon.WagonRepositoryConnector$PutTask.flush(WagonRepositoryConnector.java:864)
	at org.sonatype.aether.connector.wagon.WagonRepositoryConnector.put(WagonRepositoryConnector.java:465)
	at org.sonatype.aether.impl.internal.DefaultDeployer.deploy(DefaultDeployer.java:253)
	... 32 more
Caused by: org.apache.maven.wagon.TransferFailedException: Failed to transfer file: https://repository.apache.org/content/repositories/snapshots/org/apache/directory/server/apacheds-all/1.5.8-SNAPSHOT/apacheds-all-1.5.8-20110309.041235-159-app.jar.
Return code is: 500
	at org.apache.maven.wagon.providers.http.LightweightHttpWagon.finishPutTransfer(LightweightHttpWagon.java:205)
	at org.apache.maven.wagon.AbstractWagon.putTransfer(AbstractWagon.java:413)
	at org.apache.maven.wagon.AbstractWagon.transfer(AbstractWagon.java:392)
	at org.apache.maven.wagon.AbstractWagon.putTransfer(AbstractWagon.java:365)
	at org.apache.maven.wagon.StreamWagon.put(StreamWagon.java:163)
	at org.sonatype.aether.connector.wagon.WagonRepositoryConnector$PutTask.run(WagonRepositoryConnector.java:825)
	at org.sonatype.aether.connector.wagon.WagonRepositoryConnector.put(WagonRepositoryConnector.java:464)
	... 33 more
Maven failed with error.
Sending e-mails to: notifications@directory.apache.org
Sending e-mails to: notifications@directory.apache.org
channel stopped


Mime
View raw message