directory-notifications mailing list archives

Site index · List index
Message view « Date » · « Thread »
Top « Date » · « Thread »
From Apache Hudson Server <hud...@hudson.apache.org>
Subject Build failed in Jenkins: dir-apacheds-jdk15-ubuntu-deploy #196
Date Sat, 05 Mar 2011 16:11:36 GMT
See <https://hudson.apache.org/hudson/job/dir-apacheds-jdk15-ubuntu-deploy/196/>

------------------------------------------
[...truncated 1749 lines...]
[INFO] Downloading: https://repository.apache.org/content/repositories/snapshots/org/apache/directory/server/apacheds-protocol-dns/1.5.8-SNAPSHOT/maven-metadata.xml

[INFO] --- maven-deploy-plugin:2.5:deploy (default-deploy) @ apacheds-protocol-dns ---
Downloaded: https://repository.apache.org/content/repositories/snapshots/org/apache/directory/server/apacheds-protocol-dns/1.5.8-SNAPSHOT/maven-metadata.xml
(1020 B at 3.0 KB/sec)
Uploading: https://repository.apache.org/content/repositories/snapshots/org/apache/directory/server/apacheds-protocol-dns/1.5.8-SNAPSHOT/apacheds-protocol-dns-1.5.8-20110305.161105-160.jar
Uploaded: https://repository.apache.org/content/repositories/snapshots/org/apache/directory/server/apacheds-protocol-dns/1.5.8-SNAPSHOT/apacheds-protocol-dns-1.5.8-20110305.161105-160.jar
(89 KB at 181.4 KB/sec)
Uploading: https://repository.apache.org/content/repositories/snapshots/org/apache/directory/server/apacheds-protocol-dns/1.5.8-SNAPSHOT/apacheds-protocol-dns-1.5.8-20110305.161105-160.pom
Uploaded: https://repository.apache.org/content/repositories/snapshots/org/apache/directory/server/apacheds-protocol-dns/1.5.8-SNAPSHOT/apacheds-protocol-dns-1.5.8-20110305.161105-160.pom
(3 KB at 9.9 KB/sec)
Downloading: https://repository.apache.org/content/repositories/snapshots/org/apache/directory/server/apacheds-protocol-dns/maven-metadata.xml
Downloaded: https://repository.apache.org/content/repositories/snapshots/org/apache/directory/server/apacheds-protocol-dns/maven-metadata.xml
(428 B at 2.4 KB/sec)
Uploading: https://repository.apache.org/content/repositories/snapshots/org/apache/directory/server/apacheds-protocol-dns/1.5.8-SNAPSHOT/maven-metadata.xml
Uploaded: https://repository.apache.org/content/repositories/snapshots/org/apache/directory/server/apacheds-protocol-dns/1.5.8-SNAPSHOT/maven-metadata.xml
(1020 B at 5.2 KB/sec)
Uploading: https://repository.apache.org/content/repositories/snapshots/org/apache/directory/server/apacheds-protocol-dns/maven-metadata.xml
Uploaded: https://repository.apache.org/content/repositories/snapshots/org/apache/directory/server/apacheds-protocol-dns/maven-metadata.xml
(428 B at 2.2 KB/sec)
Uploading: https://repository.apache.org/content/repositories/snapshots/org/apache/directory/server/apacheds-protocol-dns/1.5.8-SNAPSHOT/apacheds-protocol-dns-1.5.8-20110305.161105-160-sources.jar
Uploaded: https://repository.apache.org/content/repositories/snapshots/org/apache/directory/server/apacheds-protocol-dns/1.5.8-SNAPSHOT/apacheds-protocol-dns-1.5.8-20110305.161105-160-sources.jar
(116 KB at 456.1 KB/sec)
Uploading: https://repository.apache.org/content/repositories/snapshots/org/apache/directory/server/apacheds-protocol-dns/1.5.8-SNAPSHOT/maven-metadata.xml
Uploaded: https://repository.apache.org/content/repositories/snapshots/org/apache/directory/server/apacheds-protocol-dns/1.5.8-SNAPSHOT/maven-metadata.xml
(1020 B at 4.4 KB/sec)
projectSucceeded org.apache.directory.server:apacheds-protocol-dns:1.5.8-SNAPSHOT
[JENKINS] Archiving <https://hudson.apache.org/hudson/job/dir-apacheds-jdk15-ubuntu-deploy/ws/trunk/protocol-dns/pom.xml>
to /home/hudson/hudson/jobs/dir-apacheds-jdk15-ubuntu-deploy/modules/org.apache.directory.server$apacheds-protocol-dns/builds/2011-03-05_16-05-35/archive/org.apache.directory.server/apacheds-protocol-dns/1.5.8-SNAPSHOT/pom.xml
[JENKINS] Archiving <https://hudson.apache.org/hudson/job/dir-apacheds-jdk15-ubuntu-deploy/ws/trunk/protocol-dns/target/apacheds-protocol-dns-1.5.8-SNAPSHOT.jar>
to /home/hudson/hudson/jobs/dir-apacheds-jdk15-ubuntu-deploy/modules/org.apache.directory.server$apacheds-protocol-dns/builds/2011-03-05_16-05-35/archive/org.apache.directory.server/apacheds-protocol-dns/1.5.8-20110305.161105-160/apacheds-protocol-dns-1.5.8-SNAPSHOT.jar
[JENKINS] Archiving <https://hudson.apache.org/hudson/job/dir-apacheds-jdk15-ubuntu-deploy/ws/trunk/protocol-dns/target/apacheds-protocol-dns-1.5.8-SNAPSHOT-sources.jar>
to /home/hudson/hudson/jobs/dir-apacheds-jdk15-ubuntu-deploy/modules/org.apache.directory.server$apacheds-protocol-dns/builds/2011-03-05_16-05-35/archive/org.apache.directory.server/apacheds-protocol-dns/1.5.8-20110305.161105-160/apacheds-protocol-dns-1.5.8-SNAPSHOT-sources.jar
[INFO] [INFO] Deleting <https://hudson.apache.org/hudson/job/dir-apacheds-jdk15-ubuntu-deploy/ws/trunk/protocol-kerberos/target>
                                                                        
[INFO] ------------------------------------------------------------------------
[INFO] Building ApacheDS Protocol Kerberos 1.5.8-SNAPSHOT
[INFO] ------------------------------------------------------------------------
[INFO] 
[INFO] --- maven-clean-plugin:2.4.1:clean (default-clean) @ apacheds-protocol-kerberos ---
[INFO] 
[INFO] --- maven-remote-resources-plugin:1.1:process (default) @ apacheds-protocol-kerberos
---
[INFO] Using 'UTF-8' encoding to copy filtered resources.
[INFO] [INFO] Copying 0 resource
[INFO] Copying 3 resources

[INFO] --- maven-resources-plugin:2.4.3:resources (default-resources) @ apacheds-protocol-kerberos
---
[INFO] 
[INFO] --- maven-compiler-plugin:2.3.2:compile (default-compile) @ apacheds-protocol-kerberos
---
[INFO] Compiling 17 source files to <https://hudson.apache.org/hudson/job/dir-apacheds-jdk15-ubuntu-deploy/ws/trunk/protocol-kerberos/target/classes>
[INFO] [INFO] Using 'UTF-8' encoding to copy filtered resources.

[INFO] --- maven-resources-plugin:2.4.3:testResources (default-testResources) @ apacheds-protocol-kerberos
---
[INFO] Copying 2 resources
[INFO] Copying 3 resources
[INFO] 
[INFO] --- maven-compiler-plugin:2.3.2:testCompile (default-testCompile) @ apacheds-protocol-kerberos
---
[INFO] Compiling 11 source files to <https://hudson.apache.org/hudson/job/dir-apacheds-jdk15-ubuntu-deploy/ws/trunk/protocol-kerberos/target/test-classes>
[INFO] [INFO] Surefire report directory: <https://hudson.apache.org/hudson/job/dir-apacheds-jdk15-ubuntu-deploy/ws/trunk/protocol-kerberos/target/surefire-reports>

[INFO] --- maven-surefire-plugin:2.7.2:test (default-test) @ apacheds-protocol-kerberos ---

-------------------------------------------------------
 T E S T S
-------------------------------------------------------
Running org.apache.directory.server.kerberos.protocol.AuthenticationEncryptionTypeTest
Tests run: 4, Failures: 0, Errors: 0, Skipped: 0, Time elapsed: 0.809 sec
Running org.apache.directory.server.kerberos.protocol.PreAuthenticationTest
Tests run: 4, Failures: 0, Errors: 0, Skipped: 0, Time elapsed: 0.013 sec
Running org.apache.directory.server.kerberos.protocol.TicketGrantingServiceTest
Tests run: 37, Failures: 0, Errors: 0, Skipped: 1, Time elapsed: 0.253 sec
Running org.apache.directory.server.kerberos.protocol.AuthenticationServiceTest
Tests run: 30, Failures: 0, Errors: 0, Skipped: 0, Time elapsed: 0.065 sec
Running org.apache.directory.server.kerberos.protocol.TicketGrantingEncryptionTypeTest
Tests run: 6, Failures: 0, Errors: 0, Skipped: 0, Time elapsed: 0.102 sec
Running org.apache.directory.server.kerberos.protocol.AuthenticationPolicyTest
Tests run: 7, Failures: 0, Errors: 0, Skipped: 0, Time elapsed: 0.008 sec
Running org.apache.directory.server.kerberos.protocol.TicketGrantingPolicyTest
Tests run: 12, Failures: 0, Errors: 0, Skipped: 0, Time elapsed: 0.053 sec
Running org.apache.directory.server.kerberos.protocol.EncTktInSkeyTest
Tests run: 1, Failures: 0, Errors: 0, Skipped: 0, Time elapsed: 0.005 sec

Results :

Tests run: 101, Failures: 0, Errors: 0, Skipped: 1

[JENKINS] Recording test results
[INFO] 
[INFO] --- maven-jar-plugin:2.3.1:jar (default-jar) @ apacheds-protocol-kerberos ---
[INFO] Building jar: <https://hudson.apache.org/hudson/job/dir-apacheds-jdk15-ubuntu-deploy/ws/trunk/protocol-kerberos/target/apacheds-protocol-kerberos-1.5.8-SNAPSHOT.jar>
[INFO] [INFO] Checking legal files in: apacheds-protocol-kerberos-1.5.8-SNAPSHOT.jar

[INFO] --- tools-maven-plugin:1.4:verify-legal-files (verify-legal-files) @ apacheds-protocol-kerberos
---
mojo forkStarted org.apache.maven.plugins:maven-source-plugin:2.1.2(attach-sources)
mojo forkSucceeded org.apache.maven.plugins:maven-source-plugin:2.1.2(attach-sources)
ignoring exception during new ExecutedMojo null
[INFO] 
[INFO] --- maven-source-plugin:2.1.2:jar (attach-sources) @ apacheds-protocol-kerberos ---
[INFO] META-INF already added, skipping
[INFO] META-INF already added, skipping
[INFO] META-INF/LICENSE already added, skipping
[INFO] META-INF/DEPENDENCIES already added, skipping
[INFO] META-INF/NOTICE already added, skipping
[INFO] Building jar: <https://hudson.apache.org/hudson/job/dir-apacheds-jdk15-ubuntu-deploy/ws/trunk/protocol-kerberos/target/apacheds-protocol-kerberos-1.5.8-SNAPSHOT-sources.jar>
[INFO] META-INF already added, skipping
[INFO] META-INF already added, skipping
[INFO] META-INF/LICENSE already added, skipping
[INFO] META-INF/DEPENDENCIES already added, skipping
[INFO] META-INF/NOTICE already added, skipping
[INFO] [INFO] Installing <https://hudson.apache.org/hudson/job/dir-apacheds-jdk15-ubuntu-deploy/ws/trunk/protocol-kerberos/target/apacheds-protocol-kerberos-1.5.8-SNAPSHOT.jar>
to /home/hudson/.m2/repository/org/apache/directory/server/apacheds-protocol-kerberos/1.5.8-SNAPSHOT/apacheds-protocol-kerberos-1.5.8-SNAPSHOT.jar

[INFO] --- maven-install-plugin:2.3.1:install (default-install) @ apacheds-protocol-kerberos
---
[INFO] Installing <https://hudson.apache.org/hudson/job/dir-apacheds-jdk15-ubuntu-deploy/ws/trunk/protocol-kerberos/pom.xml>
to /home/hudson/.m2/repository/org/apache/directory/server/apacheds-protocol-kerberos/1.5.8-SNAPSHOT/apacheds-protocol-kerberos-1.5.8-SNAPSHOT.pom
[INFO] Installing <https://hudson.apache.org/hudson/job/dir-apacheds-jdk15-ubuntu-deploy/ws/trunk/protocol-kerberos/target/apacheds-protocol-kerberos-1.5.8-SNAPSHOT-sources.jar>
to /home/hudson/.m2/repository/org/apache/directory/server/apacheds-protocol-kerberos/1.5.8-SNAPSHOT/apacheds-protocol-kerberos-1.5.8-SNAPSHOT-sources.jar
[INFO] Downloading: https://repository.apache.org/content/repositories/snapshots/org/apache/directory/server/apacheds-protocol-kerberos/1.5.8-SNAPSHOT/maven-metadata.xml

[INFO] --- maven-deploy-plugin:2.5:deploy (default-deploy) @ apacheds-protocol-kerberos ---
Downloaded: https://repository.apache.org/content/repositories/snapshots/org/apache/directory/server/apacheds-protocol-kerberos/1.5.8-SNAPSHOT/maven-metadata.xml
(2 KB at 4.1 KB/sec)
Uploading: https://repository.apache.org/content/repositories/snapshots/org/apache/directory/server/apacheds-protocol-kerberos/1.5.8-SNAPSHOT/apacheds-protocol-kerberos-1.5.8-20110305.161120-160.jar
Uploaded: https://repository.apache.org/content/repositories/snapshots/org/apache/directory/server/apacheds-protocol-kerberos/1.5.8-SNAPSHOT/apacheds-protocol-kerberos-1.5.8-20110305.161120-160.jar
(48 KB at 165.4 KB/sec)
Uploading: https://repository.apache.org/content/repositories/snapshots/org/apache/directory/server/apacheds-protocol-kerberos/1.5.8-SNAPSHOT/apacheds-protocol-kerberos-1.5.8-20110305.161120-160.pom
Uploaded: https://repository.apache.org/content/repositories/snapshots/org/apache/directory/server/apacheds-protocol-kerberos/1.5.8-SNAPSHOT/apacheds-protocol-kerberos-1.5.8-20110305.161120-160.pom
(4 KB at 16.4 KB/sec)
Downloading: https://repository.apache.org/content/repositories/snapshots/org/apache/directory/server/apacheds-protocol-kerberos/maven-metadata.xml
Downloaded: https://repository.apache.org/content/repositories/snapshots/org/apache/directory/server/apacheds-protocol-kerberos/maven-metadata.xml
(433 B at 3.0 KB/sec)
Uploading: https://repository.apache.org/content/repositories/snapshots/org/apache/directory/server/apacheds-protocol-kerberos/1.5.8-SNAPSHOT/maven-metadata.xml
Uploaded: https://repository.apache.org/content/repositories/snapshots/org/apache/directory/server/apacheds-protocol-kerberos/1.5.8-SNAPSHOT/maven-metadata.xml
(2 KB at 3.1 KB/sec)
Uploading: https://repository.apache.org/content/repositories/snapshots/org/apache/directory/server/apacheds-protocol-kerberos/maven-metadata.xml
Uploaded: https://repository.apache.org/content/repositories/snapshots/org/apache/directory/server/apacheds-protocol-kerberos/maven-metadata.xml
(433 B at 1.8 KB/sec)
Uploading: https://repository.apache.org/content/repositories/snapshots/org/apache/directory/server/apacheds-protocol-kerberos/1.5.8-SNAPSHOT/apacheds-protocol-kerberos-1.5.8-20110305.161120-160-sources.jar
Uploaded: https://repository.apache.org/content/repositories/snapshots/org/apache/directory/server/apacheds-protocol-kerberos/1.5.8-SNAPSHOT/apacheds-protocol-kerberos-1.5.8-20110305.161120-160-sources.jar
(44 KB at 203.8 KB/sec)
Uploading: https://repository.apache.org/content/repositories/snapshots/org/apache/directory/server/apacheds-protocol-kerberos/1.5.8-SNAPSHOT/maven-metadata.xml
Uploaded: https://repository.apache.org/content/repositories/snapshots/org/apache/directory/server/apacheds-protocol-kerberos/1.5.8-SNAPSHOT/maven-metadata.xml
(2 KB at 6.5 KB/sec)
projectSucceeded org.apache.directory.server:apacheds-protocol-kerberos:1.5.8-SNAPSHOT
[JENKINS] Archiving <https://hudson.apache.org/hudson/job/dir-apacheds-jdk15-ubuntu-deploy/ws/trunk/protocol-kerberos/pom.xml>
to /home/hudson/hudson/jobs/dir-apacheds-jdk15-ubuntu-deploy/modules/org.apache.directory.server$apacheds-protocol-kerberos/builds/2011-03-05_16-05-35/archive/org.apache.directory.server/apacheds-protocol-kerberos/1.5.8-SNAPSHOT/pom.xml
[JENKINS] Archiving <https://hudson.apache.org/hudson/job/dir-apacheds-jdk15-ubuntu-deploy/ws/trunk/protocol-kerberos/target/apacheds-protocol-kerberos-1.5.8-SNAPSHOT.jar>
to /home/hudson/hudson/jobs/dir-apacheds-jdk15-ubuntu-deploy/modules/org.apache.directory.server$apacheds-protocol-kerberos/builds/2011-03-05_16-05-35/archive/org.apache.directory.server/apacheds-protocol-kerberos/1.5.8-20110305.161120-160/apacheds-protocol-kerberos-1.5.8-SNAPSHOT.jar
[JENKINS] Archiving <https://hudson.apache.org/hudson/job/dir-apacheds-jdk15-ubuntu-deploy/ws/trunk/protocol-kerberos/target/apacheds-protocol-kerberos-1.5.8-SNAPSHOT-sources.jar>
to /home/hudson/hudson/jobs/dir-apacheds-jdk15-ubuntu-deploy/modules/org.apache.directory.server$apacheds-protocol-kerberos/builds/2011-03-05_16-05-35/archive/org.apache.directory.server/apacheds-protocol-kerberos/1.5.8-20110305.161120-160/apacheds-protocol-kerberos-1.5.8-SNAPSHOT-sources.jar
[INFO] Downloading: http://repository.apache.org/snapshots/org/apache/directory/shared/shared-ldap-extras-sp/1.0.0-M2-SNAPSHOT/maven-metadata.xml
                                                                        
[INFO] ------------------------------------------------------------------------
[INFO] Building ApacheDS Protocol Ldap 1.5.8-SNAPSHOT
[INFO] ------------------------------------------------------------------------
Downloading: http://repository.apache.org/snapshots/org/apache/directory/shared/shared-ldap-extras-sp/1.0.0-M2-SNAPSHOT/maven-metadata.xml
[INFO] [INFO] Deleting <https://hudson.apache.org/hudson/job/dir-apacheds-jdk15-ubuntu-deploy/ws/trunk/protocol-ldap/target>

[INFO] --- maven-clean-plugin:2.4.1:clean (default-clean) @ apacheds-protocol-ldap ---
[INFO] 
[INFO] --- maven-remote-resources-plugin:1.1:process (default) @ apacheds-protocol-ldap ---
[INFO] [INFO] Using 'UTF-8' encoding to copy filtered resources.

[INFO] --- maven-resources-plugin:2.4.3:resources (default-resources) @ apacheds-protocol-ldap
---
[INFO] Copying 0 resource
[INFO] Copying 3 resources
[INFO] 
[INFO] --- maven-compiler-plugin:2.3.2:compile (default-compile) @ apacheds-protocol-ldap
---
[INFO] Compiling 62 source files to <https://hudson.apache.org/hudson/job/dir-apacheds-jdk15-ubuntu-deploy/ws/trunk/protocol-ldap/target/classes>
[INFO] -------------------------------------------------------------
[ERROR] COMPILATION ERROR : 
[INFO] -------------------------------------------------------------
[ERROR] <https://hudson.apache.org/hudson/job/dir-apacheds-jdk15-ubuntu-deploy/ws/trunk/protocol-ldap/src/main/java/org/apache/directory/server/ldap/LdapServer.java>:[396,81]
inconvertible types
found   : org.apache.directory.server.ldap.ExtendedOperationHandler<capture of ? extends
org.apache.directory.shared.ldap.model.message.ExtendedRequest<? extends org.apache.directory.shared.ldap.model.message.ExtendedResponse>,capture
of ? extends org.apache.directory.shared.ldap.model.message.ExtendedResponse>
required: org.apache.directory.server.ldap.handlers.extended.StartTlsHandler
[INFO] 1 error
[INFO] -------------------------------------------------------------
mojoFailed org.apache.maven.plugins:maven-compiler-plugin:2.3.2(default-compile)
projectFailed org.apache.directory.server:apacheds-protocol-ldap:1.5.8-SNAPSHOT
[JENKINS] Archiving <https://hudson.apache.org/hudson/job/dir-apacheds-jdk15-ubuntu-deploy/ws/trunk/protocol-ldap/pom.xml>
to /home/hudson/hudson/jobs/dir-apacheds-jdk15-ubuntu-deploy/modules/org.apache.directory.server$apacheds-protocol-ldap/builds/2011-03-05_16-05-35/archive/org.apache.directory.server/apacheds-protocol-ldap/1.5.8-SNAPSHOT/pom.xml
sessionEnded
[INFO] ------------------------------------------------------------------------
[INFO] Reactor Summary:
[INFO] 
[INFO] ApacheDS .......................................... SUCCESS [12.624s]
[INFO] ApacheDS I18n ..................................... SUCCESS [6.083s]
[INFO] ApacheDS Core Constants ........................... SUCCESS [4.629s]
[INFO] ApacheDS Core API ................................. SUCCESS [33.702s]
[INFO] ApacheDS Core ..................................... SUCCESS [19.241s]
[INFO] ApacheDS Core AVL ................................. SUCCESS [11.342s]
[INFO] ApacheDS Generalized (X) DBM Partition ............ SUCCESS [23.605s]
[INFO] ApacheDS LDIF Partition ........................... SUCCESS [16.871s]
[INFO] ApacheDS JDBM implementation ...................... SUCCESS [17.887s]
[INFO] ApacheDS JDBM Partition ........................... SUCCESS [38.549s]
[INFO] ApacheDS Core Annotations ......................... SUCCESS [18.530s]
[INFO] ApacheDS Core JNDI ................................ SUCCESS [9.675s]
[INFO] ApacheDS Protocol Shared .......................... SUCCESS [8.136s]
[INFO] ApacheDS Protocol Kerberos Codec .................. SUCCESS [29.976s]
[INFO] ApacheDS Interceptors for Kerberos ................ SUCCESS [10.116s]
[INFO] ApacheDS Protocol Dhcp ............................ SUCCESS [9.117s]
[INFO] ApacheDS Protocol Dns ............................. SUCCESS [11.497s]
[INFO] ApacheDS Protocol Kerberos ........................ SUCCESS [12.431s]
[INFO] ApacheDS Protocol Ldap ............................ FAILURE [7.939s]
[INFO] ApacheDS Protocol Ntp ............................. SKIPPED
[INFO] Apacheds Server Annotations ....................... SKIPPED
[INFO] ApacheDS Server Config ............................ SKIPPED
[INFO] ApacheDS Server JNDI .............................. SKIPPED
[INFO] ApacheDS Server Replication Service ............... SKIPPED
[INFO] ApacheDS Test Framework ........................... SKIPPED
[INFO] ApacheDS Generalized (X) DBM Tools ................ SKIPPED
[INFO] ApacheDS All ...................................... SKIPPED
[INFO] ApacheDS Core Integration ......................... SKIPPED
[INFO] ApacheDS Server Integration ....................... SKIPPED
[INFO] ApacheDS DirectoryService-WebApp bridge ........... SKIPPED
[INFO] ApacheDS Jetty HTTP Server Integration ............ SKIPPED
[INFO] ApacheDS Service Builder .......................... SKIPPED
[INFO] ApacheDS Protocol Kerberos Test ................... SKIPPED
[INFO] Apache Directory LDAP Client API test ............. SKIPPED
[INFO] ApacheDS Service .................................. SKIPPED
[INFO] ApacheDS Wrapper .................................. SKIPPED
[INFO] ------------------------------------------------------------------------
[INFO] BUILD FAILURE
[INFO] ------------------------------------------------------------------------
[INFO] Total time: 5:45.089s
[INFO] Finished at: Sat Mar 05 16:11:32 UTC 2011
[INFO] Final Memory: 48M/100M
[INFO] ------------------------------------------------------------------------
maven builder waiting
mavenExecutionResult exceptions not empty
org.apache.maven.lifecycle.LifecycleExecutionException: Failed to execute goal org.apache.maven.plugins:maven-compiler-plugin:2.3.2:compile
(default-compile) on project apacheds-protocol-ldap: Compilation failure
<https://hudson.apache.org/hudson/job/dir-apacheds-jdk15-ubuntu-deploy/ws/trunk/protocol-ldap/src/main/java/org/apache/directory/server/ldap/LdapServer.java>:[396,81]
inconvertible types
found   : org.apache.directory.server.ldap.ExtendedOperationHandler<capture of ? extends
org.apache.directory.shared.ldap.model.message.ExtendedRequest<? extends org.apache.directory.shared.ldap.model.message.ExtendedResponse>,capture
of ? extends org.apache.directory.shared.ldap.model.message.ExtendedResponse>
required: org.apache.directory.server.ldap.handlers.extended.StartTlsHandler

	at org.apache.maven.lifecycle.internal.MojoExecutor.execute(MojoExecutor.java:213)
	at org.apache.maven.lifecycle.internal.MojoExecutor.execute(MojoExecutor.java:153)
	at org.apache.maven.lifecycle.internal.MojoExecutor.execute(MojoExecutor.java:145)
	at org.apache.maven.lifecycle.internal.LifecycleModuleBuilder.buildProject(LifecycleModuleBuilder.java:84)
	at org.apache.maven.lifecycle.internal.LifecycleModuleBuilder.buildProject(LifecycleModuleBuilder.java:59)
	at org.apache.maven.lifecycle.internal.LifecycleStarter.singleThreadedBuild(LifecycleStarter.java:183)
	at org.apache.maven.lifecycle.internal.LifecycleStarter.execute(LifecycleStarter.java:161)
	at org.apache.maven.DefaultMaven.doExecute(DefaultMaven.java:319)
	at org.apache.maven.DefaultMaven.execute(DefaultMaven.java:156)
	at org.jvnet.hudson.maven3.launcher.Maven3Launcher.main(Maven3Launcher.java:79)
	at sun.reflect.NativeMethodAccessorImpl.invoke0(Native Method)
	at sun.reflect.NativeMethodAccessorImpl.invoke(NativeMethodAccessorImpl.java:39)
	at sun.reflect.DelegatingMethodAccessorImpl.invoke(DelegatingMethodAccessorImpl.java:25)
	at java.lang.reflect.Method.invoke(Method.java:592)
	at org.codehaus.plexus.classworlds.launcher.Launcher.launchStandard(Launcher.java:329)
	at org.codehaus.plexus.classworlds.launcher.Launcher.launch(Launcher.java:239)
	at org.jvnet.hudson.maven3.agent.Maven3Main.launch(Maven3Main.java:145)
	at hudson.maven.Maven3Builder.call(Maven3Builder.java:124)
	at hudson.maven.Maven3Builder.call(Maven3Builder.java:71)
	at hudson.remoting.UserRequest.perform(UserRequest.java:114)
	at hudson.remoting.UserRequest.perform(UserRequest.java:48)
	at hudson.remoting.Request$2.run(Request.java:270)
	at java.util.concurrent.Executors$RunnableAdapter.call(Executors.java:417)
	at java.util.concurrent.FutureTask$Sync.innerRun(FutureTask.java:269)
	at java.util.concurrent.FutureTask.run(FutureTask.java:123)
	at java.util.concurrent.ThreadPoolExecutor$Worker.runTask(ThreadPoolExecutor.java:651)
	at java.util.concurrent.ThreadPoolExecutor$Worker.run(ThreadPoolExecutor.java:676)
	at java.lang.Thread.run(Thread.java:595)
Caused by: org.apache.maven.plugin.CompilationFailureException: Compilation failure
<https://hudson.apache.org/hudson/job/dir-apacheds-jdk15-ubuntu-deploy/ws/trunk/protocol-ldap/src/main/java/org/apache/directory/server/ldap/LdapServer.java>:[396,81]
inconvertible types
found   : org.apache.directory.server.ldap.ExtendedOperationHandler<capture of ? extends
org.apache.directory.shared.ldap.model.message.ExtendedRequest<? extends org.apache.directory.shared.ldap.model.message.ExtendedResponse>,capture
of ? extends org.apache.directory.shared.ldap.model.message.ExtendedResponse>
required: org.apache.directory.server.ldap.handlers.extended.StartTlsHandler

	at org.apache.maven.plugin.AbstractCompilerMojo.execute(AbstractCompilerMojo.java:656)
	at org.apache.maven.plugin.CompilerMojo.execute(CompilerMojo.java:128)
	at org.apache.maven.plugin.DefaultBuildPluginManager.executeMojo(DefaultBuildPluginManager.java:107)
	at org.apache.maven.lifecycle.internal.MojoExecutor.execute(MojoExecutor.java:209)
	... 27 more
Sending e-mails to: notifications@directory.apache.org
channel stopped


Mime
View raw message