directory-notifications mailing list archives

Site index · List index
Message view « Date » · « Thread »
Top « Date » · « Thread »
From Apache Hudson Server <hud...@hudson.apache.org>
Subject Build failed in Hudson: dir-apacheds-jdk15-ubuntu-deploy #192
Date Wed, 02 Mar 2011 04:05:19 GMT
See <https://hudson.apache.org/hudson/job/dir-apacheds-jdk15-ubuntu-deploy/192/changes>

Changes:

[akarasulu] swapping out trunks with milestones to begin M2 release cycle

[akarasulu] fixed compilation issue

[akarasulu] updated poms for shared-ldap-schema => shared-ldap-schema-data artifactId change
to comply with naming conventions

[akarasulu] fixing rename of shared-ldap-codec to shared-ldap-codec-core

[akarasulu] swapping in personal branches for milestone branches

[akarasulu] merging in from trunk

[akarasulu] merging in from milestones

------------------------------------------
[...truncated 314 lines...]
There are no tests to run.

Results :

Tests run: 0, Failures: 0, Errors: 0, Skipped: 0

[HUDSON] Recording test results
[INFO] 
[INFO] --- maven-jar-plugin:2.3.1:jar (default-jar) @ apacheds-i18n ---
[INFO] Building jar: <https://hudson.apache.org/hudson/job/dir-apacheds-jdk15-ubuntu-deploy/ws/trunk/i18n/target/apacheds-i18n-1.5.8-SNAPSHOT.jar>
[INFO] [INFO] Checking legal files in: apacheds-i18n-1.5.8-SNAPSHOT.jar

[INFO] --- tools-maven-plugin:1.4:verify-legal-files (verify-legal-files) @ apacheds-i18n
---
[INFO] [INFO] Installing <https://hudson.apache.org/hudson/job/dir-apacheds-jdk15-ubuntu-deploy/ws/trunk/i18n/target/apacheds-i18n-1.5.8-SNAPSHOT.jar>
to /home/hudson/.m2/repository/org/apache/directory/server/apacheds-i18n/1.5.8-SNAPSHOT/apacheds-i18n-1.5.8-SNAPSHOT.jar

[INFO] --- maven-install-plugin:2.3.1:install (default-install) @ apacheds-i18n ---
[INFO] Installing <https://hudson.apache.org/hudson/job/dir-apacheds-jdk15-ubuntu-deploy/ws/trunk/i18n/pom.xml>
to /home/hudson/.m2/repository/org/apache/directory/server/apacheds-i18n/1.5.8-SNAPSHOT/apacheds-i18n-1.5.8-SNAPSHOT.pom
[INFO] Downloading: https://repository.apache.org/content/repositories/snapshots/org/apache/directory/server/apacheds-i18n/1.5.8-SNAPSHOT/maven-metadata.xml

[INFO] --- maven-deploy-plugin:2.5:deploy (default-deploy) @ apacheds-i18n ---
Downloaded: https://repository.apache.org/content/repositories/snapshots/org/apache/directory/server/apacheds-i18n/1.5.8-SNAPSHOT/maven-metadata.xml
(796 B at 2.2 KB/sec)
Uploading: https://repository.apache.org/content/repositories/snapshots/org/apache/directory/server/apacheds-i18n/1.5.8-SNAPSHOT/apacheds-i18n-1.5.8-20110302.040539-171.jar
Uploaded: https://repository.apache.org/content/repositories/snapshots/org/apache/directory/server/apacheds-i18n/1.5.8-SNAPSHOT/apacheds-i18n-1.5.8-20110302.040539-171.jar
(45 KB at 57.3 KB/sec)
Uploading: https://repository.apache.org/content/repositories/snapshots/org/apache/directory/server/apacheds-i18n/1.5.8-SNAPSHOT/apacheds-i18n-1.5.8-20110302.040539-171.pom
Uploaded: https://repository.apache.org/content/repositories/snapshots/org/apache/directory/server/apacheds-i18n/1.5.8-SNAPSHOT/apacheds-i18n-1.5.8-20110302.040539-171.pom
(2 KB at 8.5 KB/sec)
Downloading: https://repository.apache.org/content/repositories/snapshots/org/apache/directory/server/apacheds-i18n/maven-metadata.xml
Downloaded: https://repository.apache.org/content/repositories/snapshots/org/apache/directory/server/apacheds-i18n/maven-metadata.xml
(380 B at 1.1 KB/sec)
Uploading: https://repository.apache.org/content/repositories/snapshots/org/apache/directory/server/apacheds-i18n/1.5.8-SNAPSHOT/maven-metadata.xml
Uploaded: https://repository.apache.org/content/repositories/snapshots/org/apache/directory/server/apacheds-i18n/1.5.8-SNAPSHOT/maven-metadata.xml
(796 B at 2.1 KB/sec)
Uploading: https://repository.apache.org/content/repositories/snapshots/org/apache/directory/server/apacheds-i18n/maven-metadata.xml
Uploaded: https://repository.apache.org/content/repositories/snapshots/org/apache/directory/server/apacheds-i18n/maven-metadata.xml
(380 B at 1.0 KB/sec)
projectSucceeded org.apache.directory.server:apacheds-i18n:1.5.8-SNAPSHOT
[HUDSON] Archiving <https://hudson.apache.org/hudson/job/dir-apacheds-jdk15-ubuntu-deploy/ws/trunk/i18n/pom.xml>
to /home/hudson/hudson/jobs/dir-apacheds-jdk15-ubuntu-deploy/modules/org.apache.directory.server$apacheds-i18n/builds/2011-03-02_04-04-34/archive/org.apache.directory.server/apacheds-i18n/1.5.8-SNAPSHOT/pom.xml
[HUDSON] Archiving <https://hudson.apache.org/hudson/job/dir-apacheds-jdk15-ubuntu-deploy/ws/trunk/i18n/target/apacheds-i18n-1.5.8-SNAPSHOT.jar>
to /home/hudson/hudson/jobs/dir-apacheds-jdk15-ubuntu-deploy/modules/org.apache.directory.server$apacheds-i18n/builds/2011-03-02_04-04-34/archive/org.apache.directory.server/apacheds-i18n/1.5.8-20110302.040539-171/apacheds-i18n-1.5.8-SNAPSHOT.jar
[INFO] [INFO] Deleting <https://hudson.apache.org/hudson/job/dir-apacheds-jdk15-ubuntu-deploy/ws/trunk/core-constants/target>
                                                                        
[INFO] ------------------------------------------------------------------------
[INFO] Building ApacheDS Core Constants 1.5.8-SNAPSHOT
[INFO] ------------------------------------------------------------------------
[INFO] 
[INFO] --- maven-clean-plugin:2.4.1:clean (default-clean) @ apacheds-core-constants ---
[INFO] 
[INFO] --- maven-remote-resources-plugin:1.1:process (default) @ apacheds-core-constants ---
[INFO] [INFO] Using 'UTF-8' encoding to copy filtered resources.

[INFO] --- maven-resources-plugin:2.4.3:resources (default-resources) @ apacheds-core-constants
---
[INFO] Copying 0 resource
[INFO] Copying 3 resources
[INFO] 
[INFO] --- maven-compiler-plugin:2.3.2:compile (default-compile) @ apacheds-core-constants
---
[INFO] Compiling 4 source files to <https://hudson.apache.org/hudson/job/dir-apacheds-jdk15-ubuntu-deploy/ws/trunk/core-constants/target/classes>
[INFO] [INFO] Using 'UTF-8' encoding to copy filtered resources.
[INFO] skip non existing resourceDirectory <https://hudson.apache.org/hudson/job/dir-apacheds-jdk15-ubuntu-deploy/ws/trunk/core-constants/src/test/resources>
[INFO] Copying 3 resources

[INFO] --- maven-resources-plugin:2.4.3:testResources (default-testResources) @ apacheds-core-constants
---
[INFO] [INFO] No sources to compile

[INFO] --- maven-compiler-plugin:2.3.2:testCompile (default-testCompile) @ apacheds-core-constants
---
[INFO] [INFO] Surefire report directory: <https://hudson.apache.org/hudson/job/dir-apacheds-jdk15-ubuntu-deploy/ws/trunk/core-constants/target/surefire-reports>

[INFO] --- maven-surefire-plugin:2.7.2:test (default-test) @ apacheds-core-constants ---

-------------------------------------------------------
 T E S T S
-------------------------------------------------------
There are no tests to run.

Results :

Tests run: 0, Failures: 0, Errors: 0, Skipped: 0

[HUDSON] Recording test results
[INFO] 
[INFO] --- maven-jar-plugin:2.3.1:jar (default-jar) @ apacheds-core-constants ---
[INFO] Building jar: <https://hudson.apache.org/hudson/job/dir-apacheds-jdk15-ubuntu-deploy/ws/trunk/core-constants/target/apacheds-core-constants-1.5.8-SNAPSHOT.jar>
[INFO] [INFO] Checking legal files in: apacheds-core-constants-1.5.8-SNAPSHOT.jar

[INFO] --- tools-maven-plugin:1.4:verify-legal-files (verify-legal-files) @ apacheds-core-constants
---
[INFO] [INFO] Installing <https://hudson.apache.org/hudson/job/dir-apacheds-jdk15-ubuntu-deploy/ws/trunk/core-constants/target/apacheds-core-constants-1.5.8-SNAPSHOT.jar>
to /home/hudson/.m2/repository/org/apache/directory/server/apacheds-core-constants/1.5.8-SNAPSHOT/apacheds-core-constants-1.5.8-SNAPSHOT.jar

[INFO] --- maven-install-plugin:2.3.1:install (default-install) @ apacheds-core-constants
---
[INFO] Installing <https://hudson.apache.org/hudson/job/dir-apacheds-jdk15-ubuntu-deploy/ws/trunk/core-constants/pom.xml>
to /home/hudson/.m2/repository/org/apache/directory/server/apacheds-core-constants/1.5.8-SNAPSHOT/apacheds-core-constants-1.5.8-SNAPSHOT.pom
[INFO] Downloading: https://repository.apache.org/content/repositories/snapshots/org/apache/directory/server/apacheds-core-constants/1.5.8-SNAPSHOT/maven-metadata.xml

[INFO] --- maven-deploy-plugin:2.5:deploy (default-deploy) @ apacheds-core-constants ---
Downloaded: https://repository.apache.org/content/repositories/snapshots/org/apache/directory/server/apacheds-core-constants/1.5.8-SNAPSHOT/maven-metadata.xml
(806 B at 2.4 KB/sec)
Uploading: https://repository.apache.org/content/repositories/snapshots/org/apache/directory/server/apacheds-core-constants/1.5.8-SNAPSHOT/apacheds-core-constants-1.5.8-20110302.040545-170.jar
Uploaded: https://repository.apache.org/content/repositories/snapshots/org/apache/directory/server/apacheds-core-constants/1.5.8-SNAPSHOT/apacheds-core-constants-1.5.8-20110302.040545-170.jar
(11 KB at 33.1 KB/sec)
Uploading: https://repository.apache.org/content/repositories/snapshots/org/apache/directory/server/apacheds-core-constants/1.5.8-SNAPSHOT/apacheds-core-constants-1.5.8-20110302.040545-170.pom
Uploaded: https://repository.apache.org/content/repositories/snapshots/org/apache/directory/server/apacheds-core-constants/1.5.8-SNAPSHOT/apacheds-core-constants-1.5.8-20110302.040545-170.pom
(2 KB at 8.4 KB/sec)
Downloading: https://repository.apache.org/content/repositories/snapshots/org/apache/directory/server/apacheds-core-constants/maven-metadata.xml
Downloaded: https://repository.apache.org/content/repositories/snapshots/org/apache/directory/server/apacheds-core-constants/maven-metadata.xml
(430 B at 2.6 KB/sec)
Uploading: https://repository.apache.org/content/repositories/snapshots/org/apache/directory/server/apacheds-core-constants/1.5.8-SNAPSHOT/maven-metadata.xml
Uploaded: https://repository.apache.org/content/repositories/snapshots/org/apache/directory/server/apacheds-core-constants/1.5.8-SNAPSHOT/maven-metadata.xml
(806 B at 2.7 KB/sec)
Uploading: https://repository.apache.org/content/repositories/snapshots/org/apache/directory/server/apacheds-core-constants/maven-metadata.xml
Uploaded: https://repository.apache.org/content/repositories/snapshots/org/apache/directory/server/apacheds-core-constants/maven-metadata.xml
(430 B at 2.2 KB/sec)
projectSucceeded org.apache.directory.server:apacheds-core-constants:1.5.8-SNAPSHOT
[HUDSON] Archiving <https://hudson.apache.org/hudson/job/dir-apacheds-jdk15-ubuntu-deploy/ws/trunk/core-constants/pom.xml>
to /home/hudson/hudson/jobs/dir-apacheds-jdk15-ubuntu-deploy/modules/org.apache.directory.server$apacheds-core-constants/builds/2011-03-02_04-04-34/archive/org.apache.directory.server/apacheds-core-constants/1.5.8-SNAPSHOT/pom.xml
[HUDSON] Archiving <https://hudson.apache.org/hudson/job/dir-apacheds-jdk15-ubuntu-deploy/ws/trunk/core-constants/target/apacheds-core-constants-1.5.8-SNAPSHOT.jar>
to /home/hudson/hudson/jobs/dir-apacheds-jdk15-ubuntu-deploy/modules/org.apache.directory.server$apacheds-core-constants/builds/2011-03-02_04-04-34/archive/org.apache.directory.server/apacheds-core-constants/1.5.8-20110302.040545-170/apacheds-core-constants-1.5.8-SNAPSHOT.jar
[INFO]                                                                         
[INFO] ------------------------------------------------------------------------
[INFO] Building ApacheDS Core API 1.5.8-SNAPSHOT
[INFO] ------------------------------------------------------------------------
Downloading: http://repository.apache.org/snapshots/org/apache/directory/shared/shared-ldap-client-api/1.0.0-M2-SNAPSHOT/maven-metadata.xml
Downloading: http://repository.apache.org/snapshots/org/apache/directory/shared/shared-ldap-client-api/1.0.0-M2-SNAPSHOT/maven-metadata.xml
Downloading: http://repository.apache.org/snapshots/org/apache/directory/shared/shared-ldap-client-api/1.0.0-M2-SNAPSHOT/shared-ldap-client-api-1.0.0-M2-SNAPSHOT.pom
[WARNING] The POM for org.apache.directory.shared:shared-ldap-client-api:jar:1.0.0-M2-SNAPSHOT
is missing, no dependency information available
Downloading: http://repository.apache.org/snapshots/org/apache/directory/shared/shared-asn1-api/1.0.0-M2-SNAPSHOT/maven-metadata.xml
Downloaded: http://repository.apache.org/snapshots/org/apache/directory/shared/shared-asn1-api/1.0.0-M2-SNAPSHOT/maven-metadata.xml
(804 B at 6.2 KB/sec)
Downloading: http://repository.apache.org/snapshots/org/apache/directory/shared/shared-parent/1.0.0-M2-SNAPSHOT/maven-metadata.xml
Downloaded: http://repository.apache.org/snapshots/org/apache/directory/shared/shared-parent/1.0.0-M2-SNAPSHOT/maven-metadata.xml
(625 B at 6.8 KB/sec)
Downloading: http://repository.apache.org/snapshots/org/apache/directory/shared/shared-parent/1.0.0-M2-SNAPSHOT/shared-parent-1.0.0-M2-20110302.034315-16.pom
Downloaded: http://repository.apache.org/snapshots/org/apache/directory/shared/shared-parent/1.0.0-M2-SNAPSHOT/shared-parent-1.0.0-M2-20110302.034315-16.pom
(24 KB at 41.4 KB/sec)
Downloading: http://repository.apache.org/snapshots/org/apache/directory/shared/shared-i18n/1.0.0-M2-SNAPSHOT/maven-metadata.xml
Downloaded: http://repository.apache.org/snapshots/org/apache/directory/shared/shared-i18n/1.0.0-M2-SNAPSHOT/maven-metadata.xml
(800 B at 8.2 KB/sec)
Downloading: http://repository.apache.org/snapshots/org/apache/directory/shared/shared-i18n/1.0.0-M2-SNAPSHOT/shared-i18n-1.0.0-M2-20110302.034325-16.pom
Downloaded: http://repository.apache.org/snapshots/org/apache/directory/shared/shared-i18n/1.0.0-M2-SNAPSHOT/shared-i18n-1.0.0-M2-20110302.034325-16.pom
(3 KB at 28.3 KB/sec)
Downloading: http://repository.apache.org/snapshots/org/apache/directory/shared/shared-ldap-codec-standalone/1.0.0-M2-SNAPSHOT/maven-metadata.xml
Downloaded: http://repository.apache.org/snapshots/org/apache/directory/shared/shared-ldap-codec-standalone/1.0.0-M2-SNAPSHOT/maven-metadata.xml
(814 B at 3.7 KB/sec)
[WARNING] The POM for org.apache.directory.shared:shared-ldap-codec-standalone:jar:1.0.0-M2-20110301.035512-9
is invalid, transitive dependencies (if any) will not be available, enable debug logging for
more details
Downloading: http://repository.apache.org/snapshots/org/apache/directory/shared/shared-ldap-codec-core/1.0.0-M2-SNAPSHOT/maven-metadata.xml
Downloading: http://repository.apache.org/snapshots/org/apache/directory/shared/shared-ldap-codec-core/1.0.0-M2-SNAPSHOT/maven-metadata.xml
Downloading: http://repository.apache.org/snapshots/org/apache/directory/shared/shared-ldap-codec-core/1.0.0-M2-SNAPSHOT/shared-ldap-codec-core-1.0.0-M2-SNAPSHOT.pom
[WARNING] The POM for org.apache.directory.shared:shared-ldap-codec-core:jar:1.0.0-M2-SNAPSHOT
is missing, no dependency information available
Downloading: http://repository.apache.org/snapshots/org/apache/directory/shared/shared-ldap-model/1.0.0-M2-SNAPSHOT/maven-metadata.xml
Downloaded: http://repository.apache.org/snapshots/org/apache/directory/shared/shared-ldap-model/1.0.0-M2-SNAPSHOT/maven-metadata.xml
(806 B at 6.1 KB/sec)
Downloading: http://repository.apache.org/snapshots/org/apache/directory/shared/shared-util/1.0.0-M2-SNAPSHOT/maven-metadata.xml
Downloaded: http://repository.apache.org/snapshots/org/apache/directory/shared/shared-util/1.0.0-M2-SNAPSHOT/maven-metadata.xml
(800 B at 8.1 KB/sec)
Downloading: http://repository.apache.org/snapshots/org/apache/directory/shared/shared-util/1.0.0-M2-SNAPSHOT/shared-util-1.0.0-M2-20110302.034344-16.pom
Downloaded: http://repository.apache.org/snapshots/org/apache/directory/shared/shared-util/1.0.0-M2-SNAPSHOT/shared-util-1.0.0-M2-20110302.034344-16.pom
(3 KB at 26.2 KB/sec)
Downloading: http://repository.apache.org/snapshots/org/apache/directory/shared/shared-asn1-ber/1.0.0-M2-SNAPSHOT/maven-metadata.xml
Downloaded: http://repository.apache.org/snapshots/org/apache/directory/shared/shared-asn1-ber/1.0.0-M2-SNAPSHOT/maven-metadata.xml
(804 B at 8.3 KB/sec)
Downloading: http://repository.apache.org/snapshots/org/apache/directory/shared/shared-ldap-schema-data/1.0.0-M2-SNAPSHOT/maven-metadata.xml
Downloading: http://repository.apache.org/snapshots/org/apache/directory/shared/shared-ldap-schema-data/1.0.0-M2-SNAPSHOT/maven-metadata.xml
Downloading: http://repository.apache.org/snapshots/org/apache/directory/shared/shared-ldap-schema-data/1.0.0-M2-SNAPSHOT/shared-ldap-schema-data-1.0.0-M2-SNAPSHOT.pom
[WARNING] The POM for org.apache.directory.shared:shared-ldap-schema-data:jar:1.0.0-M2-SNAPSHOT
is missing, no dependency information available
Downloading: http://repository.apache.org/snapshots/org/apache/directory/shared/shared-ldap-extras-util/1.0.0-M2-SNAPSHOT/maven-metadata.xml
Downloading: http://repository.apache.org/snapshots/org/apache/directory/shared/shared-ldap-extras-util/1.0.0-M2-SNAPSHOT/maven-metadata.xml
Downloading: http://repository.apache.org/snapshots/org/apache/directory/shared/shared-ldap-extras-parent/1.0.0-M2-SNAPSHOT/maven-metadata.xml
Downloading: http://repository.apache.org/snapshots/org/apache/directory/shared/shared-ldap-client-api/1.0.0-M2-SNAPSHOT/shared-ldap-client-api-1.0.0-M2-SNAPSHOT.jar
Downloading: http://repository.apache.org/snapshots/org/apache/directory/shared/shared-i18n/1.0.0-M2-SNAPSHOT/shared-i18n-1.0.0-M2-20110302.034325-16.jar
Downloading: http://repository.apache.org/snapshots/org/apache/directory/shared/shared-ldap-codec-core/1.0.0-M2-SNAPSHOT/shared-ldap-codec-core-1.0.0-M2-SNAPSHOT.jar
Downloading: http://repository.apache.org/snapshots/org/apache/directory/shared/shared-ldap-schema-data/1.0.0-M2-SNAPSHOT/shared-ldap-schema-data-1.0.0-M2-SNAPSHOT.jar
Downloading: http://repository.apache.org/snapshots/org/apache/directory/shared/shared-util/1.0.0-M2-SNAPSHOT/shared-util-1.0.0-M2-20110302.034344-16.jar
Downloaded: http://repository.apache.org/snapshots/org/apache/directory/shared/shared-i18n/1.0.0-M2-SNAPSHOT/shared-i18n-1.0.0-M2-20110302.034325-16.jar
(44 KB at 182.0 KB/sec)
Downloaded: http://repository.apache.org/snapshots/org/apache/directory/shared/shared-util/1.0.0-M2-SNAPSHOT/shared-util-1.0.0-M2-20110302.034344-16.jar
(86 KB at 260.0 KB/sec)
projectFailed org.apache.directory.server:apacheds-core-api:1.5.8-SNAPSHOT
[HUDSON] Archiving <https://hudson.apache.org/hudson/job/dir-apacheds-jdk15-ubuntu-deploy/ws/trunk/core-api/pom.xml>
to /home/hudson/hudson/jobs/dir-apacheds-jdk15-ubuntu-deploy/modules/org.apache.directory.server$apacheds-core-api/builds/2011-03-02_04-04-34/archive/org.apache.directory.server/apacheds-core-api/1.5.8-SNAPSHOT/pom.xml
sessionEnded
[INFO] ------------------------------------------------------------------------
[INFO] Reactor Summary:
[INFO] 
[INFO] ApacheDS .......................................... SUCCESS [10.400s]
[INFO] ApacheDS I18n ..................................... SUCCESS [6.467s]
[INFO] ApacheDS Core Constants ........................... SUCCESS [4.215s]
[INFO] ApacheDS Core API ................................. FAILURE [4.099s]
[INFO] ApacheDS Core ..................................... SKIPPED
[INFO] ApacheDS Core AVL ................................. SKIPPED
[INFO] ApacheDS Generalized (X) DBM Partition ............ SKIPPED
[INFO] ApacheDS LDIF Partition ........................... SKIPPED
[INFO] ApacheDS JDBM implementation ...................... SKIPPED
[INFO] ApacheDS JDBM Partition ........................... SKIPPED
[INFO] ApacheDS Core Annotations ......................... SKIPPED
[INFO] ApacheDS Core JNDI ................................ SKIPPED
[INFO] ApacheDS Protocol Shared .......................... SKIPPED
[INFO] ApacheDS Protocol Kerberos Codec .................. SKIPPED
[INFO] ApacheDS Interceptors for Kerberos ................ SKIPPED
[INFO] ApacheDS Protocol Dhcp ............................ SKIPPED
[INFO] ApacheDS Protocol Dns ............................. SKIPPED
[INFO] ApacheDS Protocol Kerberos ........................ SKIPPED
[INFO] ApacheDS Protocol Ldap ............................ SKIPPED
[INFO] ApacheDS Protocol Ntp ............................. SKIPPED
[INFO] Apacheds Server Annotations ....................... SKIPPED
[INFO] ApacheDS Server Config ............................ SKIPPED
[INFO] ApacheDS Server JNDI .............................. SKIPPED
[INFO] ApacheDS Server Replication Service ............... SKIPPED
[INFO] ApacheDS Test Framework ........................... SKIPPED
[INFO] ApacheDS Generalized (X) DBM Tools ................ SKIPPED
[INFO] ApacheDS All ...................................... SKIPPED
[INFO] ApacheDS Core Integration ......................... SKIPPED
[INFO] ApacheDS Server Integration ....................... SKIPPED
[INFO] ApacheDS DirectoryService-WebApp bridge ........... SKIPPED
[INFO] ApacheDS Jetty HTTP Server Integration ............ SKIPPED
[INFO] ApacheDS Service Builder .......................... SKIPPED
[INFO] ApacheDS Protocol Kerberos Test ................... SKIPPED
[INFO] Apache Directory LDAP Client API test ............. SKIPPED
[INFO] ApacheDS Service .................................. SKIPPED
[INFO] ApacheDS Wrapper .................................. SKIPPED
[INFO] ------------------------------------------------------------------------
[INFO] BUILD FAILURE
[INFO] ------------------------------------------------------------------------
[INFO] Total time: 31.935s
[INFO] Finished at: Wed Mar 02 04:05:53 UTC 2011
[INFO] Final Memory: 19M/59M
[INFO] ------------------------------------------------------------------------
mavenExecutionResult exceptions not empty
org.apache.maven.lifecycle.LifecycleExecutionException: Failed to execute goal on project
apacheds-core-api: Could not resolve dependencies for project org.apache.directory.server:apacheds-core-api:jar:1.5.8-SNAPSHOT:
The following artifacts could not be resolved: org.apache.directory.shared:shared-ldap-client-api:jar:1.0.0-M2-SNAPSHOT,
org.apache.directory.shared:shared-ldap-codec-core:jar:1.0.0-M2-SNAPSHOT, org.apache.directory.shared:shared-ldap-schema-data:jar:1.0.0-M2-SNAPSHOT:
Could not find artifact org.apache.directory.shared:shared-ldap-client-api:jar:1.0.0-M2-SNAPSHOT
in Nexus (http://repository.apache.org/snapshots)
	at org.apache.maven.lifecycle.internal.LifecycleDependencyResolver.getDependencies(LifecycleDependencyResolver.java:190)
	at org.apache.maven.lifecycle.internal.LifecycleDependencyResolver.resolveProjectDependencies(LifecycleDependencyResolver.java:104)
	at org.apache.maven.lifecycle.internal.MojoExecutor.ensureDependenciesAreResolved(MojoExecutor.java:258)
	at org.apache.maven.lifecycle.internal.MojoExecutor.execute(MojoExecutor.java:201)
	at org.apache.maven.lifecycle.internal.MojoExecutor.execute(MojoExecutor.java:153)
	at org.apache.maven.lifecycle.internal.MojoExecutor.execute(MojoExecutor.java:145)
	at org.apache.maven.lifecycle.internal.LifecycleModuleBuilder.buildProject(LifecycleModuleBuilder.java:84)
	at org.apache.maven.lifecycle.internal.LifecycleModuleBuilder.buildProject(LifecycleModuleBuilder.java:59)
	at org.apache.maven.lifecycle.internal.LifecycleStarter.singleThreadedBuild(LifecycleStarter.java:183)
	at org.apache.maven.lifecycle.internal.LifecycleStarter.execute(LifecycleStarter.java:161)
	at org.apache.maven.DefaultMaven.doExecute(DefaultMaven.java:319)
	at org.apache.maven.DefaultMaven.execute(DefaultMaven.java:156)
	at org.jvnet.hudson.maven3.launcher.Maven3Launcher.main(Maven3Launcher.java:79)
	at sun.reflect.NativeMethodAccessorImpl.invoke0(Native Method)
	at sun.reflect.NativeMethodAccessorImpl.invoke(NativeMethodAccessorImpl.java:39)
	at sun.reflect.DelegatingMethodAccessorImpl.invoke(DelegatingMethodAccessorImpl.java:25)
	at java.lang.reflect.Method.invoke(Method.java:592)
	at org.codehaus.plexus.classworlds.launcher.Launcher.launchStandard(Launcher.java:329)
	at org.codehaus.plexus.classworlds.launcher.Launcher.launch(Launcher.java:239)
	at org.jvnet.hudson.maven3.agent.Maven3Main.launch(Maven3Main.java:145)
	at hudson.maven.Maven3Builder.call(Maven3Builder.java:124)
	at hudson.maven.Maven3Builder.call(Maven3Builder.java:71)
	at hudson.remoting.UserRequest.perform(UserRequest.java:114)
	at hudson.remoting.UserRequest.perform(UserRequest.java:48)
	at hudson.remoting.Request$2.run(Request.java:270)
	at java.util.concurrent.Executors$RunnableAdapter.call(Executors.java:417)
	at java.util.concurrent.FutureTask$Sync.innerRun(FutureTask.java:269)
	at java.util.concurrent.FutureTask.run(FutureTask.java:123)
	at java.util.concurrent.ThreadPoolExecutor$Worker.runTask(ThreadPoolExecutor.java:651)
	at java.util.concurrent.ThreadPoolExecutor$Worker.run(ThreadPoolExecutor.java:676)
	at java.lang.Thread.run(Thread.java:595)
Caused by: org.apache.maven.project.DependencyResolutionException: Could not resolve dependencies
for project org.apache.directory.server:apacheds-core-api:jar:1.5.8-SNAPSHOT: The following
artifacts could not be resolved: org.apache.directory.shared:shared-ldap-client-api:jar:1.0.0-M2-SNAPSHOT,
org.apache.directory.shared:shared-ldap-codec-core:jar:1.0.0-M2-SNAPSHOT, org.apache.directory.shared:shared-ldap-schema-data:jar:1.0.0-M2-SNAPSHOT:
Could not find artifact org.apache.directory.shared:shared-ldap-client-api:jar:1.0.0-M2-SNAPSHOT
in Nexus (http://repository.apache.org/snapshots)
	at org.apache.maven.project.DefaultProjectDependenciesResolver.resolve(DefaultProjectDependenciesResolver.java:156)
	at org.apache.maven.lifecycle.internal.LifecycleDependencyResolver.getDependencies(LifecycleDependencyResolver.java:165)
	... 30 more
Caused by: org.sonatype.aether.resolution.ArtifactResolutionException: The following artifacts
could not be resolved: org.apache.directory.shared:shared-ldap-client-api:jar:1.0.0-M2-SNAPSHOT,
org.apache.directory.shared:shared-ldap-codec-core:jar:1.0.0-M2-SNAPSHOT, org.apache.directory.shared:shared-ldap-schema-data:jar:1.0.0-M2-SNAPSHOT:
Could not find artifact org.apache.directory.shared:shared-ldap-client-api:jar:1.0.0-M2-SNAPSHOT
in Nexus (http://repository.apache.org/snapshots)
	at org.sonatype.aether.impl.internal.DefaultArtifactResolver.resolveArtifacts(DefaultArtifactResolver.java:526)
	at org.sonatype.aether.impl.internal.DefaultRepositorySystem.resolveArtifacts(DefaultRepositorySystem.java:304)
	at org.sonatype.aether.impl.internal.DefaultRepositorySystem.resolveDependencies(DefaultRepositorySystem.java:334)
	at org.apache.maven.project.DefaultProjectDependenciesResolver.resolve(DefaultProjectDependenciesResolver.java:150)
	... 31 more
Caused by: org.sonatype.aether.transfer.ArtifactNotFoundException: Could not find artifact
org.apache.directory.shared:shared-ldap-client-api:jar:1.0.0-M2-SNAPSHOT in Nexus (http://repository.apache.org/snapshots)
	at org.sonatype.aether.connector.wagon.WagonRepositoryConnector$4.wrap(WagonRepositoryConnector.java:945)
	at org.sonatype.aether.connector.wagon.WagonRepositoryConnector$4.wrap(WagonRepositoryConnector.java:940)
	at org.sonatype.aether.connector.wagon.WagonRepositoryConnector$GetTask.flush(WagonRepositoryConnector.java:696)
	at org.sonatype.aether.connector.wagon.WagonRepositoryConnector$GetTask.flush(WagonRepositoryConnector.java:690)
	at org.sonatype.aether.connector.wagon.WagonRepositoryConnector.get(WagonRepositoryConnector.java:435)
	at org.sonatype.aether.impl.internal.DefaultArtifactResolver.resolveArtifacts(DefaultArtifactResolver.java:438)
	... 34 more
Sending e-mails to: notifications@directory.apache.org
channel stopped


Mime
View raw message