directory-notifications mailing list archives

Site index · List index
Message view « Date » · « Thread »
Top « Date » · « Thread »
From Apache Hudson Server <hud...@hudson.apache.org>
Subject Build failed in Jenkins: dir-apacheds-jdk15-ubuntu-deploy #219
Date Sat, 26 Mar 2011 04:04:46 GMT
See <https://hudson.apache.org/hudson/job/dir-apacheds-jdk15-ubuntu-deploy/219/changes>

Changes:

[elecharny] Reverted the order in which the getRdn( int ) returns the Rdn to be consistant
with the getRdns() method

[elecharny] o Renamed the addAll( Dn ) method to add( Dn )
o Fixed some potential NPE
o Minor other refactorings

------------------------------------------
[...truncated 481 lines...]
[INFO] --- maven-compiler-plugin:2.3.2:testCompile (default-testCompile) @ apacheds-core-api
---
[INFO] Surefire report directory: <https://hudson.apache.org/hudson/job/dir-apacheds-jdk15-ubuntu-deploy/ws/trunk/core-api/target/surefire-reports>
[INFO] 
[INFO] --- maven-surefire-plugin:2.7.2:test (default-test) @ apacheds-core-api ---

-------------------------------------------------------
 T E S T S
-------------------------------------------------------
Running org.apache.directory.server.core.changelog.TagTest
Tests run: 8, Failures: 0, Errors: 0, Skipped: 0, Time elapsed: 0.057 sec
Running org.apache.directory.server.core.entry.SchemaAwareEntryAttributeTest
Tests run: 52, Failures: 0, Errors: 0, Skipped: 0, Time elapsed: 1.357 sec
Running org.apache.directory.server.core.entry.ClonedServerEntryTest
Tests run: 8, Failures: 0, Errors: 0, Skipped: 0, Time elapsed: 0.008 sec
Running org.apache.directory.server.core.entry.SchemaAwareEntryTest
Tests run: 88, Failures: 0, Errors: 0, Skipped: 0, Time elapsed: 0.628 sec
Running org.apache.directory.server.core.entry.SchemaAwareModificationTest
Tests run: 7, Failures: 0, Errors: 0, Skipped: 0, Time elapsed: 0.405 sec

Results :

Tests run: 163, Failures: 0, Errors: 0, Skipped: 0

[JENKINS] Recording test results
[INFO] 
[INFO] --- maven-jar-plugin:2.3.1:jar (default-jar) @ apacheds-core-api ---
[INFO] Building jar: <https://hudson.apache.org/hudson/job/dir-apacheds-jdk15-ubuntu-deploy/ws/trunk/core-api/target/apacheds-core-api-1.5.8-SNAPSHOT.jar>
[INFO] 
[INFO] --- maven-jar-plugin:2.3.1:test-jar (attach-tests) @ apacheds-core-api ---
[INFO] Building jar: <https://hudson.apache.org/hudson/job/dir-apacheds-jdk15-ubuntu-deploy/ws/trunk/core-api/target/apacheds-core-api-1.5.8-SNAPSHOT-tests.jar>
[INFO] [INFO] Checking legal files in: apacheds-core-api-1.5.8-SNAPSHOT.jar
[INFO] Checking legal files in: apacheds-core-api-1.5.8-SNAPSHOT-tests.jar

[INFO] --- tools-maven-plugin:1.4:verify-legal-files (verify-legal-files) @ apacheds-core-api
---
[INFO] [INFO] Exclude: **/target/**/*
[INFO] Exclude: **/cobertura.ser
[INFO] Exclude: **/.classpath
[INFO] Exclude: **/.project
[INFO] Exclude: **/.settings/**/*
[INFO] Exclude: **/*.iml
[INFO] Exclude: **/*.ipr
[INFO] Exclude: **/*.iws
[INFO] Exclude: **/MANIFEST.MF
[INFO] Exclude: **/dependency-reduced-pom.xml
[INFO] Exclude: **/*.ldif
[INFO] Exclude: **/*.pdu
[INFO] Exclude: jdbm/**/*
[INFO] Exclude: installers-maven-plugin/src/main/resources/org/apache/directory/server/installers/deb/control
[INFO] Exclude: installers-maven-plugin/src/main/resources/org/apache/directory/server/installers/macosxpkg/License.rtf
[INFO] Exclude: installers-maven-plugin/src/main/resources/org/apache/directory/server/installers/solarispkg/pkginfo
[INFO] Exclude: installers-maven-plugin/src/main/resources/org/apache/directory/server/installers/solarispkg/Prototype
[INFO] Exclude: osgi/src/main/resources/META-INF/spring.handlers
[INFO] Exclude: osgi/src/main/resources/META-INF/spring.schemas
[INFO] Exclude: **/*.log

[INFO] --- apache-rat-plugin:0.7:check (default) @ apacheds-core-api ---
mojo forkStarted org.apache.maven.plugins:maven-source-plugin:2.1.2(attach-sources)
mojo forkSucceeded org.apache.maven.plugins:maven-source-plugin:2.1.2(attach-sources)
ignoring exception during new ExecutedMojo null
[INFO] 
[INFO] --- maven-source-plugin:2.1.2:jar (attach-sources) @ apacheds-core-api ---
[INFO] META-INF already added, skipping
[INFO] META-INF/LICENSE already added, skipping
[INFO] META-INF/DEPENDENCIES already added, skipping
[INFO] META-INF/NOTICE already added, skipping
[INFO] Building jar: <https://hudson.apache.org/hudson/job/dir-apacheds-jdk15-ubuntu-deploy/ws/trunk/core-api/target/apacheds-core-api-1.5.8-SNAPSHOT-sources.jar>
[INFO] META-INF already added, skipping
[INFO] META-INF/LICENSE already added, skipping
[INFO] META-INF/DEPENDENCIES already added, skipping
[INFO] META-INF/NOTICE already added, skipping
[INFO] Installing <https://hudson.apache.org/hudson/job/dir-apacheds-jdk15-ubuntu-deploy/ws/trunk/core-api/target/apacheds-core-api-1.5.8-SNAPSHOT.jar>
to /home/hudson/.m2/repository/org/apache/directory/server/apacheds-core-api/1.5.8-SNAPSHOT/apacheds-core-api-1.5.8-SNAPSHOT.jar
[INFO] 
[INFO] --- maven-install-plugin:2.3.1:install (default-install) @ apacheds-core-api ---
[INFO] Installing <https://hudson.apache.org/hudson/job/dir-apacheds-jdk15-ubuntu-deploy/ws/trunk/core-api/pom.xml>
to /home/hudson/.m2/repository/org/apache/directory/server/apacheds-core-api/1.5.8-SNAPSHOT/apacheds-core-api-1.5.8-SNAPSHOT.pom
[INFO] Installing <https://hudson.apache.org/hudson/job/dir-apacheds-jdk15-ubuntu-deploy/ws/trunk/core-api/target/apacheds-core-api-1.5.8-SNAPSHOT-tests.jar>
to /home/hudson/.m2/repository/org/apache/directory/server/apacheds-core-api/1.5.8-SNAPSHOT/apacheds-core-api-1.5.8-SNAPSHOT-tests.jar
[INFO] Installing <https://hudson.apache.org/hudson/job/dir-apacheds-jdk15-ubuntu-deploy/ws/trunk/core-api/target/apacheds-core-api-1.5.8-SNAPSHOT-sources.jar>
to /home/hudson/.m2/repository/org/apache/directory/server/apacheds-core-api/1.5.8-SNAPSHOT/apacheds-core-api-1.5.8-SNAPSHOT-sources.jar
[INFO] Downloading: https://repository.apache.org/content/repositories/snapshots/org/apache/directory/server/apacheds-core-api/1.5.8-SNAPSHOT/maven-metadata.xml

[INFO] --- maven-deploy-plugin:2.5:deploy (default-deploy) @ apacheds-core-api ---
Downloaded: https://repository.apache.org/content/repositories/snapshots/org/apache/directory/server/apacheds-core-api/1.5.8-SNAPSHOT/maven-metadata.xml
(2 KB at 3.0 KB/sec)
Uploading: https://repository.apache.org/content/repositories/snapshots/org/apache/directory/server/apacheds-core-api/1.5.8-SNAPSHOT/apacheds-core-api-1.5.8-20110326.040434-185.jar
Uploaded: https://repository.apache.org/content/repositories/snapshots/org/apache/directory/server/apacheds-core-api/1.5.8-SNAPSHOT/apacheds-core-api-1.5.8-20110326.040434-185.jar
(232 KB at 552.7 KB/sec)
Uploading: https://repository.apache.org/content/repositories/snapshots/org/apache/directory/server/apacheds-core-api/1.5.8-SNAPSHOT/apacheds-core-api-1.5.8-20110326.040434-185.pom
Uploaded: https://repository.apache.org/content/repositories/snapshots/org/apache/directory/server/apacheds-core-api/1.5.8-SNAPSHOT/apacheds-core-api-1.5.8-20110326.040434-185.pom
(5 KB at 29.1 KB/sec)
Downloading: https://repository.apache.org/content/repositories/snapshots/org/apache/directory/server/apacheds-core-api/maven-metadata.xml
Downloaded: https://repository.apache.org/content/repositories/snapshots/org/apache/directory/server/apacheds-core-api/maven-metadata.xml
(384 B at 3.3 KB/sec)
Uploading: https://repository.apache.org/content/repositories/snapshots/org/apache/directory/server/apacheds-core-api/1.5.8-SNAPSHOT/maven-metadata.xml
Uploaded: https://repository.apache.org/content/repositories/snapshots/org/apache/directory/server/apacheds-core-api/1.5.8-SNAPSHOT/maven-metadata.xml
(2 KB at 5.8 KB/sec)
Uploading: https://repository.apache.org/content/repositories/snapshots/org/apache/directory/server/apacheds-core-api/maven-metadata.xml
Uploaded: https://repository.apache.org/content/repositories/snapshots/org/apache/directory/server/apacheds-core-api/maven-metadata.xml
(384 B at 1.9 KB/sec)
Uploading: https://repository.apache.org/content/repositories/snapshots/org/apache/directory/server/apacheds-core-api/1.5.8-SNAPSHOT/apacheds-core-api-1.5.8-20110326.040434-185-tests.jar
Uploaded: https://repository.apache.org/content/repositories/snapshots/org/apache/directory/server/apacheds-core-api/1.5.8-SNAPSHOT/apacheds-core-api-1.5.8-20110326.040434-185-tests.jar
(72 KB at 250.4 KB/sec)
Uploading: https://repository.apache.org/content/repositories/snapshots/org/apache/directory/server/apacheds-core-api/1.5.8-SNAPSHOT/maven-metadata.xml
Uploaded: https://repository.apache.org/content/repositories/snapshots/org/apache/directory/server/apacheds-core-api/1.5.8-SNAPSHOT/maven-metadata.xml
(2 KB at 7.5 KB/sec)
Uploading: https://repository.apache.org/content/repositories/snapshots/org/apache/directory/server/apacheds-core-api/1.5.8-SNAPSHOT/apacheds-core-api-1.5.8-20110326.040434-185-sources.jar
Uploaded: https://repository.apache.org/content/repositories/snapshots/org/apache/directory/server/apacheds-core-api/1.5.8-SNAPSHOT/apacheds-core-api-1.5.8-20110326.040434-185-sources.jar
(234 KB at 933.8 KB/sec)
Uploading: https://repository.apache.org/content/repositories/snapshots/org/apache/directory/server/apacheds-core-api/1.5.8-SNAPSHOT/maven-metadata.xml
Uploaded: https://repository.apache.org/content/repositories/snapshots/org/apache/directory/server/apacheds-core-api/1.5.8-SNAPSHOT/maven-metadata.xml
(2 KB at 8.5 KB/sec)
projectSucceeded org.apache.directory.server:apacheds-core-api:1.5.8-SNAPSHOT
[JENKINS] Archiving <https://hudson.apache.org/hudson/job/dir-apacheds-jdk15-ubuntu-deploy/ws/trunk/core-api/pom.xml>
to /home/hudson/hudson/jobs/dir-apacheds-jdk15-ubuntu-deploy/modules/org.apache.directory.server$apacheds-core-api/builds/2011-03-26_04-02-45/archive/org.apache.directory.server/apacheds-core-api/1.5.8-SNAPSHOT/pom.xml
[JENKINS] Archiving <https://hudson.apache.org/hudson/job/dir-apacheds-jdk15-ubuntu-deploy/ws/trunk/core-api/target/apacheds-core-api-1.5.8-SNAPSHOT.jar>
to /home/hudson/hudson/jobs/dir-apacheds-jdk15-ubuntu-deploy/modules/org.apache.directory.server$apacheds-core-api/builds/2011-03-26_04-02-45/archive/org.apache.directory.server/apacheds-core-api/1.5.8-20110326.040434-185/apacheds-core-api-1.5.8-SNAPSHOT.jar
[JENKINS] Archiving <https://hudson.apache.org/hudson/job/dir-apacheds-jdk15-ubuntu-deploy/ws/trunk/core-api/target/apacheds-core-api-1.5.8-SNAPSHOT-tests.jar>
to /home/hudson/hudson/jobs/dir-apacheds-jdk15-ubuntu-deploy/modules/org.apache.directory.server$apacheds-core-api/builds/2011-03-26_04-02-45/archive/org.apache.directory.server/apacheds-core-api/1.5.8-20110326.040434-185/apacheds-core-api-1.5.8-SNAPSHOT-tests.jar
[JENKINS] Archiving <https://hudson.apache.org/hudson/job/dir-apacheds-jdk15-ubuntu-deploy/ws/trunk/core-api/target/apacheds-core-api-1.5.8-SNAPSHOT-sources.jar>
to /home/hudson/hudson/jobs/dir-apacheds-jdk15-ubuntu-deploy/modules/org.apache.directory.server$apacheds-core-api/builds/2011-03-26_04-02-45/archive/org.apache.directory.server/apacheds-core-api/1.5.8-20110326.040434-185/apacheds-core-api-1.5.8-SNAPSHOT-sources.jar
[INFO]                                                                         
[INFO] ------------------------------------------------------------------------
[INFO] Building ApacheDS Core 1.5.8-SNAPSHOT
[INFO] ------------------------------------------------------------------------
Downloading: http://repository.apache.org/snapshots/org/apache/directory/shared/shared-ldap-extras-trigger/1.0.0-M3-SNAPSHOT/maven-metadata.xml
Downloaded: http://repository.apache.org/snapshots/org/apache/directory/shared/shared-ldap-extras-trigger/1.0.0-M3-SNAPSHOT/maven-metadata.xml
(815 B at 3.8 KB/sec)
Downloading: http://repository.apache.org/snapshots/org/apache/directory/shared/shared-ldap-extras-trigger/1.0.0-M3-SNAPSHOT/maven-metadata.xml
Downloaded: http://repository.apache.org/snapshots/org/apache/directory/shared/shared-ldap-extras-trigger/1.0.0-M3-SNAPSHOT/maven-metadata.xml
(815 B at 9.8 KB/sec)
[INFO] [INFO] Deleting <https://hudson.apache.org/hudson/job/dir-apacheds-jdk15-ubuntu-deploy/ws/trunk/core/target>

[INFO] --- maven-clean-plugin:2.4.1:clean (default-clean) @ apacheds-core ---
[INFO] 
[INFO] --- maven-remote-resources-plugin:1.2:process (default) @ apacheds-core ---
[debug] execute contextualize
[INFO] [INFO] Using 'UTF-8' encoding to copy filtered resources.
[INFO] Copying 1 resource
[INFO] Copying 3 resources

[INFO] --- maven-resources-plugin:2.5:resources (default-resources) @ apacheds-core ---
[INFO] 
[INFO] --- maven-compiler-plugin:2.3.2:compile (default-compile) @ apacheds-core ---
[INFO] Compiling 109 source files to <https://hudson.apache.org/hudson/job/dir-apacheds-jdk15-ubuntu-deploy/ws/trunk/core/target/classes>
[INFO] -------------------------------------------------------------
[ERROR] COMPILATION ERROR : 
[INFO] -------------------------------------------------------------
[ERROR] <https://hudson.apache.org/hudson/job/dir-apacheds-jdk15-ubuntu-deploy/ws/trunk/core/src/main/java/org/apache/directory/server/core/DefaultOperationManager.java>:[108,40]
cannot find symbol
symbol  : method add(org.apache.directory.shared.ldap.model.name.Dn)
location: class org.apache.directory.shared.ldap.model.name.Dn
[ERROR] <https://hudson.apache.org/hudson/job/dir-apacheds-jdk15-ubuntu-deploy/ws/trunk/core/src/main/java/org/apache/directory/server/core/DefaultOperationManager.java>:[158,44]
cannot find symbol
symbol  : method add(org.apache.directory.shared.ldap.model.name.Dn)
location: class org.apache.directory.shared.ldap.model.name.Dn
[ERROR] <https://hudson.apache.org/hudson/job/dir-apacheds-jdk15-ubuntu-deploy/ws/trunk/core/src/main/java/org/apache/directory/server/core/subtree/SubtreeEvaluator.java>:[81,39]
cannot find symbol
symbol  : method add(org.apache.directory.shared.ldap.model.name.Dn)
location: class org.apache.directory.shared.ldap.model.name.Dn
[ERROR] <https://hudson.apache.org/hudson/job/dir-apacheds-jdk15-ubuntu-deploy/ws/trunk/core/src/main/java/org/apache/directory/server/core/subtree/SubentryInterceptor.java>:[876,27]
cannot find symbol
symbol  : method add(org.apache.directory.shared.ldap.model.name.Dn)
location: class org.apache.directory.shared.ldap.model.name.Dn
[ERROR] <https://hudson.apache.org/hudson/job/dir-apacheds-jdk15-ubuntu-deploy/ws/trunk/core/src/main/java/org/apache/directory/server/core/subtree/SubentryInterceptor.java>:[964,27]
cannot find symbol
symbol  : method add(org.apache.directory.shared.ldap.model.name.Dn)
location: class org.apache.directory.shared.ldap.model.name.Dn
[ERROR] <https://hudson.apache.org/hudson/job/dir-apacheds-jdk15-ubuntu-deploy/ws/trunk/core/src/main/java/org/apache/directory/server/core/subtree/SubentryInterceptor.java>:[1060,33]
cannot find symbol
symbol  : method add(org.apache.directory.shared.ldap.model.name.Dn)
location: class org.apache.directory.shared.ldap.model.name.Dn
[ERROR] <https://hudson.apache.org/hudson/job/dir-apacheds-jdk15-ubuntu-deploy/ws/trunk/core/src/main/java/org/apache/directory/server/core/subtree/SubentryInterceptor.java>:[1097,33]
cannot find symbol
symbol  : method add(org.apache.directory.shared.ldap.model.name.Dn)
location: class org.apache.directory.shared.ldap.model.name.Dn
[ERROR] <https://hudson.apache.org/hudson/job/dir-apacheds-jdk15-ubuntu-deploy/ws/trunk/core/src/main/java/org/apache/directory/server/core/subtree/SubentryInterceptor.java>:[1192,27]
cannot find symbol
symbol  : method add(org.apache.directory.shared.ldap.model.name.Dn)
location: class org.apache.directory.shared.ldap.model.name.Dn
[ERROR] <https://hudson.apache.org/hudson/job/dir-apacheds-jdk15-ubuntu-deploy/ws/trunk/core/src/main/java/org/apache/directory/server/core/subtree/SubentryInterceptor.java>:[1283,27]
cannot find symbol
symbol  : method add(org.apache.directory.shared.ldap.model.name.Dn)
location: class org.apache.directory.shared.ldap.model.name.Dn
[ERROR] <https://hudson.apache.org/hudson/job/dir-apacheds-jdk15-ubuntu-deploy/ws/trunk/core/src/main/java/org/apache/directory/server/core/subtree/SubentryInterceptor.java>:[1366,27]
cannot find symbol
symbol  : method add(org.apache.directory.shared.ldap.model.name.Dn)
location: class org.apache.directory.shared.ldap.model.name.Dn
[INFO] 10 errors 
[INFO] -------------------------------------------------------------
mojoFailed org.apache.maven.plugins:maven-compiler-plugin:2.3.2(default-compile)
projectFailed org.apache.directory.server:apacheds-core:1.5.8-SNAPSHOT
[JENKINS] Archiving <https://hudson.apache.org/hudson/job/dir-apacheds-jdk15-ubuntu-deploy/ws/trunk/core/pom.xml>
to /home/hudson/hudson/jobs/dir-apacheds-jdk15-ubuntu-deploy/modules/org.apache.directory.server$apacheds-core/builds/2011-03-26_04-02-45/archive/org.apache.directory.server/apacheds-core/1.5.8-SNAPSHOT/pom.xml
sessionEnded
[INFO] ------------------------------------------------------------------------
[INFO] Reactor Summary:
[INFO] 
[INFO] ApacheDS .......................................... SUCCESS [34.905s]
[INFO] ApacheDS I18n ..................................... SUCCESS [7.196s]
[INFO] ApacheDS Core Constants ........................... SUCCESS [5.374s]
[INFO] ApacheDS Core API ................................. SUCCESS [37.215s]
[INFO] ApacheDS Core ..................................... FAILURE [4.274s]
[INFO] ApacheDS Core AVL ................................. SKIPPED
[INFO] ApacheDS Generalized (X) DBM Partition ............ SKIPPED
[INFO] ApacheDS LDIF Partition ........................... SKIPPED
[INFO] ApacheDS JDBM implementation ...................... SKIPPED
[INFO] ApacheDS JDBM Partition ........................... SKIPPED
[INFO] ApacheDS Core Annotations ......................... SKIPPED
[INFO] ApacheDS Core JNDI ................................ SKIPPED
[INFO] ApacheDS Protocol Shared .......................... SKIPPED
[INFO] ApacheDS Protocol Kerberos Codec .................. SKIPPED
[INFO] ApacheDS Interceptors for Kerberos ................ SKIPPED
[INFO] ApacheDS Protocol Dhcp ............................ SKIPPED
[INFO] ApacheDS Protocol Dns ............................. SKIPPED
[INFO] ApacheDS Protocol Kerberos ........................ SKIPPED
[INFO] ApacheDS Protocol Ldap ............................ SKIPPED
[INFO] ApacheDS Protocol Ntp ............................. SKIPPED
[INFO] Apacheds Server Annotations ....................... SKIPPED
[INFO] ApacheDS Server Config ............................ SKIPPED
[INFO] ApacheDS Server JNDI .............................. SKIPPED
[INFO] ApacheDS Server Replication Service ............... SKIPPED
[INFO] ApacheDS Test Framework ........................... SKIPPED
[INFO] ApacheDS Generalized (X) DBM Tools ................ SKIPPED
[INFO] ApacheDS All ...................................... SKIPPED
[INFO] ApacheDS Core Integration ......................... SKIPPED
[INFO] ApacheDS Server Integration ....................... SKIPPED
[INFO] ApacheDS DirectoryService-WebApp bridge ........... SKIPPED
[INFO] ApacheDS Jetty HTTP Server Integration ............ SKIPPED
[INFO] ApacheDS Service Builder .......................... SKIPPED
[INFO] ApacheDS Protocol Kerberos Test ................... SKIPPED
[INFO] Apache Directory LDAP Client API test ............. SKIPPED
[INFO] ApacheDS Service .................................. SKIPPED
[INFO] ApacheDS Wrapper .................................. SKIPPED
[INFO] ------------------------------------------------------------------------
[INFO] BUILD FAILURE
[INFO] ------------------------------------------------------------------------
[INFO] Total time: 1:38.997s
[INFO] Finished at: Sat Mar 26 04:04:45 UTC 2011
[INFO] Final Memory: 24M/74M
[INFO] ------------------------------------------------------------------------
maven builder waiting
mavenExecutionResult exceptions not empty
org.apache.maven.lifecycle.LifecycleExecutionException: Failed to execute goal org.apache.maven.plugins:maven-compiler-plugin:2.3.2:compile
(default-compile) on project apacheds-core: Compilation failure
	at org.apache.maven.lifecycle.internal.MojoExecutor.execute(MojoExecutor.java:213)
	at org.apache.maven.lifecycle.internal.MojoExecutor.execute(MojoExecutor.java:153)
	at org.apache.maven.lifecycle.internal.MojoExecutor.execute(MojoExecutor.java:145)
	at org.apache.maven.lifecycle.internal.LifecycleModuleBuilder.buildProject(LifecycleModuleBuilder.java:84)
	at org.apache.maven.lifecycle.internal.LifecycleModuleBuilder.buildProject(LifecycleModuleBuilder.java:59)
	at org.apache.maven.lifecycle.internal.LifecycleStarter.singleThreadedBuild(LifecycleStarter.java:183)
	at org.apache.maven.lifecycle.internal.LifecycleStarter.execute(LifecycleStarter.java:161)
	at org.apache.maven.DefaultMaven.doExecute(DefaultMaven.java:319)
	at org.apache.maven.DefaultMaven.execute(DefaultMaven.java:156)
	at org.jvnet.hudson.maven3.launcher.Maven3Launcher.main(Maven3Launcher.java:79)
	at sun.reflect.NativeMethodAccessorImpl.invoke0(Native Method)
	at sun.reflect.NativeMethodAccessorImpl.invoke(NativeMethodAccessorImpl.java:39)
	at sun.reflect.DelegatingMethodAccessorImpl.invoke(DelegatingMethodAccessorImpl.java:25)
	at java.lang.reflect.Method.invoke(Method.java:592)
	at org.codehaus.plexus.classworlds.launcher.Launcher.launchStandard(Launcher.java:329)
	at org.codehaus.plexus.classworlds.launcher.Launcher.launch(Launcher.java:239)
	at org.jvnet.hudson.maven3.agent.Maven3Main.launch(Maven3Main.java:146)
	at hudson.maven.Maven3Builder.call(Maven3Builder.java:124)
	at hudson.maven.Maven3Builder.call(Maven3Builder.java:71)
	at hudson.remoting.UserRequest.perform(UserRequest.java:114)
	at hudson.remoting.UserRequest.perform(UserRequest.java:48)
	at hudson.remoting.Request$2.run(Request.java:270)
	at java.util.concurrent.Executors$RunnableAdapter.call(Executors.java:417)
	at java.util.concurrent.FutureTask$Sync.innerRun(FutureTask.java:269)
	at java.util.concurrent.FutureTask.run(FutureTask.java:123)
	at java.util.concurrent.ThreadPoolExecutor$Worker.runTask(ThreadPoolExecutor.java:651)
	at java.util.concurrent.ThreadPoolExecutor$Worker.run(ThreadPoolExecutor.java:676)
	at java.lang.Thread.run(Thread.java:595)
Caused by: org.apache.maven.plugin.CompilationFailureException: Compilation failure
	at org.apache.maven.plugin.AbstractCompilerMojo.execute(AbstractCompilerMojo.java:656)
	at org.apache.maven.plugin.CompilerMojo.execute(CompilerMojo.java:128)
	at org.apache.maven.plugin.DefaultBuildPluginManager.executeMojo(DefaultBuildPluginManager.java:101)
	at org.apache.maven.lifecycle.internal.MojoExecutor.execute(MojoExecutor.java:209)
	... 27 more
Sending e-mails to: notifications@directory.apache.org
channel stopped


Mime
View raw message