directory-notifications mailing list archives

Site index · List index
Message view « Date » · « Thread »
Top « Date » · « Thread »
From Apache Hudson Server <hud...@hudson.apache.org>
Subject Build failed in Jenkins: dir-shared-jdk15-ubuntu-deploy #215
Date Wed, 09 Mar 2011 10:11:16 GMT
See <https://hudson.apache.org/hudson/job/dir-shared-jdk15-ubuntu-deploy/215/changes>

Changes:

[pamarcelot] Added hashCode() method.

------------------------------------------
Started by user elecharny
Building remotely on ubuntu2
Updating https://svn.apache.org/repos/asf/directory/shared/trunk
U         ldap/model/src/main/java/org/apache/directory/shared/ldap/model/message/controls/PagedResultsImpl.java
U         ldap/model/src/main/java/org/apache/directory/shared/ldap/model/message/controls/SubentriesImpl.java
At revision 1079723
Found mavenVersion 3.0.2 from file jar:file:/home/hudson/tools/maven/latest3/lib/maven-core-3.0.2.jar!/META-INF/maven/org.apache.maven/maven-core/pom.properties
Parsing POMs
[trunk] $ /home/hudson/tools/java/latest1.5/bin/java -Xmx512m -XX:MaxPermSize=128m -cp /home/hudson/hudson-slave/maven3-agent.jar:/home/hudson/tools/maven/latest3/boot/plexus-classworlds-2.4.jar
org.jvnet.hudson.maven3.agent.Maven3Main /home/hudson/tools/maven/latest3 /home/hudson/hudson-slave/slave.jar
/home/hudson/hudson-slave/maven3-interceptor.jar 53918
<===[HUDSON REMOTING CAPACITY]===>channel started
   Executing Maven:  -B -f <https://hudson.apache.org/hudson/job/dir-shared-jdk15-ubuntu-deploy/ws/trunk/pom.xml>
-U clean deploy
[INFO] Scanning for projects...
[INFO] ------------------------------------------------------------------------
[INFO] Reactor Build Order:
[INFO] 
[INFO] Apache Directory Shared
[INFO] Apache Directory Shared I18n
[INFO] Apache Directory Shared Utilities
[INFO] Apache Directory Shared ASN.1 Parent
[INFO] Apache Directory Shared ASN.1 API
[INFO] Apache Directory Shared ASN.1 BER
[INFO] Apache Directory Shared LDAP Parent
[INFO] Apache Directory Shared LDAP Model
[INFO] Apache Directory Shared LDAP Extras
[INFO] Apache Directory Shared LDAP Extras ACI
[INFO] Apache Directory Shared LDAP Schema Parent
[INFO] Apache Directory Shared LDAP Schema
[INFO] Apache Directory Shared LDAP Codec Parent
[INFO] Apache Directory Shared LDAP Codec
[INFO] Apache Directory Shared LDAP Extras Codec API
[INFO] Apache Directory Shared LDAP Extras Codec
[INFO] Apache Directory Shared LDAP Net Parent
[INFO] Apache Directory Shared LDAP Network MINA
[INFO] Apache Directory Shared LDAP Codec Standalone
[INFO] Apache Directory Shared Integration Tests
[INFO] Apache Directory Shared DSML Parent
[INFO] Apache Directory Shared DSML Parser
[INFO] Apache Directory Shared LDAP Client Parent
[INFO] Apache Directory Shared LDAP Client API
[INFO] Apache Directory Shared DSML Engine
[INFO] Apache Directory Shared LDAP Extras Util
[INFO] Apache Directory Shared LDAP Extras Stored Procedures
[INFO] Apache Directory Shared LDAP Extras Trigger
[INFO] Apache Directory Shared LDAP Schema Converter
[INFO] Apache Directory Shared All
[INFO] Apache Directory Shared LDAP Client All
[INFO] Apache Directory LDAP API Distribution
[INFO]                                                                         
[INFO] ------------------------------------------------------------------------
[INFO] Building Apache Directory Shared 1.0.0-M2-SNAPSHOT
[INFO] ------------------------------------------------------------------------
[INFO] [INFO] Deleting <https://hudson.apache.org/hudson/job/dir-shared-jdk15-ubuntu-deploy/ws/trunk/target>

[INFO] --- maven-clean-plugin:2.4.1:clean (default-clean) @ shared-parent ---
[INFO] 
[INFO] --- maven-remote-resources-plugin:1.2:process (default) @ shared-parent ---
[INFO] Setting property: classpath.resource.loader.class => 'org.codehaus.plexus.velocity.ContextClassLoaderResourceLoader'.
[INFO] Setting property: velocimacro.messages.on => 'false'.
[INFO] Setting property: resource.loader => 'classpath'.
[INFO] Setting property: resource.manager.logwhenfound => 'false'.
[INFO] 
[INFO] --- tools-maven-plugin:1.4:verify-legal-files (verify-legal-files) @ shared-parent
---
[INFO] 
[INFO] --- apache-rat-plugin:0.7:check (default) @ shared-parent ---
[INFO] Exclude: **/target/**/*
[INFO] Exclude: **/cobertura.ser
[INFO] Exclude: **/.classpath
[INFO] Exclude: **/.project
[INFO] Exclude: **/.settings/**/*
[INFO] Exclude: **/*.iml
[INFO] Exclude: **/*.ipr
[INFO] Exclude: **/*.iws
[INFO] Exclude: **/MANIFEST.MF
[INFO] Exclude: distribution/src/main/release/licenses/*
[INFO] Exclude: src/main/release/licenses/*
[INFO] Exclude: **/dependency-reduced-pom.xml
[INFO] Exclude: ldap/schema/data/src/main/resources/schema/**
[INFO] Exclude: ldap/schema/data/src/main/resources/schema-all.ldif
[INFO] Exclude: schema/data/src/main/resources/schema/**
[INFO] Exclude: schema/data/src/main/resources/schema-all.ldif
[INFO] Exclude: data/src/main/resources/schema/**
[INFO] Exclude: data/src/main/resources/schema-all.ldif
[INFO] Exclude: src/main/resources/schema/**
[INFO] Exclude: src/main/resources/schema-all.ldif
[INFO] 
[INFO] --- maven-install-plugin:2.3.1:install (default-install) @ shared-parent ---
[INFO] Installing <https://hudson.apache.org/hudson/job/dir-shared-jdk15-ubuntu-deploy/ws/trunk/pom.xml>
to /home/hudson/.m2/repository/org/apache/directory/shared/shared-parent/1.0.0-M2-SNAPSHOT/shared-parent-1.0.0-M2-SNAPSHOT.pom
[INFO] 
[INFO] --- maven-deploy-plugin:2.5:deploy (default-deploy) @ shared-parent ---
Downloading: https://repository.apache.org/content/repositories/snapshots/org/apache/directory/shared/shared-parent/1.0.0-M2-SNAPSHOT/maven-metadata.xml
[WARNING] Could not transfer metadata org.apache.directory.shared:shared-parent:1.0.0-M2-SNAPSHOT/maven-metadata.xml
from/to apache.snapshots.https (https://repository.apache.org/content/repositories/snapshots):
Error transferring file: Server returned HTTP response code: 500 for URL: https://repository.apache.org/content/repositories/snapshots/org/apache/directory/shared/shared-parent/1.0.0-M2-SNAPSHOT/maven-metadata.xml
mojoFailed org.apache.maven.plugins:maven-deploy-plugin:2.5(default-deploy)
projectFailed org.apache.directory.shared:shared-parent:1.0.0-M2-SNAPSHOT
[JENKINS] Archiving <https://hudson.apache.org/hudson/job/dir-shared-jdk15-ubuntu-deploy/ws/trunk/pom.xml>
to /home/hudson/hudson/jobs/dir-shared-jdk15-ubuntu-deploy/modules/org.apache.directory.shared$shared-parent/builds/2011-03-09_10-10-34/archive/org.apache.directory.shared/shared-parent/1.0.0-M2-SNAPSHOT/pom.xml
sessionEnded
[INFO] ------------------------------------------------------------------------
[INFO] Reactor Summary:
[INFO] 
[INFO] Apache Directory Shared ........................... FAILURE [27.044s]
[INFO] Apache Directory Shared I18n ...................... SKIPPED
[INFO] Apache Directory Shared Utilities ................. SKIPPED
[INFO] Apache Directory Shared ASN.1 Parent .............. SKIPPED
[INFO] Apache Directory Shared ASN.1 API ................. SKIPPED
[INFO] Apache Directory Shared ASN.1 BER ................. SKIPPED
[INFO] Apache Directory Shared LDAP Parent ............... SKIPPED
[INFO] Apache Directory Shared LDAP Model ................ SKIPPED
[INFO] Apache Directory Shared LDAP Extras ............... SKIPPED
[INFO] Apache Directory Shared LDAP Extras ACI ........... SKIPPED
[INFO] Apache Directory Shared LDAP Schema Parent ........ SKIPPED
[INFO] Apache Directory Shared LDAP Schema ............... SKIPPED
[INFO] Apache Directory Shared LDAP Codec Parent ......... SKIPPED
[INFO] Apache Directory Shared LDAP Codec ................ SKIPPED
[INFO] Apache Directory Shared LDAP Extras Codec API ..... SKIPPED
[INFO] Apache Directory Shared LDAP Extras Codec ......... SKIPPED
[INFO] Apache Directory Shared LDAP Net Parent ........... SKIPPED
[INFO] Apache Directory Shared LDAP Network MINA ......... SKIPPED
[INFO] Apache Directory Shared LDAP Codec Standalone ..... SKIPPED
[INFO] Apache Directory Shared Integration Tests ......... SKIPPED
[INFO] Apache Directory Shared DSML Parent ............... SKIPPED
[INFO] Apache Directory Shared DSML Parser ............... SKIPPED
[INFO] Apache Directory Shared LDAP Client Parent ........ SKIPPED
[INFO] Apache Directory Shared LDAP Client API ........... SKIPPED
[INFO] Apache Directory Shared DSML Engine ............... SKIPPED
[INFO] Apache Directory Shared LDAP Extras Util .......... SKIPPED
[INFO] Apache Directory Shared LDAP Extras Stored Procedures  SKIPPED
[INFO] Apache Directory Shared LDAP Extras Trigger ....... SKIPPED
[INFO] Apache Directory Shared LDAP Schema Converter ..... SKIPPED
[INFO] Apache Directory Shared All ....................... SKIPPED
[INFO] Apache Directory Shared LDAP Client All ........... SKIPPED
[INFO] Apache Directory LDAP API Distribution ............ SKIPPED
[INFO] ------------------------------------------------------------------------
[INFO] BUILD FAILURE
[INFO] ------------------------------------------------------------------------
[INFO] Total time: 30.005s
[INFO] Finished at: Wed Mar 09 10:11:15 UTC 2011
[INFO] Final Memory: 15M/62M
[INFO] ------------------------------------------------------------------------
mavenExecutionResult exceptions not empty
org.apache.maven.lifecycle.LifecycleExecutionException: Failed to execute goal org.apache.maven.plugins:maven-deploy-plugin:2.5:deploy
(default-deploy) on project shared-parent: Failed to retrieve remote metadata org.apache.directory.shared:shared-parent:1.0.0-M2-SNAPSHOT/maven-metadata.xml:
Could not transfer metadata org.apache.directory.shared:shared-parent:1.0.0-M2-SNAPSHOT/maven-metadata.xml
from/to apache.snapshots.https (https://repository.apache.org/content/repositories/snapshots):
Error transferring file: Server returned HTTP response code: 500 for URL: https://repository.apache.org/content/repositories/snapshots/org/apache/directory/shared/shared-parent/1.0.0-M2-SNAPSHOT/maven-metadata.xml
	at org.apache.maven.lifecycle.internal.MojoExecutor.execute(MojoExecutor.java:217)
	at org.apache.maven.lifecycle.internal.MojoExecutor.execute(MojoExecutor.java:153)
	at org.apache.maven.lifecycle.internal.MojoExecutor.execute(MojoExecutor.java:145)
	at org.apache.maven.lifecycle.internal.LifecycleModuleBuilder.buildProject(LifecycleModuleBuilder.java:84)
	at org.apache.maven.lifecycle.internal.LifecycleModuleBuilder.buildProject(LifecycleModuleBuilder.java:59)
	at org.apache.maven.lifecycle.internal.LifecycleStarter.singleThreadedBuild(LifecycleStarter.java:183)
	at org.apache.maven.lifecycle.internal.LifecycleStarter.execute(LifecycleStarter.java:161)
	at org.apache.maven.DefaultMaven.doExecute(DefaultMaven.java:319)
	at org.apache.maven.DefaultMaven.execute(DefaultMaven.java:156)
	at org.jvnet.hudson.maven3.launcher.Maven3Launcher.main(Maven3Launcher.java:79)
	at sun.reflect.NativeMethodAccessorImpl.invoke0(Native Method)
	at sun.reflect.NativeMethodAccessorImpl.invoke(NativeMethodAccessorImpl.java:39)
	at sun.reflect.DelegatingMethodAccessorImpl.invoke(DelegatingMethodAccessorImpl.java:25)
	at java.lang.reflect.Method.invoke(Method.java:592)
	at org.codehaus.plexus.classworlds.launcher.Launcher.launchStandard(Launcher.java:329)
	at org.codehaus.plexus.classworlds.launcher.Launcher.launch(Launcher.java:239)
	at org.jvnet.hudson.maven3.agent.Maven3Main.launch(Maven3Main.java:145)
	at hudson.maven.Maven3Builder.call(Maven3Builder.java:124)
	at hudson.maven.Maven3Builder.call(Maven3Builder.java:71)
	at hudson.remoting.UserRequest.perform(UserRequest.java:114)
	at hudson.remoting.UserRequest.perform(UserRequest.java:48)
	at hudson.remoting.Request$2.run(Request.java:270)
	at java.util.concurrent.Executors$RunnableAdapter.call(Executors.java:417)
	at java.util.concurrent.FutureTask$Sync.innerRun(FutureTask.java:269)
	at java.util.concurrent.FutureTask.run(FutureTask.java:123)
	at java.util.concurrent.ThreadPoolExecutor$Worker.runTask(ThreadPoolExecutor.java:651)
	at java.util.concurrent.ThreadPoolExecutor$Worker.run(ThreadPoolExecutor.java:676)
	at java.lang.Thread.run(Thread.java:595)
Caused by: org.apache.maven.plugin.MojoExecutionException: Failed to retrieve remote metadata
org.apache.directory.shared:shared-parent:1.0.0-M2-SNAPSHOT/maven-metadata.xml: Could not
transfer metadata org.apache.directory.shared:shared-parent:1.0.0-M2-SNAPSHOT/maven-metadata.xml
from/to apache.snapshots.https (https://repository.apache.org/content/repositories/snapshots):
Error transferring file: Server returned HTTP response code: 500 for URL: https://repository.apache.org/content/repositories/snapshots/org/apache/directory/shared/shared-parent/1.0.0-M2-SNAPSHOT/maven-metadata.xml
	at org.apache.maven.plugin.deploy.DeployMojo.execute(DeployMojo.java:189)
	at org.apache.maven.plugin.DefaultBuildPluginManager.executeMojo(DefaultBuildPluginManager.java:107)
	at org.apache.maven.lifecycle.internal.MojoExecutor.execute(MojoExecutor.java:209)
	... 27 more
Caused by: org.apache.maven.artifact.deployer.ArtifactDeploymentException: Failed to retrieve
remote metadata org.apache.directory.shared:shared-parent:1.0.0-M2-SNAPSHOT/maven-metadata.xml:
Could not transfer metadata org.apache.directory.shared:shared-parent:1.0.0-M2-SNAPSHOT/maven-metadata.xml
from/to apache.snapshots.https (https://repository.apache.org/content/repositories/snapshots):
Error transferring file: Server returned HTTP response code: 500 for URL: https://repository.apache.org/content/repositories/snapshots/org/apache/directory/shared/shared-parent/1.0.0-M2-SNAPSHOT/maven-metadata.xml
	at org.apache.maven.artifact.deployer.DefaultArtifactDeployer.deploy(DefaultArtifactDeployer.java:140)
	at org.apache.maven.plugin.deploy.DeployMojo.execute(DeployMojo.java:148)
	... 29 more
Caused by: org.sonatype.aether.deployment.DeploymentException: Failed to retrieve remote metadata
org.apache.directory.shared:shared-parent:1.0.0-M2-SNAPSHOT/maven-metadata.xml: Could not
transfer metadata org.apache.directory.shared:shared-parent:1.0.0-M2-SNAPSHOT/maven-metadata.xml
from/to apache.snapshots.https (https://repository.apache.org/content/repositories/snapshots):
Error transferring file: Server returned HTTP response code: 500 for URL: https://repository.apache.org/content/repositories/snapshots/org/apache/directory/shared/shared-parent/1.0.0-M2-SNAPSHOT/maven-metadata.xml
	at org.sonatype.aether.impl.internal.DefaultDeployer.upload(DefaultDeployer.java:380)
	at org.sonatype.aether.impl.internal.DefaultDeployer.deploy(DefaultDeployer.java:230)
	at org.sonatype.aether.impl.internal.DefaultRepositorySystem.deploy(DefaultRepositorySystem.java:380)
	at org.apache.maven.artifact.deployer.DefaultArtifactDeployer.deploy(DefaultArtifactDeployer.java:136)
	... 30 more
Caused by: org.sonatype.aether.transfer.MetadataTransferException: Could not transfer metadata
org.apache.directory.shared:shared-parent:1.0.0-M2-SNAPSHOT/maven-metadata.xml from/to apache.snapshots.https
(https://repository.apache.org/content/repositories/snapshots): Error transferring file: Server
returned HTTP response code: 500 for URL: https://repository.apache.org/content/repositories/snapshots/org/apache/directory/shared/shared-parent/1.0.0-M2-SNAPSHOT/maven-metadata.xml
	at org.sonatype.aether.connector.wagon.WagonRepositoryConnector$3.wrap(WagonRepositoryConnector.java:932)
	at org.sonatype.aether.connector.wagon.WagonRepositoryConnector$3.wrap(WagonRepositoryConnector.java:923)
	at org.sonatype.aether.connector.wagon.WagonRepositoryConnector$GetTask.flush(WagonRepositoryConnector.java:696)
	at org.sonatype.aether.connector.wagon.WagonRepositoryConnector$GetTask.flush(WagonRepositoryConnector.java:690)
	at org.sonatype.aether.connector.wagon.WagonRepositoryConnector.get(WagonRepositoryConnector.java:435)
	at org.sonatype.aether.impl.internal.DefaultDeployer.upload(DefaultDeployer.java:353)
	... 33 more
Caused by: org.apache.maven.wagon.TransferFailedException: Error transferring file: Server
returned HTTP response code: 500 for URL: https://repository.apache.org/content/repositories/snapshots/org/apache/directory/shared/shared-parent/1.0.0-M2-SNAPSHOT/maven-metadata.xml
	at org.apache.maven.wagon.providers.http.LightweightHttpWagon.fillInputData(LightweightHttpWagon.java:143)
	at org.apache.maven.wagon.StreamWagon.getInputStream(StreamWagon.java:116)
	at org.apache.maven.wagon.StreamWagon.getIfNewer(StreamWagon.java:88)
	at org.apache.maven.wagon.StreamWagon.get(StreamWagon.java:61)
	at org.sonatype.aether.connector.wagon.WagonRepositoryConnector$GetTask.run(WagonRepositoryConnector.java:605)
	... 3 more
Caused by: java.io.IOException: Server returned HTTP response code: 500 for URL: https://repository.apache.org/content/repositories/snapshots/org/apache/directory/shared/shared-parent/1.0.0-M2-SNAPSHOT/maven-metadata.xml
	at sun.reflect.NativeConstructorAccessorImpl.newInstance0(Native Method)
	at sun.reflect.NativeConstructorAccessorImpl.newInstance(NativeConstructorAccessorImpl.java:39)
	at sun.reflect.DelegatingConstructorAccessorImpl.newInstance(DelegatingConstructorAccessorImpl.java:27)
	at java.lang.reflect.Constructor.newInstance(Constructor.java:501)
	at sun.net.www.protocol.http.HttpURLConnection$6.run(HttpURLConnection.java:1250)
	at java.security.AccessController.doPrivileged(Native Method)
	at sun.net.www.protocol.http.HttpURLConnection.getChainedException(HttpURLConnection.java:1244)
	at sun.net.www.protocol.http.HttpURLConnection.getInputStream(HttpURLConnection.java:932)
	at sun.net.www.protocol.https.HttpsURLConnectionImpl.getInputStream(HttpsURLConnectionImpl.java:234)
	at org.apache.maven.wagon.providers.http.LightweightHttpWagon.fillInputData(LightweightHttpWagon.java:122)
	... 7 more
Caused by: java.io.IOException: Server returned HTTP response code: 500 for URL: https://repository.apache.org/content/repositories/snapshots/org/apache/directory/shared/shared-parent/1.0.0-M2-SNAPSHOT/maven-metadata.xml
	at sun.net.www.protocol.http.HttpURLConnection.getInputStream(HttpURLConnection.java:1196)
	at java.net.HttpURLConnection.getResponseCode(HttpURLConnection.java:367)
	at sun.net.www.protocol.https.HttpsURLConnectionImpl.getResponseCode(HttpsURLConnectionImpl.java:318)
	at org.apache.maven.wagon.providers.http.LightweightHttpWagon.fillInputData(LightweightHttpWagon.java:115)
	... 7 more
Sending e-mails to: notifications@directory.apache.org
channel stopped


Mime
View raw message