directory-notifications mailing list archives

Site index · List index
Message view « Date » · « Thread »
Top « Date » · « Thread »
From Apache Hudson Server <hud...@hudson.apache.org>
Subject Build failed in Hudson: dir-shared-jdk15-ubuntu-deploy #182
Date Tue, 08 Feb 2011 10:51:15 GMT
See <https://hudson.apache.org/hudson/job/dir-shared-jdk15-ubuntu-deploy/182/changes>

Changes:

[seelmann] Accidentially committed snapshot parent

[seelmann] Remove com.mycila:mycila-junit dependency, use copied classes in junit-addons instead

------------------------------------------
[...truncated 101 lines...]
[INFO] --- maven-bundle-plugin:2.2.0:bundle (default-bundle) @ shared-i18n ---
[INFO] Checking legal files in: shared-i18n-0.9.20-SNAPSHOT.jar
[INFO] 
[INFO] --- tools-maven-plugin:1.4:verify-legal-files (verify-legal-files) @ shared-i18n ---
[INFO] [INFO] Installing <https://hudson.apache.org/hudson/job/dir-shared-jdk15-ubuntu-deploy/ws/trunk/i18n/target/shared-i18n-0.9.20-SNAPSHOT.jar>
to /home/hudson/.m2/repository/org/apache/directory/shared/shared-i18n/0.9.20-SNAPSHOT/shared-i18n-0.9.20-SNAPSHOT.jar
[INFO] Installing <https://hudson.apache.org/hudson/job/dir-shared-jdk15-ubuntu-deploy/ws/trunk/i18n/pom.xml>
to /home/hudson/.m2/repository/org/apache/directory/shared/shared-i18n/0.9.20-SNAPSHOT/shared-i18n-0.9.20-SNAPSHOT.pom

[INFO] --- maven-install-plugin:2.3.1:install (default-install) @ shared-i18n ---
[INFO] [WARNING] Exception while updating local OBR: Unable to read repository xml: file:/home/hudson/.m2/repository/repository.xml
org.apache.maven.plugin.MojoExecutionException: Unable to read repository xml: file:/home/hudson/.m2/repository/repository.xml
	at org.apache.felix.obrplugin.ObrUpdate.parseRepositoryXml(ObrUpdate.java:295)
	at org.apache.felix.obrplugin.ObrInstall.execute(ObrInstall.java:140)
	at org.apache.maven.plugin.DefaultBuildPluginManager.executeMojo(DefaultBuildPluginManager.java:107)
	at org.apache.maven.lifecycle.internal.MojoExecutor.execute(MojoExecutor.java:209)
	at org.apache.maven.lifecycle.internal.MojoExecutor.execute(MojoExecutor.java:153)
	at org.apache.maven.lifecycle.internal.MojoExecutor.execute(MojoExecutor.java:145)
	at org.apache.maven.lifecycle.internal.LifecycleModuleBuilder.buildProject(LifecycleModuleBuilder.java:84)
	at org.apache.maven.lifecycle.internal.LifecycleModuleBuilder.buildProject(LifecycleModuleBuilder.java:59)
	at org.apache.maven.lifecycle.internal.LifecycleStarter.singleThreadedBuild(LifecycleStarter.java:183)
	at org.apache.maven.lifecycle.internal.LifecycleStarter.execute(LifecycleStarter.java:161)
	at org.apache.maven.DefaultMaven.doExecute(DefaultMaven.java:319)
	at org.apache.maven.DefaultMaven.execute(DefaultMaven.java:156)
	at org.jvnet.hudson.maven3.launcher.Maven3Launcher.main(Maven3Launcher.java:79)
	at sun.reflect.NativeMethodAccessorImpl.invoke0(Native Method)
	at sun.reflect.NativeMethodAccessorImpl.invoke(NativeMethodAccessorImpl.java:39)
	at sun.reflect.DelegatingMethodAccessorImpl.invoke(DelegatingMethodAccessorImpl.java:25)
	at java.lang.reflect.Method.invoke(Method.java:592)
	at org.codehaus.plexus.classworlds.launcher.Launcher.launchStandard(Launcher.java:329)
	at org.codehaus.plexus.classworlds.launcher.Launcher.launch(Launcher.java:239)
	at org.jvnet.hudson.maven3.agent.Maven3Main.launch(Maven3Main.java:145)
	at hudson.maven.Maven3Builder.call(Maven3Builder.java:124)
	at hudson.maven.Maven3Builder.call(Maven3Builder.java:71)
	at hudson.remoting.UserRequest.perform(UserRequest.java:114)
	at hudson.remoting.UserRequest.perform(UserRequest.java:48)
	at hudson.remoting.Request$2.run(Request.java:270)
	at java.util.concurrent.Executors$RunnableAdapter.call(Executors.java:417)
	at java.util.concurrent.FutureTask$Sync.innerRun(FutureTask.java:269)
	at java.util.concurrent.FutureTask.run(FutureTask.java:123)
	at java.util.concurrent.ThreadPoolExecutor$Worker.runTask(ThreadPoolExecutor.java:651)
	at java.util.concurrent.ThreadPoolExecutor$Worker.run(ThreadPoolExecutor.java:676)
	at java.lang.Thread.run(Thread.java:595)
Caused by: org.xmlpull.v1.XmlPullParserException: unexpected type (position:END_DOCUMENT null@3:1
in java.io.InputStreamReader@127f9cb) 
	at org.kxml2.io.KXmlParser.exception(Unknown Source)
	at org.kxml2.io.KXmlParser.nextTag(Unknown Source)
	at org.apache.felix.bundlerepository.impl.PullParser.parseRepository(PullParser.java:43)
	at org.apache.felix.bundlerepository.impl.DataModelHelperImpl.repository(DataModelHelperImpl.java:147)
	at org.apache.felix.bundlerepository.impl.DataModelHelperImpl.repository(DataModelHelperImpl.java:118)
	at org.apache.felix.obrplugin.ObrUpdate.parseRepositoryXml(ObrUpdate.java:291)
	... 30 more

[INFO] --- maven-bundle-plugin:2.2.0:install (default-install) @ shared-i18n ---
[INFO] Downloading: https://repository.apache.org/content/repositories/snapshots/org/apache/directory/shared/shared-i18n/0.9.20-SNAPSHOT/maven-metadata.xml

[INFO] --- maven-deploy-plugin:2.5:deploy (default-deploy) @ shared-i18n ---
Downloaded: https://repository.apache.org/content/repositories/snapshots/org/apache/directory/shared/shared-i18n/0.9.20-SNAPSHOT/maven-metadata.xml
(797 B at 3.4 KB/sec)
Uploading: https://repository.apache.org/content/repositories/snapshots/org/apache/directory/shared/shared-i18n/0.9.20-SNAPSHOT/shared-i18n-0.9.20-20110208.105109-172.jar
Uploaded: https://repository.apache.org/content/repositories/snapshots/org/apache/directory/shared/shared-i18n/0.9.20-SNAPSHOT/shared-i18n-0.9.20-20110208.105109-172.jar
(44 KB at 17.1 KB/sec)
Uploading: https://repository.apache.org/content/repositories/snapshots/org/apache/directory/shared/shared-i18n/0.9.20-SNAPSHOT/shared-i18n-0.9.20-20110208.105109-172.pom
Uploaded: https://repository.apache.org/content/repositories/snapshots/org/apache/directory/shared/shared-i18n/0.9.20-SNAPSHOT/shared-i18n-0.9.20-20110208.105109-172.pom
(3 KB at 2.3 KB/sec)
Downloading: https://repository.apache.org/content/repositories/snapshots/org/apache/directory/shared/shared-i18n/maven-metadata.xml
Downloaded: https://repository.apache.org/content/repositories/snapshots/org/apache/directory/shared/shared-i18n/maven-metadata.xml
(381 B at 2.5 KB/sec)
Uploading: https://repository.apache.org/content/repositories/snapshots/org/apache/directory/shared/shared-i18n/0.9.20-SNAPSHOT/maven-metadata.xml
Uploaded: https://repository.apache.org/content/repositories/snapshots/org/apache/directory/shared/shared-i18n/0.9.20-SNAPSHOT/maven-metadata.xml
(797 B at 3.4 KB/sec)
Uploading: https://repository.apache.org/content/repositories/snapshots/org/apache/directory/shared/shared-i18n/maven-metadata.xml
Uploaded: https://repository.apache.org/content/repositories/snapshots/org/apache/directory/shared/shared-i18n/maven-metadata.xml
(381 B at 2.2 KB/sec)
[INFO] Remote OBR update disabled (enable with -DremoteOBR)
[INFO] 
[INFO] --- maven-bundle-plugin:2.2.0:deploy (default-deploy) @ shared-i18n ---
projectSucceeded org.apache.directory.shared:shared-i18n:0.9.20-SNAPSHOT
[HUDSON] Archiving <https://hudson.apache.org/hudson/job/dir-shared-jdk15-ubuntu-deploy/ws/trunk/i18n/pom.xml>
to /home/hudson/hudson/jobs/dir-shared-jdk15-ubuntu-deploy/modules/org.apache.directory.shared$shared-i18n/builds/2011-02-08_10-49-25/archive/org.apache.directory.shared/shared-i18n/0.9.20-SNAPSHOT/pom.xml
[HUDSON] Archiving <https://hudson.apache.org/hudson/job/dir-shared-jdk15-ubuntu-deploy/ws/trunk/i18n/target/shared-i18n-0.9.20-SNAPSHOT.jar>
to /home/hudson/hudson/jobs/dir-shared-jdk15-ubuntu-deploy/modules/org.apache.directory.shared$shared-i18n/builds/2011-02-08_10-49-25/archive/org.apache.directory.shared/shared-i18n/0.9.20-20110208.105109-172/shared-i18n-0.9.20-SNAPSHOT.jar
[INFO] [INFO] Deleting <https://hudson.apache.org/hudson/job/dir-shared-jdk15-ubuntu-deploy/ws/trunk/util/target>
                                                                        
[INFO] ------------------------------------------------------------------------
[INFO] Building Apache Directory Shared Utilities 0.9.20-SNAPSHOT
[INFO] ------------------------------------------------------------------------
[INFO] 
[INFO] --- maven-clean-plugin:2.4.1:clean (default-clean) @ shared-util ---
[INFO] 
[INFO] --- maven-remote-resources-plugin:1.1:process (default) @ shared-util ---
[INFO] [INFO] Using 'UTF-8' encoding to copy filtered resources.

[INFO] Copying 0 resource
[INFO] Copying 3 resources
[INFO] --- maven-resources-plugin:2.4.3:resources (default-resources) @ shared-util ---
[INFO] Compiling 38 source files to <https://hudson.apache.org/hudson/job/dir-shared-jdk15-ubuntu-deploy/ws/trunk/util/target/classes>
[INFO] 
[INFO] --- maven-compiler-plugin:2.3.2:compile (default-compile) @ shared-util ---
[INFO] [INFO] Using 'UTF-8' encoding to copy filtered resources.
[INFO] Copying 1 resource
[INFO] Copying 3 resources

[INFO] --- maven-resources-plugin:2.4.3:testResources (default-testResources) @ shared-util
---
[INFO] Compiling 10 source files to <https://hudson.apache.org/hudson/job/dir-shared-jdk15-ubuntu-deploy/ws/trunk/util/target/test-classes>
[INFO] [INFO] -------------------------------------------------------------

[ERROR] COMPILATION ERROR : 
[INFO] -------------------------------------------------------------
[INFO] --- maven-compiler-plugin:2.3.2:testCompile (default-testCompile) @ shared-util ---
[ERROR] <https://hudson.apache.org/hudson/job/dir-shared-jdk15-ubuntu-deploy/ws/trunk/util/src/test/java/org/apache/directory/shared/util/MethodUtilsTest.java>:[31,35]
package com.mycila.junit.concurrent does not exist
[ERROR] <https://hudson.apache.org/hudson/job/dir-shared-jdk15-ubuntu-deploy/ws/trunk/util/src/test/java/org/apache/directory/shared/util/MethodUtilsTest.java>:[32,35]
package com.mycila.junit.concurrent does not exist
[ERROR] <https://hudson.apache.org/hudson/job/dir-shared-jdk15-ubuntu-deploy/ws/trunk/util/src/test/java/org/apache/directory/shared/util/ByteBufferTest.java>:[25,35]
package com.mycila.junit.concurrent does not exist
[ERROR] <https://hudson.apache.org/hudson/job/dir-shared-jdk15-ubuntu-deploy/ws/trunk/util/src/test/java/org/apache/directory/shared/util/ByteBufferTest.java>:[26,35]
package com.mycila.junit.concurrent does not exist
[ERROR] <https://hudson.apache.org/hudson/job/dir-shared-jdk15-ubuntu-deploy/ws/trunk/util/src/test/java/org/apache/directory/shared/util/JoinIteratorTest.java>:[34,35]
package com.mycila.junit.concurrent does not exist
[ERROR] <https://hudson.apache.org/hudson/job/dir-shared-jdk15-ubuntu-deploy/ws/trunk/util/src/test/java/org/apache/directory/shared/util/JoinIteratorTest.java>:[35,35]
package com.mycila.junit.concurrent does not exist
[ERROR] <https://hudson.apache.org/hudson/job/dir-shared-jdk15-ubuntu-deploy/ws/trunk/util/src/test/java/org/apache/directory/shared/util/GeneralizedTimeTest.java>:[32,35]
package com.mycila.junit.concurrent does not exist
[ERROR] <https://hudson.apache.org/hudson/job/dir-shared-jdk15-ubuntu-deploy/ws/trunk/util/src/test/java/org/apache/directory/shared/util/GeneralizedTimeTest.java>:[33,35]
package com.mycila.junit.concurrent does not exist
[ERROR] <https://hudson.apache.org/hudson/job/dir-shared-jdk15-ubuntu-deploy/ws/trunk/util/src/test/java/org/apache/directory/shared/util/ArrayEnumerationTest.java>:[30,35]
package com.mycila.junit.concurrent does not exist
[ERROR] <https://hudson.apache.org/hudson/job/dir-shared-jdk15-ubuntu-deploy/ws/trunk/util/src/test/java/org/apache/directory/shared/util/ArrayEnumerationTest.java>:[31,35]
package com.mycila.junit.concurrent does not exist
[ERROR] <https://hudson.apache.org/hudson/job/dir-shared-jdk15-ubuntu-deploy/ws/trunk/util/src/test/java/org/apache/directory/shared/util/ArrayNamingEnumerationTest.java>:[25,35]
package com.mycila.junit.concurrent does not exist
[ERROR] <https://hudson.apache.org/hudson/job/dir-shared-jdk15-ubuntu-deploy/ws/trunk/util/src/test/java/org/apache/directory/shared/util/ArrayNamingEnumerationTest.java>:[26,35]
package com.mycila.junit.concurrent does not exist
[ERROR] <https://hudson.apache.org/hudson/job/dir-shared-jdk15-ubuntu-deploy/ws/trunk/util/src/test/java/org/apache/directory/shared/util/StringsTest.java>:[32,35]
package com.mycila.junit.concurrent does not exist
[ERROR] <https://hudson.apache.org/hudson/job/dir-shared-jdk15-ubuntu-deploy/ws/trunk/util/src/test/java/org/apache/directory/shared/util/StringsTest.java>:[33,35]
package com.mycila.junit.concurrent does not exist
[ERROR] <https://hudson.apache.org/hudson/job/dir-shared-jdk15-ubuntu-deploy/ws/trunk/util/src/test/java/org/apache/directory/shared/util/HexTest.java>:[23,35]
package com.mycila.junit.concurrent does not exist
[ERROR] <https://hudson.apache.org/hudson/job/dir-shared-jdk15-ubuntu-deploy/ws/trunk/util/src/test/java/org/apache/directory/shared/util/HexTest.java>:[24,35]
package com.mycila.junit.concurrent does not exist
[ERROR] <https://hudson.apache.org/hudson/job/dir-shared-jdk15-ubuntu-deploy/ws/trunk/util/src/test/java/org/apache/directory/shared/util/Base32Test.java>:[24,35]
package com.mycila.junit.concurrent does not exist
[ERROR] <https://hudson.apache.org/hudson/job/dir-shared-jdk15-ubuntu-deploy/ws/trunk/util/src/test/java/org/apache/directory/shared/util/Base32Test.java>:[25,35]
package com.mycila.junit.concurrent does not exist
[ERROR] <https://hudson.apache.org/hudson/job/dir-shared-jdk15-ubuntu-deploy/ws/trunk/util/src/test/java/org/apache/directory/shared/util/UnicodeTest.java>:[33,35]
package com.mycila.junit.concurrent does not exist
[ERROR] <https://hudson.apache.org/hudson/job/dir-shared-jdk15-ubuntu-deploy/ws/trunk/util/src/test/java/org/apache/directory/shared/util/UnicodeTest.java>:[34,35]
package com.mycila.junit.concurrent does not exist
[ERROR] <https://hudson.apache.org/hudson/job/dir-shared-jdk15-ubuntu-deploy/ws/trunk/util/src/test/java/org/apache/directory/shared/util/MethodUtilsTest.java>:[43,9]
cannot find symbol
symbol: class ConcurrentJunitRunner
@RunWith(ConcurrentJunitRunner.class)
[ERROR] <https://hudson.apache.org/hudson/job/dir-shared-jdk15-ubuntu-deploy/ws/trunk/util/src/test/java/org/apache/directory/shared/util/MethodUtilsTest.java>:[44,1]
cannot find symbol
symbol: class Concurrency
@Concurrency()
[ERROR] <https://hudson.apache.org/hudson/job/dir-shared-jdk15-ubuntu-deploy/ws/trunk/util/src/test/java/org/apache/directory/shared/util/ByteBufferTest.java>:[37,9]
cannot find symbol
symbol: class ConcurrentJunitRunner
@RunWith(ConcurrentJunitRunner.class)
[ERROR] <https://hudson.apache.org/hudson/job/dir-shared-jdk15-ubuntu-deploy/ws/trunk/util/src/test/java/org/apache/directory/shared/util/ByteBufferTest.java>:[38,1]
cannot find symbol
symbol: class Concurrency
@Concurrency()
[ERROR] <https://hudson.apache.org/hudson/job/dir-shared-jdk15-ubuntu-deploy/ws/trunk/util/src/test/java/org/apache/directory/shared/util/JoinIteratorTest.java>:[46,9]
cannot find symbol
symbol: class ConcurrentJunitRunner
@RunWith(ConcurrentJunitRunner.class)
[ERROR] <https://hudson.apache.org/hudson/job/dir-shared-jdk15-ubuntu-deploy/ws/trunk/util/src/test/java/org/apache/directory/shared/util/JoinIteratorTest.java>:[47,1]
cannot find symbol
symbol: class Concurrency
@Concurrency()
[ERROR] <https://hudson.apache.org/hudson/job/dir-shared-jdk15-ubuntu-deploy/ws/trunk/util/src/test/java/org/apache/directory/shared/util/GeneralizedTimeTest.java>:[46,9]
cannot find symbol
symbol: class ConcurrentJunitRunner
@RunWith(ConcurrentJunitRunner.class)
[ERROR] <https://hudson.apache.org/hudson/job/dir-shared-jdk15-ubuntu-deploy/ws/trunk/util/src/test/java/org/apache/directory/shared/util/GeneralizedTimeTest.java>:[47,1]
cannot find symbol
symbol: class Concurrency
@Concurrency()
[ERROR] <https://hudson.apache.org/hudson/job/dir-shared-jdk15-ubuntu-deploy/ws/trunk/util/src/test/java/org/apache/directory/shared/util/ArrayEnumerationTest.java>:[41,9]
cannot find symbol
symbol: class ConcurrentJunitRunner
@RunWith(ConcurrentJunitRunner.class)
[ERROR] <https://hudson.apache.org/hudson/job/dir-shared-jdk15-ubuntu-deploy/ws/trunk/util/src/test/java/org/apache/directory/shared/util/ArrayEnumerationTest.java>:[42,1]
cannot find symbol
symbol: class Concurrency
@Concurrency()
[ERROR] <https://hudson.apache.org/hudson/job/dir-shared-jdk15-ubuntu-deploy/ws/trunk/util/src/test/java/org/apache/directory/shared/util/ArrayNamingEnumerationTest.java>:[42,9]
cannot find symbol
symbol: class ConcurrentJunitRunner
@RunWith(ConcurrentJunitRunner.class)
[ERROR] <https://hudson.apache.org/hudson/job/dir-shared-jdk15-ubuntu-deploy/ws/trunk/util/src/test/java/org/apache/directory/shared/util/ArrayNamingEnumerationTest.java>:[43,1]
cannot find symbol
symbol: class Concurrency
@Concurrency()
[ERROR] <https://hudson.apache.org/hudson/job/dir-shared-jdk15-ubuntu-deploy/ws/trunk/util/src/test/java/org/apache/directory/shared/util/StringsTest.java>:[43,10]
cannot find symbol
symbol: class ConcurrentJunitRunner
@RunWith( ConcurrentJunitRunner.class )
[ERROR] <https://hudson.apache.org/hudson/job/dir-shared-jdk15-ubuntu-deploy/ws/trunk/util/src/test/java/org/apache/directory/shared/util/StringsTest.java>:[44,1]
cannot find symbol
symbol: class Concurrency
@Concurrency()
[ERROR] <https://hudson.apache.org/hudson/job/dir-shared-jdk15-ubuntu-deploy/ws/trunk/util/src/test/java/org/apache/directory/shared/util/HexTest.java>:[39,9]
cannot find symbol
symbol: class ConcurrentJunitRunner
@RunWith(ConcurrentJunitRunner.class)
[ERROR] <https://hudson.apache.org/hudson/job/dir-shared-jdk15-ubuntu-deploy/ws/trunk/util/src/test/java/org/apache/directory/shared/util/HexTest.java>:[40,1]
cannot find symbol
symbol: class Concurrency
@Concurrency()
[ERROR] <https://hudson.apache.org/hudson/job/dir-shared-jdk15-ubuntu-deploy/ws/trunk/util/src/test/java/org/apache/directory/shared/util/Base32Test.java>:[30,9]
cannot find symbol
symbol: class ConcurrentJunitRunner
@RunWith(ConcurrentJunitRunner.class)
[ERROR] <https://hudson.apache.org/hudson/job/dir-shared-jdk15-ubuntu-deploy/ws/trunk/util/src/test/java/org/apache/directory/shared/util/Base32Test.java>:[31,1]
cannot find symbol
symbol: class Concurrency
@Concurrency()
[ERROR] <https://hudson.apache.org/hudson/job/dir-shared-jdk15-ubuntu-deploy/ws/trunk/util/src/test/java/org/apache/directory/shared/util/UnicodeTest.java>:[44,9]
cannot find symbol
symbol: class ConcurrentJunitRunner
@RunWith(ConcurrentJunitRunner.class)
[ERROR] <https://hudson.apache.org/hudson/job/dir-shared-jdk15-ubuntu-deploy/ws/trunk/util/src/test/java/org/apache/directory/shared/util/UnicodeTest.java>:[45,1]
cannot find symbol
symbol: class Concurrency
@Concurrency()
[INFO] 40 errors 
[INFO] -------------------------------------------------------------
mojoFailed org.apache.maven.plugins:maven-compiler-plugin:2.3.2(default-testCompile)
projectFailed org.apache.directory.shared:shared-util:0.9.20-SNAPSHOT
[HUDSON] Archiving <https://hudson.apache.org/hudson/job/dir-shared-jdk15-ubuntu-deploy/ws/trunk/util/pom.xml>
to /home/hudson/hudson/jobs/dir-shared-jdk15-ubuntu-deploy/modules/org.apache.directory.shared$shared-util/builds/2011-02-08_10-49-25/archive/org.apache.directory.shared/shared-util/0.9.20-SNAPSHOT/pom.xml
sessionEnded
[INFO] ------------------------------------------------------------------------
[INFO] Reactor Summary:
[INFO] 
[INFO] Apache Directory Shared ........................... SUCCESS [31.895s]
[INFO] Apache Directory Shared I18n ...................... SUCCESS [14.554s]
[INFO] Apache Directory Shared Utilities ................. FAILURE [7.694s]
[INFO] Apache Directory Shared ASN.1 API ................. SKIPPED
[INFO] Apache Directory Shared ASN.1 BER ................. SKIPPED
[INFO] Apache Directory Shared LDAP Model ................ SKIPPED
[INFO] Apache Directory Shared LDAP Codec ................ SKIPPED
[INFO] Apache Directory Shared LDAP ...................... SKIPPED
[INFO] Apache Directory Shared LDAP Schema ............... SKIPPED
[INFO] Apache Directory Shared Integration Tests ......... SKIPPED
[INFO] Apache Directory Shared All ....................... SKIPPED
[INFO] Apache Directory Shared LDAP Schema Converter ..... SKIPPED
[INFO] Apache Directory LDAP Client API .................. SKIPPED
[INFO] Apache Directory Shared DSML Parser ............... SKIPPED
[INFO] Apache Directory Shared DSML Engine ............... SKIPPED
[INFO] ------------------------------------------------------------------------
[INFO] BUILD FAILURE
[INFO] ------------------------------------------------------------------------
[INFO] Total time: 1:11.388s
[INFO] Finished at: Tue Feb 08 10:51:31 UTC 2011
[INFO] Final Memory: 14M/53M
[INFO] ------------------------------------------------------------------------
maven builder waiting
mavenExecutionResult exceptions not empty
org.apache.maven.lifecycle.LifecycleExecutionException: Failed to execute goal org.apache.maven.plugins:maven-compiler-plugin:2.3.2:testCompile
(default-testCompile) on project shared-util: Compilation failure
	at org.apache.maven.lifecycle.internal.MojoExecutor.execute(MojoExecutor.java:213)
	at org.apache.maven.lifecycle.internal.MojoExecutor.execute(MojoExecutor.java:153)
	at org.apache.maven.lifecycle.internal.MojoExecutor.execute(MojoExecutor.java:145)
	at org.apache.maven.lifecycle.internal.LifecycleModuleBuilder.buildProject(LifecycleModuleBuilder.java:84)
	at org.apache.maven.lifecycle.internal.LifecycleModuleBuilder.buildProject(LifecycleModuleBuilder.java:59)
	at org.apache.maven.lifecycle.internal.LifecycleStarter.singleThreadedBuild(LifecycleStarter.java:183)
	at org.apache.maven.lifecycle.internal.LifecycleStarter.execute(LifecycleStarter.java:161)
	at org.apache.maven.DefaultMaven.doExecute(DefaultMaven.java:319)
	at org.apache.maven.DefaultMaven.execute(DefaultMaven.java:156)
	at org.jvnet.hudson.maven3.launcher.Maven3Launcher.main(Maven3Launcher.java:79)
	at sun.reflect.NativeMethodAccessorImpl.invoke0(Native Method)
	at sun.reflect.NativeMethodAccessorImpl.invoke(NativeMethodAccessorImpl.java:39)
	at sun.reflect.DelegatingMethodAccessorImpl.invoke(DelegatingMethodAccessorImpl.java:25)
	at java.lang.reflect.Method.invoke(Method.java:592)
	at org.codehaus.plexus.classworlds.launcher.Launcher.launchStandard(Launcher.java:329)
	at org.codehaus.plexus.classworlds.launcher.Launcher.launch(Launcher.java:239)
	at org.jvnet.hudson.maven3.agent.Maven3Main.launch(Maven3Main.java:145)
	at hudson.maven.Maven3Builder.call(Maven3Builder.java:124)
	at hudson.maven.Maven3Builder.call(Maven3Builder.java:71)
	at hudson.remoting.UserRequest.perform(UserRequest.java:114)
	at hudson.remoting.UserRequest.perform(UserRequest.java:48)
	at hudson.remoting.Request$2.run(Request.java:270)
	at java.util.concurrent.Executors$RunnableAdapter.call(Executors.java:417)
	at java.util.concurrent.FutureTask$Sync.innerRun(FutureTask.java:269)
	at java.util.concurrent.FutureTask.run(FutureTask.java:123)
	at java.util.concurrent.ThreadPoolExecutor$Worker.runTask(ThreadPoolExecutor.java:651)
	at java.util.concurrent.ThreadPoolExecutor$Worker.run(ThreadPoolExecutor.java:676)
	at java.lang.Thread.run(Thread.java:595)
Caused by: org.apache.maven.plugin.CompilationFailureException: Compilation failure
	at org.apache.maven.plugin.AbstractCompilerMojo.execute(AbstractCompilerMojo.java:656)
	at org.apache.maven.plugin.TestCompilerMojo.execute(TestCompilerMojo.java:161)
	at org.apache.maven.plugin.DefaultBuildPluginManager.executeMojo(DefaultBuildPluginManager.java:107)
	at org.apache.maven.lifecycle.internal.MojoExecutor.execute(MojoExecutor.java:209)
	... 27 more
Sending e-mails to: notifications@directory.apache.org
channel stopped


Mime
View raw message