directory-notifications mailing list archives

Site index · List index
Message view « Date » · « Thread »
Top « Date » · « Thread »
From Apache Hudson Server <hud...@hudson.apache.org>
Subject Build failed in Hudson: dir-shared-jdk15-ubuntu-deploy #181
Date Tue, 08 Feb 2011 03:25:06 GMT
See <https://hudson.apache.org/hudson/job/dir-shared-jdk15-ubuntu-deploy/181/changes>

Changes:

[seelmann] Use external concurrent JUnit runner

------------------------------------------
[...truncated 295 lines...]
[INFO] Building Apache Directory Shared 0.9.20-SNAPSHOT
[INFO] ------------------------------------------------------------------------
[INFO] 
[INFO] Deleting <https://hudson.apache.org/hudson/job/dir-shared-jdk15-ubuntu-deploy/ws/trunk/target>
[INFO] --- maven-clean-plugin:2.4.1:clean (default-clean) @ shared-parent ---
[INFO] 
[INFO] --- maven-remote-resources-plugin:1.1:process (default) @ shared-parent ---
[INFO] Setting property: classpath.resource.loader.class => 'org.codehaus.plexus.velocity.ContextClassLoaderResourceLoader'.
[INFO] Setting property: velocimacro.messages.on => 'false'.
[INFO] Setting property: resource.loader => 'classpath'.
[INFO] Setting property: resource.manager.logwhenfound => 'false'.
[INFO] 
[INFO] --- tools-maven-plugin:1.4:verify-legal-files (verify-legal-files) @ shared-parent
---
[INFO] 
[INFO] --- maven-install-plugin:2.3.1:install (default-install) @ shared-parent ---
[INFO] Installing <https://hudson.apache.org/hudson/job/dir-shared-jdk15-ubuntu-deploy/ws/trunk/pom.xml>
to /home/hudson/.m2/repository/org/apache/directory/shared/shared-parent/0.9.20-SNAPSHOT/shared-parent-0.9.20-SNAPSHOT.pom
[INFO] Downloading: https://repository.apache.org/content/repositories/snapshots/org/apache/directory/shared/shared-parent/0.9.20-SNAPSHOT/maven-metadata.xml

[INFO] --- maven-deploy-plugin:2.5:deploy (default-deploy) @ shared-parent ---
Downloaded: https://repository.apache.org/content/repositories/snapshots/org/apache/directory/shared/shared-parent/0.9.20-SNAPSHOT/maven-metadata.xml
(623 B at 0.5 KB/sec)
Uploading: https://repository.apache.org/content/repositories/snapshots/org/apache/directory/shared/shared-parent/0.9.20-SNAPSHOT/shared-parent-0.9.20-20110208.032503-172.pom
Uploaded: https://repository.apache.org/content/repositories/snapshots/org/apache/directory/shared/shared-parent/0.9.20-SNAPSHOT/shared-parent-0.9.20-20110208.032503-172.pom
(19 KB at 12.4 KB/sec)
Downloading: https://repository.apache.org/content/repositories/snapshots/org/apache/directory/shared/shared-parent/maven-metadata.xml
Downloaded: https://repository.apache.org/content/repositories/snapshots/org/apache/directory/shared/shared-parent/maven-metadata.xml
(547 B at 2.2 KB/sec)
Uploading: https://repository.apache.org/content/repositories/snapshots/org/apache/directory/shared/shared-parent/0.9.20-SNAPSHOT/maven-metadata.xml
Uploaded: https://repository.apache.org/content/repositories/snapshots/org/apache/directory/shared/shared-parent/0.9.20-SNAPSHOT/maven-metadata.xml
(623 B at 3.0 KB/sec)
Uploading: https://repository.apache.org/content/repositories/snapshots/org/apache/directory/shared/shared-parent/maven-metadata.xml
Uploaded: https://repository.apache.org/content/repositories/snapshots/org/apache/directory/shared/shared-parent/maven-metadata.xml
(547 B at 1.8 KB/sec)
projectSucceeded org.apache.directory.shared:shared-parent:0.9.20-SNAPSHOT
[HUDSON] Archiving <https://hudson.apache.org/hudson/job/dir-shared-jdk15-ubuntu-deploy/ws/trunk/pom.xml>
to /home/hudson/hudson/jobs/dir-shared-jdk15-ubuntu-deploy/modules/org.apache.directory.shared$shared-parent/builds/2011-02-08_03-24-19/archive/org.apache.directory.shared/shared-parent/0.9.20-SNAPSHOT/pom.xml
[INFO]                                                                         
[INFO] ------------------------------------------------------------------------
[INFO] Building Apache Directory Shared I18n 0.9.20-SNAPSHOT
[INFO] ------------------------------------------------------------------------
[INFO] [INFO] Deleting <https://hudson.apache.org/hudson/job/dir-shared-jdk15-ubuntu-deploy/ws/trunk/i18n/target>

[INFO] --- maven-clean-plugin:2.4.1:clean (default-clean) @ shared-i18n ---
[INFO] 
[INFO] --- maven-remote-resources-plugin:1.1:process (default) @ shared-i18n ---
[INFO] 
[INFO] --- maven-resources-plugin:2.4.3:resources (default-resources) @ shared-i18n ---
[INFO] Using 'UTF-8' encoding to copy filtered resources.
[INFO] Copying 2 resources
[INFO] Copying 3 resources
[INFO] 
[INFO] --- maven-compiler-plugin:2.3.2:compile (default-compile) @ shared-i18n ---
[INFO] Compiling 1 source file to <https://hudson.apache.org/hudson/job/dir-shared-jdk15-ubuntu-deploy/ws/trunk/i18n/target/classes>
[INFO] [INFO] Using 'UTF-8' encoding to copy filtered resources.
[INFO] skip non existing resourceDirectory <https://hudson.apache.org/hudson/job/dir-shared-jdk15-ubuntu-deploy/ws/trunk/i18n/src/test/resources>
[INFO] Copying 3 resources

[INFO] --- maven-resources-plugin:2.4.3:testResources (default-testResources) @ shared-i18n
---
[INFO] [INFO] No sources to compile

[INFO] --- maven-compiler-plugin:2.3.2:testCompile (default-testCompile) @ shared-i18n ---
[INFO] 
[INFO] --- maven-surefire-plugin:2.7.1:test (default-test) @ shared-i18n ---
[INFO] Surefire report directory: <https://hudson.apache.org/hudson/job/dir-shared-jdk15-ubuntu-deploy/ws/trunk/i18n/target/surefire-reports>
[HUDSON] Recording test results
[INFO] 
[INFO] --- maven-bundle-plugin:2.2.0:bundle (default-bundle) @ shared-i18n ---
[INFO] [INFO] Checking legal files in: shared-i18n-0.9.20-SNAPSHOT.jar

[INFO] --- tools-maven-plugin:1.4:verify-legal-files (verify-legal-files) @ shared-i18n ---
[INFO] [INFO] Installing <https://hudson.apache.org/hudson/job/dir-shared-jdk15-ubuntu-deploy/ws/trunk/i18n/target/shared-i18n-0.9.20-SNAPSHOT.jar>
to /home/hudson/.m2/repository/org/apache/directory/shared/shared-i18n/0.9.20-SNAPSHOT/shared-i18n-0.9.20-SNAPSHOT.jar

[INFO] --- maven-install-plugin:2.3.1:install (default-install) @ shared-i18n ---
[INFO] Installing <https://hudson.apache.org/hudson/job/dir-shared-jdk15-ubuntu-deploy/ws/trunk/i18n/pom.xml>
to /home/hudson/.m2/repository/org/apache/directory/shared/shared-i18n/0.9.20-SNAPSHOT/shared-i18n-0.9.20-SNAPSHOT.pom
[INFO] [WARNING] Exception while updating local OBR: Unable to read repository xml: file:/home/hudson/.m2/repository/repository.xml
org.apache.maven.plugin.MojoExecutionException: Unable to read repository xml: file:/home/hudson/.m2/repository/repository.xml
	at org.apache.felix.obrplugin.ObrUpdate.parseRepositoryXml(ObrUpdate.java:295)
	at org.apache.felix.obrplugin.ObrInstall.execute(ObrInstall.java:140)
	at org.apache.maven.plugin.DefaultBuildPluginManager.executeMojo(DefaultBuildPluginManager.java:107)
	at org.apache.maven.lifecycle.internal.MojoExecutor.execute(MojoExecutor.java:209)
	at org.apache.maven.lifecycle.internal.MojoExecutor.execute(MojoExecutor.java:153)
	at org.apache.maven.lifecycle.internal.MojoExecutor.execute(MojoExecutor.java:145)
	at org.apache.maven.lifecycle.internal.LifecycleModuleBuilder.buildProject(LifecycleModuleBuilder.java:84)
	at org.apache.maven.lifecycle.internal.LifecycleModuleBuilder.buildProject(LifecycleModuleBuilder.java:59)
	at org.apache.maven.lifecycle.internal.LifecycleStarter.singleThreadedBuild(LifecycleStarter.java:183)
	at org.apache.maven.lifecycle.internal.LifecycleStarter.execute(LifecycleStarter.java:161)
	at org.apache.maven.DefaultMaven.doExecute(DefaultMaven.java:319)
	at org.apache.maven.DefaultMaven.execute(DefaultMaven.java:156)
	at org.jvnet.hudson.maven3.launcher.Maven3Launcher.main(Maven3Launcher.java:79)
	at sun.reflect.NativeMethodAccessorImpl.invoke0(Native Method)
	at sun.reflect.NativeMethodAccessorImpl.invoke(NativeMethodAccessorImpl.java:39)
	at sun.reflect.DelegatingMethodAccessorImpl.invoke(DelegatingMethodAccessorImpl.java:25)
	at java.lang.reflect.Method.invoke(Method.java:592)
	at org.codehaus.plexus.classworlds.launcher.Launcher.launchStandard(Launcher.java:329)
	at org.codehaus.plexus.classworlds.launcher.Launcher.launch(Launcher.java:239)
	at org.jvnet.hudson.maven3.agent.Maven3Main.launch(Maven3Main.java:145)
	at hudson.maven.Maven3Builder.call(Maven3Builder.java:124)
	at hudson.maven.Maven3Builder.call(Maven3Builder.java:71)
	at hudson.remoting.UserRequest.perform(UserRequest.java:114)
	at hudson.remoting.UserRequest.perform(UserRequest.java:48)
	at hudson.remoting.Request$2.run(Request.java:270)
	at java.util.concurrent.Executors$RunnableAdapter.call(Executors.java:417)
	at java.util.concurrent.FutureTask$Sync.innerRun(FutureTask.java:269)
	at java.util.concurrent.FutureTask.run(FutureTask.java:123)
	at java.util.concurrent.ThreadPoolExecutor$Worker.runTask(ThreadPoolExecutor.java:651)
	at java.util.concurrent.ThreadPoolExecutor$Worker.run(ThreadPoolExecutor.java:676)
	at java.lang.Thread.run(Thread.java:595)
Caused by: org.xmlpull.v1.XmlPullParserException: unexpected type (position:END_DOCUMENT null@3:1
in java.io.InputStreamReader@2c01b6) 
	at org.kxml2.io.KXmlParser.exception(Unknown Source)
	at org.kxml2.io.KXmlParser.nextTag(Unknown Source)
	at org.apache.felix.bundlerepository.impl.PullParser.parseRepository(PullParser.java:43)
	at org.apache.felix.bundlerepository.impl.DataModelHelperImpl.repository(DataModelHelperImpl.java:147)
	at org.apache.felix.bundlerepository.impl.DataModelHelperImpl.repository(DataModelHelperImpl.java:118)
	at org.apache.felix.obrplugin.ObrUpdate.parseRepositoryXml(ObrUpdate.java:291)
	... 30 more

[INFO] --- maven-bundle-plugin:2.2.0:install (default-install) @ shared-i18n ---
[INFO] Downloading: https://repository.apache.org/content/repositories/snapshots/org/apache/directory/shared/shared-i18n/0.9.20-SNAPSHOT/maven-metadata.xml

[INFO] --- maven-deploy-plugin:2.5:deploy (default-deploy) @ shared-i18n ---
Downloaded: https://repository.apache.org/content/repositories/snapshots/org/apache/directory/shared/shared-i18n/0.9.20-SNAPSHOT/maven-metadata.xml
(797 B at 5.0 KB/sec)
Uploading: https://repository.apache.org/content/repositories/snapshots/org/apache/directory/shared/shared-i18n/0.9.20-SNAPSHOT/shared-i18n-0.9.20-20110208.032513-171.jar
Uploaded: https://repository.apache.org/content/repositories/snapshots/org/apache/directory/shared/shared-i18n/0.9.20-SNAPSHOT/shared-i18n-0.9.20-20110208.032513-171.jar
(44 KB at 26.6 KB/sec)
Uploading: https://repository.apache.org/content/repositories/snapshots/org/apache/directory/shared/shared-i18n/0.9.20-SNAPSHOT/shared-i18n-0.9.20-20110208.032513-171.pom
Uploaded: https://repository.apache.org/content/repositories/snapshots/org/apache/directory/shared/shared-i18n/0.9.20-SNAPSHOT/shared-i18n-0.9.20-20110208.032513-171.pom
(3 KB at 3.7 KB/sec)
Downloading: https://repository.apache.org/content/repositories/snapshots/org/apache/directory/shared/shared-i18n/maven-metadata.xml
Downloaded: https://repository.apache.org/content/repositories/snapshots/org/apache/directory/shared/shared-i18n/maven-metadata.xml
(381 B at 0.6 KB/sec)
Uploading: https://repository.apache.org/content/repositories/snapshots/org/apache/directory/shared/shared-i18n/0.9.20-SNAPSHOT/maven-metadata.xml
Uploaded: https://repository.apache.org/content/repositories/snapshots/org/apache/directory/shared/shared-i18n/0.9.20-SNAPSHOT/maven-metadata.xml
(797 B at 4.9 KB/sec)
Uploading: https://repository.apache.org/content/repositories/snapshots/org/apache/directory/shared/shared-i18n/maven-metadata.xml
Uploaded: https://repository.apache.org/content/repositories/snapshots/org/apache/directory/shared/shared-i18n/maven-metadata.xml
(381 B at 2.0 KB/sec)
[INFO] [INFO] Remote OBR update disabled (enable with -DremoteOBR)

[INFO] --- maven-bundle-plugin:2.2.0:deploy (default-deploy) @ shared-i18n ---
projectSucceeded org.apache.directory.shared:shared-i18n:0.9.20-SNAPSHOT
[HUDSON] Archiving <https://hudson.apache.org/hudson/job/dir-shared-jdk15-ubuntu-deploy/ws/trunk/i18n/pom.xml>
to /home/hudson/hudson/jobs/dir-shared-jdk15-ubuntu-deploy/modules/org.apache.directory.shared$shared-i18n/builds/2011-02-08_03-24-19/archive/org.apache.directory.shared/shared-i18n/0.9.20-SNAPSHOT/pom.xml
[HUDSON] Archiving <https://hudson.apache.org/hudson/job/dir-shared-jdk15-ubuntu-deploy/ws/trunk/i18n/target/shared-i18n-0.9.20-SNAPSHOT.jar>
to /home/hudson/hudson/jobs/dir-shared-jdk15-ubuntu-deploy/modules/org.apache.directory.shared$shared-i18n/builds/2011-02-08_03-24-19/archive/org.apache.directory.shared/shared-i18n/0.9.20-20110208.032513-171/shared-i18n-0.9.20-SNAPSHOT.jar
[INFO]                                                                         
[INFO] Downloading: http://repository.apache.org/snapshots/org/apache/directory/junit/junit-addons/0.1-SNAPSHOT/maven-metadata.xml
------------------------------------------------------------------------
[INFO] Building Apache Directory Shared Utilities 0.9.20-SNAPSHOT
[INFO] ------------------------------------------------------------------------
Downloaded: http://repository.apache.org/snapshots/org/apache/directory/junit/junit-addons/0.1-SNAPSHOT/maven-metadata.xml
(374 B at 2.5 KB/sec)
Downloading: http://repository.apache.org/snapshots/org/apache/directory/junit/junit-addons/0.1-SNAPSHOT/junit-addons-0.1-20110208.020834-156.pom
Downloaded: http://repository.apache.org/snapshots/org/apache/directory/junit/junit-addons/0.1-SNAPSHOT/junit-addons-0.1-20110208.020834-156.pom
(3 KB at 25.3 KB/sec)
Downloading: http://repo1.maven.org/maven2/com/mycila/mycila-junit/1.0.ga/mycila-junit-1.0.ga.pom
Downloaded: http://repo1.maven.org/maven2/com/mycila/mycila-junit/1.0.ga/mycila-junit-1.0.ga.pom
(5 KB at 4.5 KB/sec)
Downloading: http://repository.apache.org/snapshots/org/apache/directory/junit/junit-addons/0.1-SNAPSHOT/junit-addons-0.1-20110208.020834-156.jar
Downloaded: http://repository.apache.org/snapshots/org/apache/directory/junit/junit-addons/0.1-SNAPSHOT/junit-addons-0.1-20110208.020834-156.jar
(13 KB at 104.0 KB/sec)
Downloading: http://repo1.maven.org/maven2/com/mycila/mycila-junit/1.0.ga/mycila-junit-1.0.ga.jar
Downloaded: http://repo1.maven.org/maven2/com/mycila/mycila-junit/1.0.ga/mycila-junit-1.0.ga.jar
(14 KB at 29.3 KB/sec)
[INFO] [INFO] Deleting <https://hudson.apache.org/hudson/job/dir-shared-jdk15-ubuntu-deploy/ws/trunk/util/target>

[INFO] --- maven-clean-plugin:2.4.1:clean (default-clean) @ shared-util ---
[INFO] 
[INFO] --- maven-remote-resources-plugin:1.1:process (default) @ shared-util ---
[INFO] [INFO] Using 'UTF-8' encoding to copy filtered resources.

[INFO] --- maven-resources-plugin:2.4.3:resources (default-resources) @ shared-util ---
[INFO] Copying 0 resource
[INFO] Copying 3 resources
[INFO] 
[INFO] --- maven-compiler-plugin:2.3.2:compile (default-compile) @ shared-util ---
[INFO] Compiling 38 source files to <https://hudson.apache.org/hudson/job/dir-shared-jdk15-ubuntu-deploy/ws/trunk/util/target/classes>
[INFO] Using 'UTF-8' encoding to copy filtered resources.
[INFO] [INFO] Copying 1 resource
[INFO] Copying 3 resources

[INFO] --- maven-resources-plugin:2.4.3:testResources (default-testResources) @ shared-util
---
[INFO] 
[INFO] --- maven-compiler-plugin:2.3.2:testCompile (default-testCompile) @ shared-util ---
[INFO] Compiling 10 source files to <https://hudson.apache.org/hudson/job/dir-shared-jdk15-ubuntu-deploy/ws/trunk/util/target/test-classes>
[INFO] -------------------------------------------------------------
[ERROR] COMPILATION ERROR : 
[INFO] -------------------------------------------------------------
[ERROR] <https://hudson.apache.org/hudson/job/dir-shared-jdk15-ubuntu-deploy/ws/trunk/util/src/test/java/org/apache/directory/shared/util/MethodUtilsTest.java>:[31,-1]
cannot access com.mycila.junit.concurrent.Concurrency
bad class file: /home/hudson/.m2/repository/com/mycila/mycila-junit/1.0.ga/mycila-junit-1.0.ga.jar(com/mycila/junit/concurrent/Concurrency.class)
class file has wrong version 50.0, should be 49.0
[INFO] 1 error
[INFO] -------------------------------------------------------------
mojoFailed org.apache.maven.plugins:maven-compiler-plugin:2.3.2(default-testCompile)
projectFailed org.apache.directory.shared:shared-util:0.9.20-SNAPSHOT
[HUDSON] Archiving <https://hudson.apache.org/hudson/job/dir-shared-jdk15-ubuntu-deploy/ws/trunk/util/pom.xml>
to /home/hudson/hudson/jobs/dir-shared-jdk15-ubuntu-deploy/modules/org.apache.directory.shared$shared-util/builds/2011-02-08_03-24-19/archive/org.apache.directory.shared/shared-util/0.9.20-SNAPSHOT/pom.xml
sessionEnded
[INFO] ------------------------------------------------------------------------
[INFO] Reactor Summary:
[INFO] 
[INFO] Apache Directory Shared ........................... SUCCESS [12.904s]
[INFO] Apache Directory Shared I18n ...................... SUCCESS [9.766s]
[INFO] Apache Directory Shared Utilities ................. FAILURE [4.829s]
[INFO] Apache Directory Shared ASN.1 API ................. SKIPPED
[INFO] Apache Directory Shared ASN.1 BER ................. SKIPPED
[INFO] Apache Directory Shared LDAP Model ................ SKIPPED
[INFO] Apache Directory Shared LDAP Codec ................ SKIPPED
[INFO] Apache Directory Shared LDAP ...................... SKIPPED
[INFO] Apache Directory Shared LDAP Schema ............... SKIPPED
[INFO] Apache Directory Shared Integration Tests ......... SKIPPED
[INFO] Apache Directory Shared All ....................... SKIPPED
[INFO] Apache Directory Shared LDAP Schema Converter ..... SKIPPED
[INFO] Apache Directory LDAP Client API .................. SKIPPED
[INFO] Apache Directory Shared DSML Parser ............... SKIPPED
[INFO] Apache Directory Shared DSML Engine ............... SKIPPED
[INFO] ------------------------------------------------------------------------
[INFO] BUILD FAILURE
[INFO] ------------------------------------------------------------------------
[INFO] Total time: 33.825s
[INFO] Finished at: Tue Feb 08 03:25:24 UTC 2011
[INFO] Final Memory: 15M/50M
[INFO] ------------------------------------------------------------------------
mavenExecutionResult exceptions not empty
org.apache.maven.lifecycle.LifecycleExecutionException: Failed to execute goal org.apache.maven.plugins:maven-compiler-plugin:2.3.2:testCompile
(default-testCompile) on project shared-util: Compilation failure
<https://hudson.apache.org/hudson/job/dir-shared-jdk15-ubuntu-deploy/ws/trunk/util/src/test/java/org/apache/directory/shared/util/MethodUtilsTest.java>:[31,-1]
cannot access com.mycila.junit.concurrent.Concurrency
bad class file: /home/hudson/.m2/repository/com/mycila/mycila-junit/1.0.ga/mycila-junit-1.0.ga.jar(com/mycila/junit/concurrent/Concurrency.class)
class file has wrong version 50.0, should be 49.0

	at org.apache.maven.lifecycle.internal.MojoExecutor.execute(MojoExecutor.java:213)
	at org.apache.maven.lifecycle.internal.MojoExecutor.execute(MojoExecutor.java:153)
	at org.apache.maven.lifecycle.internal.MojoExecutor.execute(MojoExecutor.java:145)
	at org.apache.maven.lifecycle.internal.LifecycleModuleBuilder.buildProject(LifecycleModuleBuilder.java:84)
	at org.apache.maven.lifecycle.internal.LifecycleModuleBuilder.buildProject(LifecycleModuleBuilder.java:59)
	at org.apache.maven.lifecycle.internal.LifecycleStarter.singleThreadedBuild(LifecycleStarter.java:183)
	at org.apache.maven.lifecycle.internal.LifecycleStarter.execute(LifecycleStarter.java:161)
	at org.apache.maven.DefaultMaven.doExecute(DefaultMaven.java:319)
	at org.apache.maven.DefaultMaven.execute(DefaultMaven.java:156)
	at org.jvnet.hudson.maven3.launcher.Maven3Launcher.main(Maven3Launcher.java:79)
	at sun.reflect.NativeMethodAccessorImpl.invoke0(Native Method)
	at sun.reflect.NativeMethodAccessorImpl.invoke(NativeMethodAccessorImpl.java:39)
	at sun.reflect.DelegatingMethodAccessorImpl.invoke(DelegatingMethodAccessorImpl.java:25)
	at java.lang.reflect.Method.invoke(Method.java:592)
	at org.codehaus.plexus.classworlds.launcher.Launcher.launchStandard(Launcher.java:329)
	at org.codehaus.plexus.classworlds.launcher.Launcher.launch(Launcher.java:239)
	at org.jvnet.hudson.maven3.agent.Maven3Main.launch(Maven3Main.java:145)
	at hudson.maven.Maven3Builder.call(Maven3Builder.java:124)
	at hudson.maven.Maven3Builder.call(Maven3Builder.java:71)
	at hudson.remoting.UserRequest.perform(UserRequest.java:114)
	at hudson.remoting.UserRequest.perform(UserRequest.java:48)
	at hudson.remoting.Request$2.run(Request.java:270)
	at java.util.concurrent.Executors$RunnableAdapter.call(Executors.java:417)
	at java.util.concurrent.FutureTask$Sync.innerRun(FutureTask.java:269)
	at java.util.concurrent.FutureTask.run(FutureTask.java:123)
	at java.util.concurrent.ThreadPoolExecutor$Worker.runTask(ThreadPoolExecutor.java:651)
	at java.util.concurrent.ThreadPoolExecutor$Worker.run(ThreadPoolExecutor.java:676)
	at java.lang.Thread.run(Thread.java:595)
Caused by: org.apache.maven.plugin.CompilationFailureException: Compilation failure
<https://hudson.apache.org/hudson/job/dir-shared-jdk15-ubuntu-deploy/ws/trunk/util/src/test/java/org/apache/directory/shared/util/MethodUtilsTest.java>:[31,-1]
cannot access com.mycila.junit.concurrent.Concurrency
bad class file: /home/hudson/.m2/repository/com/mycila/mycila-junit/1.0.ga/mycila-junit-1.0.ga.jar(com/mycila/junit/concurrent/Concurrency.class)
class file has wrong version 50.0, should be 49.0

	at org.apache.maven.plugin.AbstractCompilerMojo.execute(AbstractCompilerMojo.java:656)
	at org.apache.maven.plugin.TestCompilerMojo.execute(TestCompilerMojo.java:161)
	at org.apache.maven.plugin.DefaultBuildPluginManager.executeMojo(DefaultBuildPluginManager.java:107)
	at org.apache.maven.lifecycle.internal.MojoExecutor.execute(MojoExecutor.java:209)
	... 27 more
Sending e-mails to: notifications@directory.apache.org
channel stopped


Mime
View raw message