directory-notifications mailing list archives

Site index · List index
Message view « Date » · « Thread »
Top « Date » · « Thread »
From Apache Hudson Server <hud...@hudson.apache.org>
Subject Build failed in Hudson: dir-studio-jdk16-win #135
Date Tue, 25 Jan 2011 04:05:58 GMT
See <https://hudson.apache.org/hudson/job/dir-studio-jdk16-win/135/changes>

Changes:

[akarasulu] added encoding decorator to decouple SearchResultDoneImpl

[akarasulu] added encoding decorator to decouple ModifyRequestImpl

[akarasulu] added encoding decorator to decouple ModifyDnRequestImpl

[akarasulu] added encoding decorator to decouple IntermediateResponseImpl

[akarasulu] no decorator needed for DeleteRequestImpl

[akarasulu] Shared refactoring ...

  o added AddRequestDecorator and removed Encodeable interface
  o decoupled AddRequestImpl from codec code, and moved to model
  o modified LdapEncoder to handle decorators

[akarasulu] Shared refactoring ...

  o moved subtree pkg to model
  o removed ClientEntryFactory and entry.client subpkg

[pamarcelot] Handling of the case where the imported configuration file cannot be read correctly.

[pamarcelot] Fixed missing dependency.

[pamarcelot] Fixed broken dependencies due to the recent refactoring of Shared.

[pamarcelot] Added 'lib' to 'svn:ignore'.

[pamarcelot] Added 'lib' to 'svn:ignore'.

[pamarcelot] Added missing plugin 'shared-ldap-schema-converter' to final application.

------------------------------------------
[...truncated 1023 lines...]
[INFO] [compiler:compile {execution: default-compile}]
[INFO] No sources to compile
[INFO] [bundle:manifest {execution: generate-manifest}]
[WARNING] Warning in manifest for org.apache.directory.studio:org.slf4j.log4j12:jar:1.6.1
: Did not find matching referal for !
[INFO] [resources:testResources {execution: default-testResources}]
[INFO] Using 'UTF-8' encoding to copy filtered resources.
[INFO] skip non existing resourceDirectory C:\hudson\hudson-slave\workspace\dir-studio-jdk16-win\trunk\libraries\org.slf4j.log4j12\src\test\resources
[INFO] Copying 3 resources
[INFO] [compiler:testCompile {execution: default-testCompile}]
[INFO] No sources to compile
[INFO] [surefire:test {execution: default-test}]
[INFO] Tests are skipped.
[INFO] [jar:jar {execution: default-jar}]
[INFO] Building jar: C:\hudson\hudson-slave\workspace\dir-studio-jdk16-win\trunk\libraries\org.slf4j.log4j12\target\org.slf4j.log4j12-1.6.1.jar
[INFO] [tools:verify-legal-files {execution: verify-legal-files}]
[INFO] Checking legal files in: org.slf4j.log4j12-1.6.1.jar
[INFO] [install:install {execution: default-install}]
[INFO] Installing C:\hudson\hudson-slave\workspace\dir-studio-jdk16-win\trunk\libraries\org.slf4j.log4j12\target\org.slf4j.log4j12-1.6.1.jar
to C:\Users\hudson\.m2\repository\org\apache\directory\studio\org.slf4j.log4j12\1.6.1\org.slf4j.log4j12-1.6.1.jar
[HUDSON] Archiving disabled - not archiving C:\hudson\hudson-slave\workspace\dir-studio-jdk16-win\trunk\libraries\org.slf4j.log4j12\pom.xml
[HUDSON] Archiving disabled - not archiving C:\hudson\hudson-slave\workspace\dir-studio-jdk16-win\trunk\libraries\org.slf4j.log4j12\target\org.slf4j.log4j12-1.6.1.jar
[INFO] ------------------------------------------------------------------------
[INFO] Building XPP3 (for Apache Directory Studio)
[INFO]    task-segment: [clean, install]
[INFO] ------------------------------------------------------------------------
[INFO] [clean:clean {execution: default-clean}]
[INFO] Deleting C:\hudson\hudson-slave\workspace\dir-studio-jdk16-win\trunk\libraries\org.xpp3.xpp3\target
[INFO] [remote-resources:process {execution: default}]
[INFO] [resources:resources {execution: default-resources}]
[INFO] Using 'UTF-8' encoding to copy filtered resources.
[INFO] skip non existing resourceDirectory C:\hudson\hudson-slave\workspace\dir-studio-jdk16-win\trunk\libraries\org.xpp3.xpp3\src\main\resources
[INFO] Copying 3 resources
[INFO] [studio:prepare-jar-package {execution: default}]
[INFO] Copying C:\Users\hudson\.m2\repository\xpp3\xpp3\1.1.3.4.O\xpp3-1.1.3.4.O.jar to
               C:\hudson\hudson-slave\workspace\dir-studio-jdk16-win\trunk\libraries\org.xpp3.xpp3\target\classes\lib\xpp3-1.1.3.4.O.jar
[INFO] [compiler:compile {execution: default-compile}]
[INFO] No sources to compile
[INFO] [bundle:manifest {execution: generate-manifest}]
[WARNING] Warning in manifest for org.apache.directory.studio:org.xpp3.xpp3:jar:1.1.340 :
Did not find matching referal for !
[INFO] [resources:testResources {execution: default-testResources}]
[INFO] Using 'UTF-8' encoding to copy filtered resources.
[INFO] skip non existing resourceDirectory C:\hudson\hudson-slave\workspace\dir-studio-jdk16-win\trunk\libraries\org.xpp3.xpp3\src\test\resources
[INFO] Copying 3 resources
[INFO] [compiler:testCompile {execution: default-testCompile}]
[INFO] No sources to compile
[INFO] [surefire:test {execution: default-test}]
[INFO] Tests are skipped.
[INFO] [jar:jar {execution: default-jar}]
[INFO] Building jar: C:\hudson\hudson-slave\workspace\dir-studio-jdk16-win\trunk\libraries\org.xpp3.xpp3\target\org.xpp3.xpp3-1.1.340.jar
[INFO] [tools:verify-legal-files {execution: verify-legal-files}]
[INFO] Checking legal files in: org.xpp3.xpp3-1.1.340.jar
[INFO] [install:install {execution: default-install}]
[INFO] Installing C:\hudson\hudson-slave\workspace\dir-studio-jdk16-win\trunk\libraries\org.xpp3.xpp3\target\org.xpp3.xpp3-1.1.340.jar
to C:\Users\hudson\.m2\repository\org\apache\directory\studio\org.xpp3.xpp3\1.1.340\org.xpp3.xpp3-1.1.340.jar
[HUDSON] Archiving disabled - not archiving C:\hudson\hudson-slave\workspace\dir-studio-jdk16-win\trunk\libraries\org.xpp3.xpp3\pom.xml
[HUDSON] Archiving disabled - not archiving C:\hudson\hudson-slave\workspace\dir-studio-jdk16-win\trunk\libraries\org.xpp3.xpp3\target\org.xpp3.xpp3-1.1.340.jar
[INFO] ------------------------------------------------------------------------
[INFO] Building Apache Directory Studio Plugins
[INFO]    task-segment: [clean, install]
[INFO] ------------------------------------------------------------------------
[INFO] [clean:clean {execution: default-clean}]
[INFO] Deleting C:\hudson\hudson-slave\workspace\dir-studio-jdk16-win\trunk\plugins\target
[INFO] [remote-resources:process {execution: default}]
[INFO] [site:attach-descriptor {execution: default-attach-descriptor}]
[INFO] [tools:verify-legal-files {execution: verify-legal-files}]
[INFO] [install:install {execution: default-install}]
[INFO] Installing C:\hudson\hudson-slave\workspace\dir-studio-jdk16-win\trunk\plugins\pom.xml
to C:\Users\hudson\.m2\repository\org\apache\directory\studio\parent-plugins\2.0.0-SNAPSHOT\parent-plugins-2.0.0-SNAPSHOT.pom
[INFO] Installing C:\hudson\hudson-slave\workspace\dir-studio-jdk16-win\trunk\plugins\target\parent-plugins-2.0.0-SNAPSHOT-site.xml
to C:\Users\hudson\.m2\repository\org\apache\directory\studio\parent-plugins\2.0.0-SNAPSHOT\parent-plugins-2.0.0-SNAPSHOT-site.xml
[HUDSON] Archiving disabled - not archiving C:\hudson\hudson-slave\workspace\dir-studio-jdk16-win\trunk\plugins\pom.xml
[HUDSON] Archiving disabled - not archiving C:\Users\hudson\.m2\repository\org\apache\directory\studio\parent-plugins\2.0.0-SNAPSHOT\parent-plugins-2.0.0-SNAPSHOT.pom
[HUDSON] Archiving disabled - not archiving C:\hudson\hudson-slave\workspace\dir-studio-jdk16-win\trunk\plugins\target\parent-plugins-2.0.0-SNAPSHOT-site.xml
[INFO] ------------------------------------------------------------------------
[INFO] Building Apache Directory Studio Common UI
[INFO]    task-segment: [clean, install]
[INFO] ------------------------------------------------------------------------
[INFO] [clean:clean {execution: default-clean}]
[INFO] Deleting C:\hudson\hudson-slave\workspace\dir-studio-jdk16-win\trunk\plugins\common.ui\target
[INFO] [remote-resources:process {execution: default}]
[INFO] [resources:resources {execution: default-resources}]
[INFO] Using 'UTF-8' encoding to copy filtered resources.
[INFO] Copying 2 resources
[INFO] Copying 1 resource to resources
[INFO] skip non existing resourceDirectory C:\hudson\hudson-slave\workspace\dir-studio-jdk16-win\trunk\plugins\common.ui\src\main\resources
[INFO] Copying 3 resources
[INFO] Copying 3 resources
[INFO] [studio:prepare-jar-package {execution: default}]
[INFO] [compiler:compile {execution: default-compile}]
[INFO] Compiling 8 source files to C:\hudson\hudson-slave\workspace\dir-studio-jdk16-win\trunk\plugins\common.ui\target\classes
[INFO] [bundle:manifest {execution: generate-manifest}]
[WARNING] Warning in manifest for org.apache.directory.studio:common.ui:jar:2.0.0-SNAPSHOT
: Did not find matching referal for !
[INFO] [resources:testResources {execution: default-testResources}]
[INFO] Using 'UTF-8' encoding to copy filtered resources.
[INFO] skip non existing resourceDirectory C:\hudson\hudson-slave\workspace\dir-studio-jdk16-win\trunk\plugins\common.ui\src\test\resources
[INFO] Copying 3 resources
[INFO] [compiler:testCompile {execution: default-testCompile}]
[INFO] No sources to compile
[INFO] [surefire:test {execution: default-test}]
[INFO] Tests are skipped.
[INFO] [jar:jar {execution: default-jar}]
[INFO] Building jar: C:\hudson\hudson-slave\workspace\dir-studio-jdk16-win\trunk\plugins\common.ui\target\common.ui-2.0.0-SNAPSHOT.jar
[INFO] [tools:verify-legal-files {execution: verify-legal-files}]
[INFO] Checking legal files in: common.ui-2.0.0-SNAPSHOT.jar
[INFO] [install:install {execution: default-install}]
[INFO] Installing C:\hudson\hudson-slave\workspace\dir-studio-jdk16-win\trunk\plugins\common.ui\target\common.ui-2.0.0-SNAPSHOT.jar
to C:\Users\hudson\.m2\repository\org\apache\directory\studio\common.ui\2.0.0-SNAPSHOT\common.ui-2.0.0-SNAPSHOT.jar
[HUDSON] Archiving disabled - not archiving C:\hudson\hudson-slave\workspace\dir-studio-jdk16-win\trunk\plugins\common.ui\pom.xml
[HUDSON] Archiving disabled - not archiving C:\hudson\hudson-slave\workspace\dir-studio-jdk16-win\trunk\plugins\common.ui\target\common.ui-2.0.0-SNAPSHOT.jar
[INFO] ------------------------------------------------------------------------
[INFO] Building Apache Directory Studio Common Core
[INFO]    task-segment: [clean, install]
[INFO] ------------------------------------------------------------------------
[INFO] [clean:clean {execution: default-clean}]
[INFO] Deleting C:\hudson\hudson-slave\workspace\dir-studio-jdk16-win\trunk\plugins\common.core\target
[INFO] [remote-resources:process {execution: default}]
[INFO] [resources:resources {execution: default-resources}]
[INFO] Using 'UTF-8' encoding to copy filtered resources.
[INFO] Copying 1 resource
[INFO] Copying 3 resources
[INFO] Copying 3 resources
[INFO] [studio:prepare-jar-package {execution: default}]
[INFO] [compiler:compile {execution: default-compile}]
[INFO] Compiling 7 source files to C:\hudson\hudson-slave\workspace\dir-studio-jdk16-win\trunk\plugins\common.core\target\classes
[INFO] [bundle:manifest {execution: generate-manifest}]
[WARNING] Warning in manifest for org.apache.directory.studio:common.core:jar:2.0.0-SNAPSHOT
: Did not find matching referal for !
[INFO] [resources:testResources {execution: default-testResources}]
[INFO] Using 'UTF-8' encoding to copy filtered resources.
[INFO] Copying 0 resource
[INFO] Copying 3 resources
[INFO] [compiler:testCompile {execution: default-testCompile}]
[INFO] Nothing to compile - all classes are up to date
[INFO] [surefire:test {execution: default-test}]
[INFO] Tests are skipped.
[INFO] [jar:jar {execution: default-jar}]
[INFO] Building jar: C:\hudson\hudson-slave\workspace\dir-studio-jdk16-win\trunk\plugins\common.core\target\common.core-2.0.0-SNAPSHOT.jar
[INFO] [tools:verify-legal-files {execution: verify-legal-files}]
[INFO] Checking legal files in: common.core-2.0.0-SNAPSHOT.jar
[INFO] [install:install {execution: default-install}]
[INFO] Installing C:\hudson\hudson-slave\workspace\dir-studio-jdk16-win\trunk\plugins\common.core\target\common.core-2.0.0-SNAPSHOT.jar
to C:\Users\hudson\.m2\repository\org\apache\directory\studio\common.core\2.0.0-SNAPSHOT\common.core-2.0.0-SNAPSHOT.jar
[HUDSON] Archiving disabled - not archiving C:\hudson\hudson-slave\workspace\dir-studio-jdk16-win\trunk\plugins\common.core\pom.xml
[HUDSON] Archiving disabled - not archiving C:\hudson\hudson-slave\workspace\dir-studio-jdk16-win\trunk\plugins\common.core\target\common.core-2.0.0-SNAPSHOT.jar
[INFO] ------------------------------------------------------------------------
[INFO] Building Apache Directory Studio LDIF Parser
[INFO]    task-segment: [clean, install]
[INFO] ------------------------------------------------------------------------
[INFO] [clean:clean {execution: default-clean}]
[INFO] Deleting C:\hudson\hudson-slave\workspace\dir-studio-jdk16-win\trunk\plugins\ldifparser\target
[INFO] [remote-resources:process {execution: default}]
[INFO] [resources:resources {execution: default-resources}]
[INFO] Using 'UTF-8' encoding to copy filtered resources.
[INFO] skip non existing resourceDirectory C:\hudson\hudson-slave\workspace\dir-studio-jdk16-win\trunk\plugins\ldifparser\src\main\resources
[INFO] Copying 3 resources
[INFO] [studio:prepare-jar-package {execution: default}]
[INFO] [compiler:compile {execution: default-compile}]
[INFO] Compiling 41 source files to C:\hudson\hudson-slave\workspace\dir-studio-jdk16-win\trunk\plugins\ldifparser\target\classes
[INFO] [bundle:manifest {execution: generate-manifest}]
[WARNING] Warning in manifest for org.apache.directory.studio:ldifparser:jar:2.0.0-SNAPSHOT
: Did not find matching referal for !
[INFO] [resources:testResources {execution: default-testResources}]
[INFO] Using 'UTF-8' encoding to copy filtered resources.
[INFO] skip non existing resourceDirectory C:\hudson\hudson-slave\workspace\dir-studio-jdk16-win\trunk\plugins\ldifparser\src\test\resources
[INFO] Copying 3 resources
[INFO] [compiler:testCompile {execution: default-testCompile}]
[INFO] Compiling 3 source files to C:\hudson\hudson-slave\workspace\dir-studio-jdk16-win\trunk\plugins\ldifparser\target\test-classes
[INFO] [surefire:test {execution: default-test}]
[INFO] Surefire report directory: C:\hudson\hudson-slave\workspace\dir-studio-jdk16-win\trunk\plugins\ldifparser\target\surefire-reports

-------------------------------------------------------
 T E S T S
-------------------------------------------------------
Running org.apache.directory.studio.ldifparser.model.lines.LdifDnLineTest
Tests run: 6, Failures: 0, Errors: 0, Skipped: 0, Time elapsed: 0.168 sec
Running org.apache.directory.studio.ldifparser.model.lines.LdifAttrValLineTest
Tests run: 5, Failures: 0, Errors: 0, Skipped: 0, Time elapsed: 0.016 sec
Running org.apache.directory.studio.ldifparser.parser.LdifParserTest
Tests run: 1, Failures: 0, Errors: 0, Skipped: 0, Time elapsed: 0.018 sec

Results :

Tests run: 12, Failures: 0, Errors: 0, Skipped: 0

[HUDSON] Recording test results
[INFO] [jar:jar {execution: default-jar}]
[INFO] Building jar: C:\hudson\hudson-slave\workspace\dir-studio-jdk16-win\trunk\plugins\ldifparser\target\ldifparser-2.0.0-SNAPSHOT.jar
[INFO] [tools:verify-legal-files {execution: verify-legal-files}]
[INFO] Checking legal files in: ldifparser-2.0.0-SNAPSHOT.jar
[INFO] [install:install {execution: default-install}]
[INFO] Installing C:\hudson\hudson-slave\workspace\dir-studio-jdk16-win\trunk\plugins\ldifparser\target\ldifparser-2.0.0-SNAPSHOT.jar
to C:\Users\hudson\.m2\repository\org\apache\directory\studio\ldifparser\2.0.0-SNAPSHOT\ldifparser-2.0.0-SNAPSHOT.jar
[HUDSON] Archiving disabled - not archiving C:\hudson\hudson-slave\workspace\dir-studio-jdk16-win\trunk\plugins\ldifparser\pom.xml
[HUDSON] Archiving disabled - not archiving C:\hudson\hudson-slave\workspace\dir-studio-jdk16-win\trunk\plugins\ldifparser\target\ldifparser-2.0.0-SNAPSHOT.jar
[INFO] ------------------------------------------------------------------------
[INFO] Building Apache Directory Studio Connection Core
[INFO]    task-segment: [clean, install]
[INFO] ------------------------------------------------------------------------
[INFO] [clean:clean {execution: default-clean}]
[INFO] Deleting C:\hudson\hudson-slave\workspace\dir-studio-jdk16-win\trunk\plugins\connection.core\target
[INFO] [remote-resources:process {execution: default}]
[INFO] snapshot org.apache.directory.studio:ldifparser:2.0.0-SNAPSHOT: checking for updates
from studio.repository
[INFO] snapshot org.apache.directory.studio:ldifparser:2.0.0-SNAPSHOT: checking for updates
from apache.snapshots
[INFO] [resources:resources {execution: default-resources}]
[INFO] Using 'UTF-8' encoding to copy filtered resources.
[INFO] Copying 3 resources
[INFO] Copying 5 resources
[INFO] Copying 3 resources
[INFO] Copying 3 resources
[INFO] [studio:prepare-jar-package {execution: default}]
[INFO] [compiler:compile {execution: default-compile}]
[INFO] Compiling 57 source files to C:\hudson\hudson-slave\workspace\dir-studio-jdk16-win\trunk\plugins\connection.core\target\classes
[INFO] -------------------------------------------------------------
[ERROR] COMPILATION ERROR : 
[INFO] -------------------------------------------------------------
[ERROR] \hudson\hudson-slave\workspace\dir-studio-jdk16-win\trunk\plugins\connection.core\src\main\java\org\apache\directory\studio\connection\core\io\api\DirectoryApiConnectionWrapper.java:[57,53]
cannot find symbol
symbol  : class ModifyDnRequestImpl
location: package org.apache.directory.shared.ldap.model.message
[ERROR] \hudson\hudson-slave\workspace\dir-studio-jdk16-win\trunk\plugins\connection.core\src\main\java\org\apache\directory\studio\connection\core\io\api\DirectoryApiConnectionWrapper.java:[60,53]
cannot find symbol
symbol  : class ModifyRequestImpl
location: package org.apache.directory.shared.ldap.model.message
[ERROR] \hudson\hudson-slave\workspace\dir-studio-jdk16-win\trunk\plugins\connection.core\src\main\java\org\apache\directory\studio\connection\core\io\api\DirectoryApiConnectionWrapper.java:[599,48]
cannot find symbol
symbol: class ModifyRequestImpl
                    ModifyRequest request = new ModifyRequestImpl();
[ERROR] \hudson\hudson-slave\workspace\dir-studio-jdk16-win\trunk\plugins\connection.core\src\main\java\org\apache\directory\studio\connection\core\io\api\DirectoryApiConnectionWrapper.java:[732,50]
cannot find symbol
symbol: class ModifyDnRequestImpl
                    ModifyDnRequest request = new ModifyDnRequestImpl();
[INFO] 4 errors 
[INFO] -------------------------------------------------------------
[HUDSON] Archiving disabled - not archiving C:\hudson\hudson-slave\workspace\dir-studio-jdk16-win\trunk\plugins\connection.core\pom.xml
[INFO] ------------------------------------------------------------------------
[ERROR] BUILD FAILURE
[INFO] ------------------------------------------------------------------------
[INFO] Compilation failure

\hudson\hudson-slave\workspace\dir-studio-jdk16-win\trunk\plugins\connection.core\src\main\java\org\apache\directory\studio\connection\core\io\api\DirectoryApiConnectionWrapper.java:[57,53]
cannot find symbol
symbol  : class ModifyDnRequestImpl
location: package org.apache.directory.shared.ldap.model.message
\hudson\hudson-slave\workspace\dir-studio-jdk16-win\trunk\plugins\connection.core\src\main\java\org\apache\directory\studio\connection\core\io\api\DirectoryApiConnectionWrapper.java:[60,53]
cannot find symbol
symbol  : class ModifyRequestImpl
location: package org.apache.directory.shared.ldap.model.message
\hudson\hudson-slave\workspace\dir-studio-jdk16-win\trunk\plugins\connection.core\src\main\java\org\apache\directory\studio\connection\core\io\api\DirectoryApiConnectionWrapper.java:[599,48]
cannot find symbol
symbol: class ModifyRequestImpl
                    ModifyRequest request = new ModifyRequestImpl();
\hudson\hudson-slave\workspace\dir-studio-jdk16-win\trunk\plugins\connection.core\src\main\java\org\apache\directory\studio\connection\core\io\api\DirectoryApiConnectionWrapper.java:[732,50]
cannot find symbol
symbol: class ModifyDnRequestImpl
                    ModifyDnRequest request = new ModifyDnRequestImpl();

[INFO] ------------------------------------------------------------------------
[INFO] For more information, run Maven with the -e switch
[INFO] ------------------------------------------------------------------------
[INFO] Total time: 1 minute 4 seconds
[INFO] Finished at: Tue Jan 25 04:05:54 GMT 2011
[INFO] Final Memory: 162M/301M
[INFO] ------------------------------------------------------------------------
Sending e-mails to: notifications@directory.apache.org
Sending e-mails to: notifications@directory.apache.org
channel stopped


Mime
View raw message