directory-notifications mailing list archives

Site index · List index
Message view « Date » · « Thread »
Top « Date » · « Thread »
From Apache Hudson Server <hud...@hudson.apache.org>
Subject Build failed in Hudson: dir-apacheds-jdk15-ubuntu-deploy #154
Date Tue, 25 Jan 2011 14:40:42 GMT
See <https://hudson.apache.org/hudson/job/dir-apacheds-jdk15-ubuntu-deploy/154/changes>

Changes:

[akarasulu] Shared refactoring ...

  o moved all the decorators into oadsl.codec.decorators package
  o moved LdapEncoder into oadsl.codec package
  o deleted FooDecorator template
  o SearchRequestImpl still remains
  o two tests in codec are failing: 
     shared/ldap/src/test/java/org/apache/directory/shared/ldap/codec/del/DelResponseTest.java

------------------------------------------
[...truncated 136 lines...]

[INFO] --- maven-install-plugin:2.3.1:install (default-install) @ apacheds-i18n ---
[INFO] Downloading: https://repository.apache.org/content/repositories/snapshots/org/apache/directory/server/apacheds-i18n/1.5.8-SNAPSHOT/maven-metadata.xml

[INFO] --- maven-deploy-plugin:2.5:deploy (default-deploy) @ apacheds-i18n ---
Downloaded: https://repository.apache.org/content/repositories/snapshots/org/apache/directory/server/apacheds-i18n/1.5.8-SNAPSHOT/maven-metadata.xml
(378 B at 0.4 KB/sec)
Uploading: https://repository.apache.org/content/repositories/snapshots/org/apache/directory/server/apacheds-i18n/1.5.8-SNAPSHOT/apacheds-i18n-1.5.8-20110125.144022-138.jar
Uploaded: https://repository.apache.org/content/repositories/snapshots/org/apache/directory/server/apacheds-i18n/1.5.8-SNAPSHOT/apacheds-i18n-1.5.8-20110125.144022-138.jar
(45 KB at 7.6 KB/sec)
Uploading: https://repository.apache.org/content/repositories/snapshots/org/apache/directory/server/apacheds-i18n/1.5.8-SNAPSHOT/apacheds-i18n-1.5.8-20110125.144022-138.pom
Uploaded: https://repository.apache.org/content/repositories/snapshots/org/apache/directory/server/apacheds-i18n/1.5.8-SNAPSHOT/apacheds-i18n-1.5.8-20110125.144022-138.pom
(2 KB at 0.6 KB/sec)
Downloading: https://repository.apache.org/content/repositories/snapshots/org/apache/directory/server/apacheds-i18n/maven-metadata.xml
Downloaded: https://repository.apache.org/content/repositories/snapshots/org/apache/directory/server/apacheds-i18n/maven-metadata.xml
(416 B at 1.0 KB/sec)
Uploading: https://repository.apache.org/content/repositories/snapshots/org/apache/directory/server/apacheds-i18n/1.5.8-SNAPSHOT/maven-metadata.xml
Uploaded: https://repository.apache.org/content/repositories/snapshots/org/apache/directory/server/apacheds-i18n/1.5.8-SNAPSHOT/maven-metadata.xml
(796 B at 5.2 KB/sec)
Uploading: https://repository.apache.org/content/repositories/snapshots/org/apache/directory/server/apacheds-i18n/maven-metadata.xml
Uploaded: https://repository.apache.org/content/repositories/snapshots/org/apache/directory/server/apacheds-i18n/maven-metadata.xml
(380 B at 0.9 KB/sec)
projectSucceeded org.apache.directory.server:apacheds-i18n:1.5.8-SNAPSHOT
[HUDSON] Archiving <https://hudson.apache.org/hudson/job/dir-apacheds-jdk15-ubuntu-deploy/ws/trunk/i18n/pom.xml>
to /home/hudson/hudson/jobs/dir-apacheds-jdk15-ubuntu-deploy/modules/org.apache.directory.server$apacheds-i18n/builds/2011-01-25_14-39-33/archive/org.apache.directory.server/apacheds-i18n/1.5.8-SNAPSHOT/pom.xml
[HUDSON] Archiving <https://hudson.apache.org/hudson/job/dir-apacheds-jdk15-ubuntu-deploy/ws/trunk/i18n/target/apacheds-i18n-1.5.8-SNAPSHOT.jar>
to /home/hudson/hudson/jobs/dir-apacheds-jdk15-ubuntu-deploy/modules/org.apache.directory.server$apacheds-i18n/builds/2011-01-25_14-39-33/archive/org.apache.directory.server/apacheds-i18n/1.5.8-20110125.144022-138/apacheds-i18n-1.5.8-SNAPSHOT.jar
[INFO] [INFO] Deleting <https://hudson.apache.org/hudson/job/dir-apacheds-jdk15-ubuntu-deploy/ws/trunk/core-constants/target>
                                                                        
[INFO] ------------------------------------------------------------------------
[INFO] Building ApacheDS Core Constants 1.5.8-SNAPSHOT
[INFO] ------------------------------------------------------------------------
[INFO] 
[INFO] --- maven-clean-plugin:2.4.1:clean (default-clean) @ apacheds-core-constants ---
[INFO] 
[INFO] --- maven-remote-resources-plugin:1.1:process (default) @ apacheds-core-constants ---
[INFO] [INFO] Using 'UTF-8' encoding to copy filtered resources.
[INFO] Copying 0 resource
[INFO] Copying 3 resources

[INFO] --- maven-resources-plugin:2.4.3:resources (default-resources) @ apacheds-core-constants
---
[INFO] 
[INFO] --- maven-compiler-plugin:2.3.2:compile (default-compile) @ apacheds-core-constants
---
[INFO] Compiling 4 source files to <https://hudson.apache.org/hudson/job/dir-apacheds-jdk15-ubuntu-deploy/ws/trunk/core-constants/target/classes>
[INFO] [INFO] Using 'UTF-8' encoding to copy filtered resources.
[INFO] skip non existing resourceDirectory <https://hudson.apache.org/hudson/job/dir-apacheds-jdk15-ubuntu-deploy/ws/trunk/core-constants/src/test/resources>
[INFO] Copying 3 resources

[INFO] --- maven-resources-plugin:2.4.3:testResources (default-testResources) @ apacheds-core-constants
---
[INFO] [INFO] No sources to compile

[INFO] --- maven-compiler-plugin:2.3.2:testCompile (default-testCompile) @ apacheds-core-constants
---
[INFO] [INFO] Surefire report directory: <https://hudson.apache.org/hudson/job/dir-apacheds-jdk15-ubuntu-deploy/ws/trunk/core-constants/target/surefire-reports>

[INFO] --- maven-surefire-plugin:2.6:test (default-test) @ apacheds-core-constants ---

-------------------------------------------------------
 T E S T S
-------------------------------------------------------
There are no tests to run.

Results :

Tests run: 0, Failures: 0, Errors: 0, Skipped: 0

[HUDSON] Recording test results
[INFO] 
[INFO] --- maven-jar-plugin:2.3.1:jar (default-jar) @ apacheds-core-constants ---
[INFO] Building jar: <https://hudson.apache.org/hudson/job/dir-apacheds-jdk15-ubuntu-deploy/ws/trunk/core-constants/target/apacheds-core-constants-1.5.8-SNAPSHOT.jar>
[INFO] [INFO] Checking legal files in: apacheds-core-constants-1.5.8-SNAPSHOT.jar

[INFO] --- tools-maven-plugin:1.4:verify-legal-files (verify-legal-files) @ apacheds-core-constants
---
[INFO] [INFO] Installing <https://hudson.apache.org/hudson/job/dir-apacheds-jdk15-ubuntu-deploy/ws/trunk/core-constants/target/apacheds-core-constants-1.5.8-SNAPSHOT.jar>
to /home/hudson/.m2/repository/org/apache/directory/server/apacheds-core-constants/1.5.8-SNAPSHOT/apacheds-core-constants-1.5.8-SNAPSHOT.jar

[INFO] --- maven-install-plugin:2.3.1:install (default-install) @ apacheds-core-constants
---
[INFO] Installing <https://hudson.apache.org/hudson/job/dir-apacheds-jdk15-ubuntu-deploy/ws/trunk/core-constants/pom.xml>
to /home/hudson/.m2/repository/org/apache/directory/server/apacheds-core-constants/1.5.8-SNAPSHOT/apacheds-core-constants-1.5.8-SNAPSHOT.pom
[INFO] Downloading: https://repository.apache.org/content/repositories/snapshots/org/apache/directory/server/apacheds-core-constants/1.5.8-SNAPSHOT/maven-metadata.xml

[INFO] --- maven-deploy-plugin:2.5:deploy (default-deploy) @ apacheds-core-constants ---
Downloaded: https://repository.apache.org/content/repositories/snapshots/org/apache/directory/server/apacheds-core-constants/1.5.8-SNAPSHOT/maven-metadata.xml
(388 B at 0.4 KB/sec)
Uploading: https://repository.apache.org/content/repositories/snapshots/org/apache/directory/server/apacheds-core-constants/1.5.8-SNAPSHOT/apacheds-core-constants-1.5.8-20110125.144037-137.jar
Uploaded: https://repository.apache.org/content/repositories/snapshots/org/apache/directory/server/apacheds-core-constants/1.5.8-SNAPSHOT/apacheds-core-constants-1.5.8-20110125.144037-137.jar
(11 KB at 4.6 KB/sec)
Uploading: https://repository.apache.org/content/repositories/snapshots/org/apache/directory/server/apacheds-core-constants/1.5.8-SNAPSHOT/apacheds-core-constants-1.5.8-20110125.144037-137.pom
Uploaded: https://repository.apache.org/content/repositories/snapshots/org/apache/directory/server/apacheds-core-constants/1.5.8-SNAPSHOT/apacheds-core-constants-1.5.8-20110125.144037-137.pom
(2 KB at 0.5 KB/sec)
Downloading: https://repository.apache.org/content/repositories/snapshots/org/apache/directory/server/apacheds-core-constants/maven-metadata.xml
Downloaded: https://repository.apache.org/content/repositories/snapshots/org/apache/directory/server/apacheds-core-constants/maven-metadata.xml
(466 B at 0.3 KB/sec)
Uploading: https://repository.apache.org/content/repositories/snapshots/org/apache/directory/server/apacheds-core-constants/1.5.8-SNAPSHOT/maven-metadata.xml
Uploaded: https://repository.apache.org/content/repositories/snapshots/org/apache/directory/server/apacheds-core-constants/1.5.8-SNAPSHOT/maven-metadata.xml
(806 B at 1.3 KB/sec)
Uploading: https://repository.apache.org/content/repositories/snapshots/org/apache/directory/server/apacheds-core-constants/maven-metadata.xml
Uploaded: https://repository.apache.org/content/repositories/snapshots/org/apache/directory/server/apacheds-core-constants/maven-metadata.xml
(430 B at 2.0 KB/sec)
projectSucceeded org.apache.directory.server:apacheds-core-constants:1.5.8-SNAPSHOT
[HUDSON] Archiving <https://hudson.apache.org/hudson/job/dir-apacheds-jdk15-ubuntu-deploy/ws/trunk/core-constants/pom.xml>
to /home/hudson/hudson/jobs/dir-apacheds-jdk15-ubuntu-deploy/modules/org.apache.directory.server$apacheds-core-constants/builds/2011-01-25_14-39-33/archive/org.apache.directory.server/apacheds-core-constants/1.5.8-SNAPSHOT/pom.xml
[HUDSON] Archiving <https://hudson.apache.org/hudson/job/dir-apacheds-jdk15-ubuntu-deploy/ws/trunk/core-constants/target/apacheds-core-constants-1.5.8-SNAPSHOT.jar>
to /home/hudson/hudson/jobs/dir-apacheds-jdk15-ubuntu-deploy/modules/org.apache.directory.server$apacheds-core-constants/builds/2011-01-25_14-39-33/archive/org.apache.directory.server/apacheds-core-constants/1.5.8-20110125.144037-137/apacheds-core-constants-1.5.8-SNAPSHOT.jar
[INFO]                                                                         
[INFO] ------------------------------------------------------------------------
[INFO] Building ApacheDS Core API 1.5.8-SNAPSHOT
[INFO] ------------------------------------------------------------------------
[INFO] Deleting <https://hudson.apache.org/hudson/job/dir-apacheds-jdk15-ubuntu-deploy/ws/trunk/core-api/target>
[INFO] 
[INFO] --- maven-clean-plugin:2.4.1:clean (default-clean) @ apacheds-core-api ---
[INFO] 
[INFO] --- maven-remote-resources-plugin:1.1:process (default) @ apacheds-core-api ---
[INFO] [INFO] Using 'UTF-8' encoding to copy filtered resources.
[INFO] Copying 1 resource

[INFO] --- maven-resources-plugin:2.4.3:resources (default-resources) @ apacheds-core-api
---
[INFO] Copying 3 resources
[INFO] 
[INFO] --- maven-compiler-plugin:2.3.2:compile (default-compile) @ apacheds-core-api ---
[INFO] Compiling 119 source files to <https://hudson.apache.org/hudson/job/dir-apacheds-jdk15-ubuntu-deploy/ws/trunk/core-api/target/classes>
[INFO] -------------------------------------------------------------
[ERROR] COMPILATION ERROR : 
[INFO] -------------------------------------------------------------
[ERROR] <https://hudson.apache.org/hudson/job/dir-apacheds-jdk15-ubuntu-deploy/ws/trunk/core-api/src/main/java/org/apache/directory/server/core/LdapCoreSessionConnection.java>:[70,54]
cannot find symbol
symbol  : class ModifyDnRequestImpl
location: package org.apache.directory.shared.ldap.model.message
[ERROR] <https://hudson.apache.org/hudson/job/dir-apacheds-jdk15-ubuntu-deploy/ws/trunk/core-api/src/main/java/org/apache/directory/server/core/LdapCoreSessionConnection.java>:[72,54]
cannot find symbol
symbol  : class ModifyDnResponseImpl
location: package org.apache.directory.shared.ldap.model.message
[ERROR] <https://hudson.apache.org/hudson/job/dir-apacheds-jdk15-ubuntu-deploy/ws/trunk/core-api/src/main/java/org/apache/directory/server/core/LdapCoreSessionConnection.java>:[74,54]
cannot find symbol
symbol  : class ModifyRequestImpl
location: package org.apache.directory.shared.ldap.model.message
[ERROR] <https://hudson.apache.org/hudson/job/dir-apacheds-jdk15-ubuntu-deploy/ws/trunk/core-api/src/main/java/org/apache/directory/server/core/LdapCoreSessionConnection.java>:[76,54]
cannot find symbol
symbol  : class ModifyResponseImpl
location: package org.apache.directory.shared.ldap.model.message
[ERROR] <https://hudson.apache.org/hudson/job/dir-apacheds-jdk15-ubuntu-deploy/ws/trunk/core-api/src/main/java/org/apache/directory/server/core/EntryToResponseCursor.java>:[32,54]
cannot find symbol
symbol  : class SearchResultDoneImpl
location: package org.apache.directory.shared.ldap.model.message
[ERROR] <https://hudson.apache.org/hudson/job/dir-apacheds-jdk15-ubuntu-deploy/ws/trunk/core-api/src/main/java/org/apache/directory/server/core/EntryToResponseCursor.java>:[33,54]
cannot find symbol
symbol  : class SearchResultEntryImpl
location: package org.apache.directory.shared.ldap.model.message
[ERROR] <https://hudson.apache.org/hudson/job/dir-apacheds-jdk15-ubuntu-deploy/ws/trunk/core-api/src/main/java/org/apache/directory/server/core/LdapCoreSessionConnection.java>:[578,34]
cannot find symbol
symbol  : class ModifyResponseImpl
location: class org.apache.directory.server.core.LdapCoreSessionConnection
[ERROR] <https://hudson.apache.org/hudson/job/dir-apacheds-jdk15-ubuntu-deploy/ws/trunk/core-api/src/main/java/org/apache/directory/server/core/LdapCoreSessionConnection.java>:[581,36]
cannot find symbol
symbol  : class ModifyRequestImpl
location: class org.apache.directory.server.core.LdapCoreSessionConnection
[ERROR] <https://hudson.apache.org/hudson/job/dir-apacheds-jdk15-ubuntu-deploy/ws/trunk/core-api/src/main/java/org/apache/directory/server/core/LdapCoreSessionConnection.java>:[628,34]
cannot find symbol
symbol  : class ModifyResponseImpl
location: class org.apache.directory.server.core.LdapCoreSessionConnection
[ERROR] <https://hudson.apache.org/hudson/job/dir-apacheds-jdk15-ubuntu-deploy/ws/trunk/core-api/src/main/java/org/apache/directory/server/core/LdapCoreSessionConnection.java>:[631,36]
cannot find symbol
symbol  : class ModifyRequestImpl
location: class org.apache.directory.server.core.LdapCoreSessionConnection
[ERROR] <https://hudson.apache.org/hudson/job/dir-apacheds-jdk15-ubuntu-deploy/ws/trunk/core-api/src/main/java/org/apache/directory/server/core/LdapCoreSessionConnection.java>:[673,34]
cannot find symbol
symbol  : class ModifyResponseImpl
location: class org.apache.directory.server.core.LdapCoreSessionConnection
[ERROR] <https://hudson.apache.org/hudson/job/dir-apacheds-jdk15-ubuntu-deploy/ws/trunk/core-api/src/main/java/org/apache/directory/server/core/LdapCoreSessionConnection.java>:[707,36]
cannot find symbol
symbol  : class ModifyDnResponseImpl
location: class org.apache.directory.server.core.LdapCoreSessionConnection
[ERROR] <https://hudson.apache.org/hudson/job/dir-apacheds-jdk15-ubuntu-deploy/ws/trunk/core-api/src/main/java/org/apache/directory/server/core/LdapCoreSessionConnection.java>:[790,40]
cannot find symbol
symbol  : class ModifyDnRequestImpl
location: class org.apache.directory.server.core.LdapCoreSessionConnection
[ERROR] <https://hudson.apache.org/hudson/job/dir-apacheds-jdk15-ubuntu-deploy/ws/trunk/core-api/src/main/java/org/apache/directory/server/core/LdapCoreSessionConnection.java>:[840,40]
cannot find symbol
symbol  : class ModifyDnRequestImpl
location: class org.apache.directory.server.core.LdapCoreSessionConnection
[ERROR] <https://hudson.apache.org/hudson/job/dir-apacheds-jdk15-ubuntu-deploy/ws/trunk/core-api/src/main/java/org/apache/directory/server/core/LdapCoreSessionConnection.java>:[942,36]
cannot find symbol
symbol  : class ModifyDnResponseImpl
location: class org.apache.directory.server.core.LdapCoreSessionConnection
[ERROR] <https://hudson.apache.org/hudson/job/dir-apacheds-jdk15-ubuntu-deploy/ws/trunk/core-api/src/main/java/org/apache/directory/server/core/LdapCoreSessionConnection.java>:[945,40]
cannot find symbol
symbol  : class ModifyDnRequestImpl
location: class org.apache.directory.server.core.LdapCoreSessionConnection
[ERROR] <https://hudson.apache.org/hudson/job/dir-apacheds-jdk15-ubuntu-deploy/ws/trunk/core-api/src/main/java/org/apache/directory/server/core/EntryToResponseCursor.java>:[119,35]
cannot find symbol
symbol  : class SearchResultEntryImpl
location: class org.apache.directory.server.core.EntryToResponseCursor
[ERROR] <https://hudson.apache.org/hudson/job/dir-apacheds-jdk15-ubuntu-deploy/ws/trunk/core-api/src/main/java/org/apache/directory/server/core/EntryToResponseCursor.java>:[161,33]
cannot find symbol
symbol  : class SearchResultDoneImpl
location: class org.apache.directory.server.core.EntryToResponseCursor
[INFO] 18 errors 
[INFO] -------------------------------------------------------------
mojoFailed org.apache.maven.plugins:maven-compiler-plugin:2.3.2(default-compile)
projectFailed org.apache.directory.server:apacheds-core-api:1.5.8-SNAPSHOT
[HUDSON] Archiving <https://hudson.apache.org/hudson/job/dir-apacheds-jdk15-ubuntu-deploy/ws/trunk/core-api/pom.xml>
to /home/hudson/hudson/jobs/dir-apacheds-jdk15-ubuntu-deploy/modules/org.apache.directory.server$apacheds-core-api/builds/2011-01-25_14-39-33/archive/org.apache.directory.server/apacheds-core-api/1.5.8-SNAPSHOT/pom.xml
sessionEnded
[INFO] ------------------------------------------------------------------------
[INFO] Reactor Summary:
[INFO] 
[INFO] ApacheDS .......................................... SUCCESS [18.450s]
[INFO] ApacheDS I18n ..................................... SUCCESS [15.104s]
[INFO] ApacheDS Core Constants ........................... SUCCESS [11.398s]
[INFO] ApacheDS Core API ................................. FAILURE [3.883s]
[INFO] ApacheDS Core ..................................... SKIPPED
[INFO] ApacheDS Core AVL ................................. SKIPPED
[INFO] ApacheDS Generalized (X) DBM Partition ............ SKIPPED
[INFO] ApacheDS LDIF Partition ........................... SKIPPED
[INFO] ApacheDS JDBM implementation ...................... SKIPPED
[INFO] ApacheDS JDBM Partition ........................... SKIPPED
[INFO] ApacheDS Core Annotations ......................... SKIPPED
[INFO] ApacheDS Core JNDI ................................ SKIPPED
[INFO] ApacheDS Protocol Shared .......................... SKIPPED
[INFO] ApacheDS Protocol Kerberos Codec .................. SKIPPED
[INFO] ApacheDS Interceptors for Kerberos ................ SKIPPED
[INFO] ApacheDS Protocol Dhcp ............................ SKIPPED
[INFO] ApacheDS Protocol Dns ............................. SKIPPED
[INFO] ApacheDS Protocol Kerberos ........................ SKIPPED
[INFO] ApacheDS Protocol Ldap ............................ SKIPPED
[INFO] ApacheDS Protocol Ntp ............................. SKIPPED
[INFO] Apacheds Server Annotations ....................... SKIPPED
[INFO] ApacheDS Server Config ............................ SKIPPED
[INFO] ApacheDS Server JNDI .............................. SKIPPED
[INFO] ApacheDS Server Replication Service ............... SKIPPED
[INFO] ApacheDS Test Framework ........................... SKIPPED
[INFO] ApacheDS Generalized (X) DBM Tools ................ SKIPPED
[INFO] ApacheDS All ...................................... SKIPPED
[INFO] ApacheDS Core Integration ......................... SKIPPED
[INFO] ApacheDS Server Integration ....................... SKIPPED
[INFO] ApacheDS DirectoryService-WebApp bridge ........... SKIPPED
[INFO] ApacheDS Jetty HTTP Server Integration ............ SKIPPED
[INFO] ApacheDS Service Builder .......................... SKIPPED
[INFO] ApacheDS Protocol Kerberos Test ................... SKIPPED
[INFO] Apache Directory LDAP Client API test ............. SKIPPED
[INFO] ApacheDS Service .................................. SKIPPED
[INFO] ApacheDS Wrapper .................................. SKIPPED
[INFO] ------------------------------------------------------------------------
[INFO] BUILD FAILURE
[INFO] ------------------------------------------------------------------------
[INFO] Total time: 55.825s
[INFO] Finished at: Tue Jan 25 14:40:51 UTC 2011
[INFO] Final Memory: 22M/66M
[INFO] ------------------------------------------------------------------------
mavenExecutionResult exceptions not empty
org.apache.maven.lifecycle.LifecycleExecutionException: Failed to execute goal org.apache.maven.plugins:maven-compiler-plugin:2.3.2:compile
(default-compile) on project apacheds-core-api: Compilation failure
	at org.apache.maven.lifecycle.internal.MojoExecutor.execute(MojoExecutor.java:213)
	at org.apache.maven.lifecycle.internal.MojoExecutor.execute(MojoExecutor.java:153)
	at org.apache.maven.lifecycle.internal.MojoExecutor.execute(MojoExecutor.java:145)
	at org.apache.maven.lifecycle.internal.LifecycleModuleBuilder.buildProject(LifecycleModuleBuilder.java:84)
	at org.apache.maven.lifecycle.internal.LifecycleModuleBuilder.buildProject(LifecycleModuleBuilder.java:59)
	at org.apache.maven.lifecycle.internal.LifecycleStarter.singleThreadedBuild(LifecycleStarter.java:183)
	at org.apache.maven.lifecycle.internal.LifecycleStarter.execute(LifecycleStarter.java:161)
	at org.apache.maven.DefaultMaven.doExecute(DefaultMaven.java:319)
	at org.apache.maven.DefaultMaven.execute(DefaultMaven.java:156)
	at org.jvnet.hudson.maven3.launcher.Maven3Launcher.main(Maven3Launcher.java:79)
	at sun.reflect.NativeMethodAccessorImpl.invoke0(Native Method)
	at sun.reflect.NativeMethodAccessorImpl.invoke(NativeMethodAccessorImpl.java:39)
	at sun.reflect.DelegatingMethodAccessorImpl.invoke(DelegatingMethodAccessorImpl.java:25)
	at java.lang.reflect.Method.invoke(Method.java:592)
	at org.codehaus.plexus.classworlds.launcher.Launcher.launchStandard(Launcher.java:329)
	at org.codehaus.plexus.classworlds.launcher.Launcher.launch(Launcher.java:239)
	at org.jvnet.hudson.maven3.agent.Maven3Main.launch(Maven3Main.java:145)
	at hudson.maven.Maven3Builder.call(Maven3Builder.java:124)
	at hudson.maven.Maven3Builder.call(Maven3Builder.java:71)
	at hudson.remoting.UserRequest.perform(UserRequest.java:114)
	at hudson.remoting.UserRequest.perform(UserRequest.java:48)
	at hudson.remoting.Request$2.run(Request.java:270)
	at java.util.concurrent.Executors$RunnableAdapter.call(Executors.java:417)
	at java.util.concurrent.FutureTask$Sync.innerRun(FutureTask.java:269)
	at java.util.concurrent.FutureTask.run(FutureTask.java:123)
	at java.util.concurrent.ThreadPoolExecutor$Worker.runTask(ThreadPoolExecutor.java:651)
	at java.util.concurrent.ThreadPoolExecutor$Worker.run(ThreadPoolExecutor.java:676)
	at java.lang.Thread.run(Thread.java:595)
Caused by: org.apache.maven.plugin.CompilationFailureException: Compilation failure
	at org.apache.maven.plugin.AbstractCompilerMojo.execute(AbstractCompilerMojo.java:656)
	at org.apache.maven.plugin.CompilerMojo.execute(CompilerMojo.java:128)
	at org.apache.maven.plugin.DefaultBuildPluginManager.executeMojo(DefaultBuildPluginManager.java:107)
	at org.apache.maven.lifecycle.internal.MojoExecutor.execute(MojoExecutor.java:209)
	... 27 more
Sending e-mails to: notifications@directory.apache.org
channel stopped


Mime
View raw message