directory-notifications mailing list archives

Site index · List index
Message view « Date » · « Thread »
Top « Date » · « Thread »
From Apache Hudson Server <hud...@hudson.apache.org>
Subject Build failed in Hudson: dir-studio-jdk16-win #134
Date Mon, 24 Jan 2011 04:07:10 GMT
See <https://hudson.apache.org/hudson/job/dir-studio-jdk16-win/134/changes>

Changes:

[akarasulu] moving schema parsers, their tests, under model area

[akarasulu] moving schema registry classes into model area

[akarasulu] moving schema elements

[akarasulu] moving constants into oadsl.model

[akarasulu] Shared refactoring continued ...

  o removing dependencies
  o moving shared oadsl.name to oadsl.model.name
  o manually updated name parser files to reflect changes

[akarasulu] Shared refactoring continued ...

  o moved filter classes and interfaces into oadsl.model.filter pkg
  o removed any codec related dependencies

[akarasulu] moving entry classes over to model area

[akarasulu] Shared refactoring continued ...
 
  o removed ldif pkg dependencies to codec
  o moved ldif pkg over to oadsl.model.ldif

[akarasulu] Moved cursor package from base oadsl to oadsl.model;

[akarasulu] Shared refactoring continued ...

  o created model packages moving control into model.message
  o cleaned up some blah.java class - bogus

[akarasulu] Shared refactoring continued ...

 o creating model base package off of oadsl to move classes their
   before moving the structure over to it's own module
 o fixed some issue that resulted from schema resource files not 
   being found in OpenLDAP schema file format parser

[akarasulu] Shared refactoring continued ...

  o removed materials from shared ldap for new shared schema converter bundle
  o updated studio build to use this new bundle 
  o still need Pierre to take a look here and see if I did this correctly wrt
    the studio build's way of doing things

------------------------------------------
[...truncated 1187 lines...]
[INFO] Using 'UTF-8' encoding to copy filtered resources.
[INFO] skip non existing resourceDirectory C:\hudson\hudson-slave\workspace\dir-studio-jdk16-win\trunk\libraries\org.apache.mina.core\src\test\resources
[INFO] Copying 3 resources
[INFO] [compiler:testCompile {execution: default-testCompile}]
[INFO] No sources to compile
[INFO] [surefire:test {execution: default-test}]
[INFO] Tests are skipped.
[INFO] [jar:jar {execution: default-jar}]
[INFO] Building jar: C:\hudson\hudson-slave\workspace\dir-studio-jdk16-win\trunk\libraries\org.apache.mina.core\target\org.apache.mina.core-2.0.1.jar
[INFO] [tools:verify-legal-files {execution: verify-legal-files}]
[INFO] Checking legal files in: org.apache.mina.core-2.0.1.jar
[INFO] [install:install {execution: default-install}]
[INFO] Installing C:\hudson\hudson-slave\workspace\dir-studio-jdk16-win\trunk\libraries\org.apache.mina.core\target\org.apache.mina.core-2.0.1.jar
to C:\Users\hudson\.m2\repository\org\apache\directory\studio\org.apache.mina.core\2.0.1\org.apache.mina.core-2.0.1.jar
[HUDSON] Archiving disabled - not archiving C:\hudson\hudson-slave\workspace\dir-studio-jdk16-win\trunk\libraries\org.apache.mina.core\pom.xml
[HUDSON] Archiving disabled - not archiving C:\hudson\hudson-slave\workspace\dir-studio-jdk16-win\trunk\libraries\org.apache.mina.core\target\org.apache.mina.core-2.0.1.jar
[INFO] ------------------------------------------------------------------------
[INFO] Building dom4j (for Apache Directory Studio)
[INFO]    task-segment: [clean, install]
[INFO] ------------------------------------------------------------------------
[INFO] [clean:clean {execution: default-clean}]
[INFO] Deleting C:\hudson\hudson-slave\workspace\dir-studio-jdk16-win\trunk\libraries\org.dom4j.dom4j\target
[INFO] [remote-resources:process {execution: default}]
[INFO] [resources:resources {execution: default-resources}]
[INFO] Using 'UTF-8' encoding to copy filtered resources.
[INFO] skip non existing resourceDirectory C:\hudson\hudson-slave\workspace\dir-studio-jdk16-win\trunk\libraries\org.dom4j.dom4j\src\main\resources
[INFO] Copying 3 resources
[INFO] [studio:prepare-jar-package {execution: default}]
[INFO] Copying C:\Users\hudson\.m2\repository\dom4j\dom4j\1.6.1\dom4j-1.6.1.jar to
               C:\hudson\hudson-slave\workspace\dir-studio-jdk16-win\trunk\libraries\org.dom4j.dom4j\target\classes\lib\dom4j-1.6.1.jar
[INFO] [compiler:compile {execution: default-compile}]
[INFO] No sources to compile
[INFO] [bundle:manifest {execution: generate-manifest}]
[WARNING] Warning in manifest for org.apache.directory.studio:org.dom4j.dom4j:jar:1.6.1 :
Did not find matching referal for !
[INFO] [resources:testResources {execution: default-testResources}]
[INFO] Using 'UTF-8' encoding to copy filtered resources.
[INFO] skip non existing resourceDirectory C:\hudson\hudson-slave\workspace\dir-studio-jdk16-win\trunk\libraries\org.dom4j.dom4j\src\test\resources
[INFO] Copying 3 resources
[INFO] [compiler:testCompile {execution: default-testCompile}]
[INFO] No sources to compile
[INFO] [surefire:test {execution: default-test}]
[INFO] Tests are skipped.
[INFO] [jar:jar {execution: default-jar}]
[INFO] Building jar: C:\hudson\hudson-slave\workspace\dir-studio-jdk16-win\trunk\libraries\org.dom4j.dom4j\target\org.dom4j.dom4j-1.6.1.jar
[INFO] [tools:verify-legal-files {execution: verify-legal-files}]
[INFO] Checking legal files in: org.dom4j.dom4j-1.6.1.jar
[INFO] [install:install {execution: default-install}]
[INFO] Installing C:\hudson\hudson-slave\workspace\dir-studio-jdk16-win\trunk\libraries\org.dom4j.dom4j\target\org.dom4j.dom4j-1.6.1.jar
to C:\Users\hudson\.m2\repository\org\apache\directory\studio\org.dom4j.dom4j\1.6.1\org.dom4j.dom4j-1.6.1.jar
[HUDSON] Archiving disabled - not archiving C:\hudson\hudson-slave\workspace\dir-studio-jdk16-win\trunk\libraries\org.dom4j.dom4j\pom.xml
[HUDSON] Archiving disabled - not archiving C:\hudson\hudson-slave\workspace\dir-studio-jdk16-win\trunk\libraries\org.dom4j.dom4j\target\org.dom4j.dom4j-1.6.1.jar
[INFO] ------------------------------------------------------------------------
[INFO] Building SLF4J LOG4J-12 Binding (for Apache Directory Studio)
[INFO]    task-segment: [clean, install]
[INFO] ------------------------------------------------------------------------
[INFO] [clean:clean {execution: default-clean}]
[INFO] Deleting C:\hudson\hudson-slave\workspace\dir-studio-jdk16-win\trunk\libraries\org.slf4j.log4j12\target
[INFO] [remote-resources:process {execution: default}]
[INFO] [resources:resources {execution: default-resources}]
[INFO] Using 'UTF-8' encoding to copy filtered resources.
[INFO] skip non existing resourceDirectory C:\hudson\hudson-slave\workspace\dir-studio-jdk16-win\trunk\libraries\org.slf4j.log4j12\src\main\resources
[INFO] Copying 3 resources
[INFO] [studio:prepare-jar-package {execution: default}]
[INFO] Copying C:\Users\hudson\.m2\repository\org\slf4j\slf4j-log4j12\1.5.6\slf4j-log4j12-1.5.6.jar
to
               C:\hudson\hudson-slave\workspace\dir-studio-jdk16-win\trunk\libraries\org.slf4j.log4j12\target\classes\lib\slf4j-log4j12-1.5.6.jar
[INFO] [compiler:compile {execution: default-compile}]
[INFO] No sources to compile
[INFO] [bundle:manifest {execution: generate-manifest}]
[WARNING] Warning in manifest for org.apache.directory.studio:org.slf4j.log4j12:jar:1.5.6
: Did not find matching referal for !
[INFO] [resources:testResources {execution: default-testResources}]
[INFO] Using 'UTF-8' encoding to copy filtered resources.
[INFO] skip non existing resourceDirectory C:\hudson\hudson-slave\workspace\dir-studio-jdk16-win\trunk\libraries\org.slf4j.log4j12\src\test\resources
[INFO] Copying 3 resources
[INFO] [compiler:testCompile {execution: default-testCompile}]
[INFO] No sources to compile
[INFO] [surefire:test {execution: default-test}]
[INFO] Tests are skipped.
[INFO] [jar:jar {execution: default-jar}]
[INFO] Building jar: C:\hudson\hudson-slave\workspace\dir-studio-jdk16-win\trunk\libraries\org.slf4j.log4j12\target\org.slf4j.log4j12-1.5.6.jar
[INFO] [tools:verify-legal-files {execution: verify-legal-files}]
[INFO] Checking legal files in: org.slf4j.log4j12-1.5.6.jar
[INFO] [install:install {execution: default-install}]
[INFO] Installing C:\hudson\hudson-slave\workspace\dir-studio-jdk16-win\trunk\libraries\org.slf4j.log4j12\target\org.slf4j.log4j12-1.5.6.jar
to C:\Users\hudson\.m2\repository\org\apache\directory\studio\org.slf4j.log4j12\1.5.6\org.slf4j.log4j12-1.5.6.jar
[HUDSON] Archiving disabled - not archiving C:\hudson\hudson-slave\workspace\dir-studio-jdk16-win\trunk\libraries\org.slf4j.log4j12\pom.xml
[HUDSON] Archiving disabled - not archiving C:\hudson\hudson-slave\workspace\dir-studio-jdk16-win\trunk\libraries\org.slf4j.log4j12\target\org.slf4j.log4j12-1.5.6.jar
[INFO] ------------------------------------------------------------------------
[INFO] Building XPP3 (for Apache Directory Studio)
[INFO]    task-segment: [clean, install]
[INFO] ------------------------------------------------------------------------
[INFO] [clean:clean {execution: default-clean}]
[INFO] Deleting C:\hudson\hudson-slave\workspace\dir-studio-jdk16-win\trunk\libraries\org.xpp3.xpp3\target
[INFO] [remote-resources:process {execution: default}]
[INFO] [resources:resources {execution: default-resources}]
[INFO] Using 'UTF-8' encoding to copy filtered resources.
[INFO] skip non existing resourceDirectory C:\hudson\hudson-slave\workspace\dir-studio-jdk16-win\trunk\libraries\org.xpp3.xpp3\src\main\resources
[INFO] Copying 3 resources
[INFO] [studio:prepare-jar-package {execution: default}]
[INFO] Copying C:\Users\hudson\.m2\repository\xpp3\xpp3\1.1.3.4.O\xpp3-1.1.3.4.O.jar to
               C:\hudson\hudson-slave\workspace\dir-studio-jdk16-win\trunk\libraries\org.xpp3.xpp3\target\classes\lib\xpp3-1.1.3.4.O.jar
[INFO] [compiler:compile {execution: default-compile}]
[INFO] No sources to compile
[INFO] [bundle:manifest {execution: generate-manifest}]
[WARNING] Warning in manifest for org.apache.directory.studio:org.xpp3.xpp3:jar:1.1.340 :
Did not find matching referal for !
[INFO] [resources:testResources {execution: default-testResources}]
[INFO] Using 'UTF-8' encoding to copy filtered resources.
[INFO] skip non existing resourceDirectory C:\hudson\hudson-slave\workspace\dir-studio-jdk16-win\trunk\libraries\org.xpp3.xpp3\src\test\resources
[INFO] Copying 3 resources
[INFO] [compiler:testCompile {execution: default-testCompile}]
[INFO] No sources to compile
[INFO] [surefire:test {execution: default-test}]
[INFO] Tests are skipped.
[INFO] [jar:jar {execution: default-jar}]
[INFO] Building jar: C:\hudson\hudson-slave\workspace\dir-studio-jdk16-win\trunk\libraries\org.xpp3.xpp3\target\org.xpp3.xpp3-1.1.340.jar
[INFO] [tools:verify-legal-files {execution: verify-legal-files}]
[INFO] Checking legal files in: org.xpp3.xpp3-1.1.340.jar
[INFO] [install:install {execution: default-install}]
[INFO] Installing C:\hudson\hudson-slave\workspace\dir-studio-jdk16-win\trunk\libraries\org.xpp3.xpp3\target\org.xpp3.xpp3-1.1.340.jar
to C:\Users\hudson\.m2\repository\org\apache\directory\studio\org.xpp3.xpp3\1.1.340\org.xpp3.xpp3-1.1.340.jar
[HUDSON] Archiving disabled - not archiving C:\hudson\hudson-slave\workspace\dir-studio-jdk16-win\trunk\libraries\org.xpp3.xpp3\pom.xml
[HUDSON] Archiving disabled - not archiving C:\hudson\hudson-slave\workspace\dir-studio-jdk16-win\trunk\libraries\org.xpp3.xpp3\target\org.xpp3.xpp3-1.1.340.jar
[INFO] ------------------------------------------------------------------------
[INFO] Building Apache Directory Studio Plugins
[INFO]    task-segment: [clean, install]
[INFO] ------------------------------------------------------------------------
[INFO] [clean:clean {execution: default-clean}]
[INFO] Deleting C:\hudson\hudson-slave\workspace\dir-studio-jdk16-win\trunk\plugins\target
[INFO] [remote-resources:process {execution: default}]
[INFO] [site:attach-descriptor {execution: default-attach-descriptor}]
[INFO] [tools:verify-legal-files {execution: verify-legal-files}]
[INFO] [install:install {execution: default-install}]
[INFO] Installing C:\hudson\hudson-slave\workspace\dir-studio-jdk16-win\trunk\plugins\pom.xml
to C:\Users\hudson\.m2\repository\org\apache\directory\studio\parent-plugins\2.0.0-SNAPSHOT\parent-plugins-2.0.0-SNAPSHOT.pom
[INFO] Installing C:\hudson\hudson-slave\workspace\dir-studio-jdk16-win\trunk\plugins\target\parent-plugins-2.0.0-SNAPSHOT-site.xml
to C:\Users\hudson\.m2\repository\org\apache\directory\studio\parent-plugins\2.0.0-SNAPSHOT\parent-plugins-2.0.0-SNAPSHOT-site.xml
[HUDSON] Archiving disabled - not archiving C:\hudson\hudson-slave\workspace\dir-studio-jdk16-win\trunk\plugins\pom.xml
[HUDSON] Archiving disabled - not archiving C:\Users\hudson\.m2\repository\org\apache\directory\studio\parent-plugins\2.0.0-SNAPSHOT\parent-plugins-2.0.0-SNAPSHOT.pom
[HUDSON] Archiving disabled - not archiving C:\hudson\hudson-slave\workspace\dir-studio-jdk16-win\trunk\plugins\target\parent-plugins-2.0.0-SNAPSHOT-site.xml
[INFO] ------------------------------------------------------------------------
[INFO] Building Apache Directory Studio Common UI
[INFO]    task-segment: [clean, install]
[INFO] ------------------------------------------------------------------------
[INFO] [clean:clean {execution: default-clean}]
[INFO] Deleting C:\hudson\hudson-slave\workspace\dir-studio-jdk16-win\trunk\plugins\common.ui\target
[INFO] [remote-resources:process {execution: default}]
[INFO] [resources:resources {execution: default-resources}]
[INFO] Using 'UTF-8' encoding to copy filtered resources.
[INFO] Copying 2 resources
[INFO] Copying 1 resource to resources
[INFO] skip non existing resourceDirectory C:\hudson\hudson-slave\workspace\dir-studio-jdk16-win\trunk\plugins\common.ui\src\main\resources
[INFO] Copying 3 resources
[INFO] Copying 3 resources
[INFO] [studio:prepare-jar-package {execution: default}]
[INFO] [compiler:compile {execution: default-compile}]
[INFO] Compiling 8 source files to C:\hudson\hudson-slave\workspace\dir-studio-jdk16-win\trunk\plugins\common.ui\target\classes
[INFO] [bundle:manifest {execution: generate-manifest}]
[WARNING] Warning in manifest for org.apache.directory.studio:common.ui:jar:2.0.0-SNAPSHOT
: Did not find matching referal for !
[INFO] [resources:testResources {execution: default-testResources}]
[INFO] Using 'UTF-8' encoding to copy filtered resources.
[INFO] skip non existing resourceDirectory C:\hudson\hudson-slave\workspace\dir-studio-jdk16-win\trunk\plugins\common.ui\src\test\resources
[INFO] Copying 3 resources
[INFO] [compiler:testCompile {execution: default-testCompile}]
[INFO] No sources to compile
[INFO] [surefire:test {execution: default-test}]
[INFO] Tests are skipped.
[INFO] [jar:jar {execution: default-jar}]
[INFO] Building jar: C:\hudson\hudson-slave\workspace\dir-studio-jdk16-win\trunk\plugins\common.ui\target\common.ui-2.0.0-SNAPSHOT.jar
[INFO] [tools:verify-legal-files {execution: verify-legal-files}]
[INFO] Checking legal files in: common.ui-2.0.0-SNAPSHOT.jar
[INFO] [install:install {execution: default-install}]
[INFO] Installing C:\hudson\hudson-slave\workspace\dir-studio-jdk16-win\trunk\plugins\common.ui\target\common.ui-2.0.0-SNAPSHOT.jar
to C:\Users\hudson\.m2\repository\org\apache\directory\studio\common.ui\2.0.0-SNAPSHOT\common.ui-2.0.0-SNAPSHOT.jar
[HUDSON] Archiving disabled - not archiving C:\hudson\hudson-slave\workspace\dir-studio-jdk16-win\trunk\plugins\common.ui\pom.xml
[HUDSON] Archiving disabled - not archiving C:\hudson\hudson-slave\workspace\dir-studio-jdk16-win\trunk\plugins\common.ui\target\common.ui-2.0.0-SNAPSHOT.jar
[INFO] ------------------------------------------------------------------------
[INFO] Building Apache Directory Studio Common Core
[INFO]    task-segment: [clean, install]
[INFO] ------------------------------------------------------------------------
[INFO] [clean:clean {execution: default-clean}]
[INFO] Deleting C:\hudson\hudson-slave\workspace\dir-studio-jdk16-win\trunk\plugins\common.core\target
[INFO] [remote-resources:process {execution: default}]
[INFO] [resources:resources {execution: default-resources}]
[INFO] Using 'UTF-8' encoding to copy filtered resources.
[INFO] Copying 1 resource
[INFO] Copying 3 resources
[INFO] Copying 3 resources
[INFO] [studio:prepare-jar-package {execution: default}]
[INFO] [compiler:compile {execution: default-compile}]
[INFO] Compiling 7 source files to C:\hudson\hudson-slave\workspace\dir-studio-jdk16-win\trunk\plugins\common.core\target\classes
[INFO] [bundle:manifest {execution: generate-manifest}]
[WARNING] Warning in manifest for org.apache.directory.studio:common.core:jar:2.0.0-SNAPSHOT
: Did not find matching referal for !
[INFO] [resources:testResources {execution: default-testResources}]
[INFO] Using 'UTF-8' encoding to copy filtered resources.
[INFO] Copying 0 resource
[INFO] Copying 3 resources
[INFO] [compiler:testCompile {execution: default-testCompile}]
[INFO] Nothing to compile - all classes are up to date
[INFO] [surefire:test {execution: default-test}]
[INFO] Tests are skipped.
[INFO] [jar:jar {execution: default-jar}]
[INFO] Building jar: C:\hudson\hudson-slave\workspace\dir-studio-jdk16-win\trunk\plugins\common.core\target\common.core-2.0.0-SNAPSHOT.jar
[INFO] [tools:verify-legal-files {execution: verify-legal-files}]
[INFO] Checking legal files in: common.core-2.0.0-SNAPSHOT.jar
[INFO] [install:install {execution: default-install}]
[INFO] Installing C:\hudson\hudson-slave\workspace\dir-studio-jdk16-win\trunk\plugins\common.core\target\common.core-2.0.0-SNAPSHOT.jar
to C:\Users\hudson\.m2\repository\org\apache\directory\studio\common.core\2.0.0-SNAPSHOT\common.core-2.0.0-SNAPSHOT.jar
[HUDSON] Archiving disabled - not archiving C:\hudson\hudson-slave\workspace\dir-studio-jdk16-win\trunk\plugins\common.core\pom.xml
[HUDSON] Archiving disabled - not archiving C:\hudson\hudson-slave\workspace\dir-studio-jdk16-win\trunk\plugins\common.core\target\common.core-2.0.0-SNAPSHOT.jar
[INFO] ------------------------------------------------------------------------
[INFO] Building Apache Directory Studio LDIF Parser
[INFO]    task-segment: [clean, install]
[INFO] ------------------------------------------------------------------------
[INFO] [clean:clean {execution: default-clean}]
[INFO] Deleting C:\hudson\hudson-slave\workspace\dir-studio-jdk16-win\trunk\plugins\ldifparser\target
[INFO] [remote-resources:process {execution: default}]
[INFO] [resources:resources {execution: default-resources}]
[INFO] Using 'UTF-8' encoding to copy filtered resources.
[INFO] skip non existing resourceDirectory C:\hudson\hudson-slave\workspace\dir-studio-jdk16-win\trunk\plugins\ldifparser\src\main\resources
[INFO] Copying 3 resources
[INFO] [studio:prepare-jar-package {execution: default}]
[INFO] [compiler:compile {execution: default-compile}]
[INFO] Compiling 41 source files to C:\hudson\hudson-slave\workspace\dir-studio-jdk16-win\trunk\plugins\ldifparser\target\classes
[INFO] -------------------------------------------------------------
[ERROR] COMPILATION ERROR : 
[INFO] -------------------------------------------------------------
[ERROR] \hudson\hudson-slave\workspace\dir-studio-jdk16-win\trunk\plugins\ldifparser\src\main\java\org\apache\directory\studio\ldifparser\model\lines\LdifDnLine.java:[24,50]
package org.apache.directory.shared.ldap.model.name does not exist
[ERROR] \hudson\hudson-slave\workspace\dir-studio-jdk16-win\trunk\plugins\ldifparser\src\main\java\org\apache\directory\studio\ldifparser\model\lines\LdifDnLine.java:[78,34]
cannot find symbol
symbol  : variable Dn
location: class org.apache.directory.studio.ldifparser.model.lines.LdifDnLine
[ERROR] \hudson\hudson-slave\workspace\dir-studio-jdk16-win\trunk\plugins\ldifparser\src\main\java\org\apache\directory\studio\ldifparser\model\lines\LdifDnLine.java:[92,19]
cannot find symbol
symbol  : variable Dn
location: class org.apache.directory.studio.ldifparser.model.lines.LdifDnLine
[INFO] 3 errors 
[INFO] -------------------------------------------------------------
[HUDSON] Archiving disabled - not archiving C:\hudson\hudson-slave\workspace\dir-studio-jdk16-win\trunk\plugins\ldifparser\pom.xml
[INFO] ------------------------------------------------------------------------
[ERROR] BUILD FAILURE
[INFO] ------------------------------------------------------------------------
[INFO] Compilation failure

\hudson\hudson-slave\workspace\dir-studio-jdk16-win\trunk\plugins\ldifparser\src\main\java\org\apache\directory\studio\ldifparser\model\lines\LdifDnLine.java:[24,50]
package org.apache.directory.shared.ldap.model.name does not exist
\hudson\hudson-slave\workspace\dir-studio-jdk16-win\trunk\plugins\ldifparser\src\main\java\org\apache\directory\studio\ldifparser\model\lines\LdifDnLine.java:[78,34]
cannot find symbol
symbol  : variable Dn
location: class org.apache.directory.studio.ldifparser.model.lines.LdifDnLine
\hudson\hudson-slave\workspace\dir-studio-jdk16-win\trunk\plugins\ldifparser\src\main\java\org\apache\directory\studio\ldifparser\model\lines\LdifDnLine.java:[92,19]
cannot find symbol
symbol  : variable Dn
location: class org.apache.directory.studio.ldifparser.model.lines.LdifDnLine

[INFO] ------------------------------------------------------------------------
[INFO] For more information, run Maven with the -e switch
[INFO] ------------------------------------------------------------------------
[INFO] Total time: 2 minutes 13 seconds
[INFO] Finished at: Mon Jan 24 04:07:07 GMT 2011
[INFO] Final Memory: 160M/332M
[INFO] ------------------------------------------------------------------------
Sending e-mails to: notifications@directory.apache.org
channel stopped


Mime
View raw message