directory-notifications mailing list archives

Site index · List index
Message view « Date » · « Thread »
Top « Date » · « Thread »
From Apache Hudson Server <hud...@hudson.apache.org>
Subject Build failed in Hudson: dir-shared-jdk15-ubuntu-deploy #169
Date Sat, 29 Jan 2011 03:33:22 GMT
See <https://hudson.apache.org/hudson/job/dir-shared-jdk15-ubuntu-deploy/169/changes>

Changes:

[akarasulu] cleaning up: formatting, spelling, dead code removal

[elecharny] Refactored the decorators :
o the Decorator interface has been created
o the computeLength() and encode() methods have been added to each message

[pamarcelot] Fixed typos.

[pamarcelot] Fixed a bug where the attribute type was not return correctly its syntax name
(in case the embedded syntax object is null).

[elecharny] Removed the useless LdapMesageDecorator class

[elecharny] Removed the redundant LdapRequestDecorator and LdapResponseDecorator classes

[elecharny] o Fixed the way we handled decorators in the LdapGrammar : we now create new decorators
around plain messages all over the grammar.
o Did the same for LdapResultDecorators

------------------------------------------
[...truncated 471 lines...]
projectSucceeded org.apache.directory.shared:shared-asn1-api:0.9.20-SNAPSHOT
[HUDSON] Archiving <https://hudson.apache.org/hudson/job/dir-shared-jdk15-ubuntu-deploy/ws/trunk/asn1-api/pom.xml>
to /home/hudson/hudson/jobs/dir-shared-jdk15-ubuntu-deploy/modules/org.apache.directory.shared$shared-asn1-api/builds/2011-01-29_03-31-34/archive/org.apache.directory.shared/shared-asn1-api/0.9.20-SNAPSHOT/pom.xml
[HUDSON] Archiving <https://hudson.apache.org/hudson/job/dir-shared-jdk15-ubuntu-deploy/ws/trunk/asn1-api/target/shared-asn1-api-0.9.20-SNAPSHOT.jar>
to /home/hudson/hudson/jobs/dir-shared-jdk15-ubuntu-deploy/modules/org.apache.directory.shared$shared-asn1-api/builds/2011-01-29_03-31-34/archive/org.apache.directory.shared/shared-asn1-api/0.9.20-20110129.033254-13/shared-asn1-api-0.9.20-SNAPSHOT.jar
[INFO]                                                                         
[INFO] ------------------------------------------------------------------------
[INFO] [INFO] Deleting <https://hudson.apache.org/hudson/job/dir-shared-jdk15-ubuntu-deploy/ws/trunk/asn1-ber/target>
Building Apache Directory Shared ASN.1 BER 0.9.20-SNAPSHOT
[INFO] ------------------------------------------------------------------------
[INFO] 
[INFO] --- maven-clean-plugin:2.4.1:clean (default-clean) @ shared-asn1-ber ---
[INFO] 
[INFO] --- maven-remote-resources-plugin:1.1:process (default) @ shared-asn1-ber ---
[INFO] [INFO] Using 'UTF-8' encoding to copy filtered resources.
[INFO] Copying 0 resource
[INFO] Copying 3 resources

[INFO] --- maven-resources-plugin:2.4.3:resources (default-resources) @ shared-asn1-ber ---
[INFO] 
[INFO] --- maven-compiler-plugin:2.3.2:compile (default-compile) @ shared-asn1-ber ---
[INFO] Compiling 24 source files to <https://hudson.apache.org/hudson/job/dir-shared-jdk15-ubuntu-deploy/ws/trunk/asn1-ber/target/classes>
[INFO] [INFO] Using 'UTF-8' encoding to copy filtered resources.
[INFO] Copying 0 resource
[INFO] Copying 3 resources

[INFO] --- maven-resources-plugin:2.4.3:testResources (default-testResources) @ shared-asn1-ber
---
[INFO] 
[INFO] --- maven-compiler-plugin:2.3.2:testCompile (default-testCompile) @ shared-asn1-ber
---[INFO] Compiling 3 source files to <https://hudson.apache.org/hudson/job/dir-shared-jdk15-ubuntu-deploy/ws/trunk/asn1-ber/target/test-classes>

[INFO] [INFO] Surefire report directory: <https://hudson.apache.org/hudson/job/dir-shared-jdk15-ubuntu-deploy/ws/trunk/asn1-ber/target/surefire-reports>

[INFO] --- maven-surefire-plugin:2.6:test (default-test) @ shared-asn1-ber ---

-------------------------------------------------------
 T E S T S
-------------------------------------------------------
Running org.apache.directory.shared.asn1.ber.tlv.PrimitivesTest
Tests run: 1, Failures: 0, Errors: 0, Skipped: 0, Time elapsed: 0.088 sec
Running org.apache.directory.shared.asn1.ber.tlv.LengthTest
Tests run: 2, Failures: 0, Errors: 0, Skipped: 0, Time elapsed: 0.008 sec
Running org.apache.directory.shared.asn1.ber.tlv.ValueTest
Tests run: 11, Failures: 0, Errors: 0, Skipped: 0, Time elapsed: 0.017 sec

Results :

Tests run: 14, Failures: 0, Errors: 0, Skipped: 0

[HUDSON] Recording test results
[INFO] 
[INFO] --- maven-bundle-plugin:2.1.0:bundle (default-bundle) @ shared-asn1-ber ---
[INFO] [INFO] Checking legal files in: shared-asn1-ber-0.9.20-SNAPSHOT.jar

[INFO] --- tools-maven-plugin:1.4:verify-legal-files (verify-legal-files) @ shared-asn1-ber
---
[INFO] [INFO] Installing <https://hudson.apache.org/hudson/job/dir-shared-jdk15-ubuntu-deploy/ws/trunk/asn1-ber/target/shared-asn1-ber-0.9.20-SNAPSHOT.jar>
to /home/hudson/.m2/repository/org/apache/directory/shared/shared-asn1-ber/0.9.20-SNAPSHOT/shared-asn1-ber-0.9.20-SNAPSHOT.jar
[INFO] Installing <https://hudson.apache.org/hudson/job/dir-shared-jdk15-ubuntu-deploy/ws/trunk/asn1-ber/pom.xml>
to /home/hudson/.m2/repository/org/apache/directory/shared/shared-asn1-ber/0.9.20-SNAPSHOT/shared-asn1-ber-0.9.20-SNAPSHOT.pom

[INFO] --- maven-install-plugin:2.3.1:install (default-install) @ shared-asn1-ber ---
[INFO] [WARNING] Exception while updating local OBR: Unable to read repository xml: file:/home/hudson/.m2/repository/repository.xml
org.apache.maven.plugin.MojoExecutionException: Unable to read repository xml: file:/home/hudson/.m2/repository/repository.xml
	at org.apache.felix.obrplugin.ObrUpdate.parseRepositoryXml(ObrUpdate.java:295)
	at org.apache.felix.obrplugin.ObrInstall.execute(ObrInstall.java:140)
	at org.apache.maven.plugin.DefaultBuildPluginManager.executeMojo(DefaultBuildPluginManager.java:107)
	at org.apache.maven.lifecycle.internal.MojoExecutor.execute(MojoExecutor.java:209)
	at org.apache.maven.lifecycle.internal.MojoExecutor.execute(MojoExecutor.java:153)
	at org.apache.maven.lifecycle.internal.MojoExecutor.execute(MojoExecutor.java:145)
	at org.apache.maven.lifecycle.internal.LifecycleModuleBuilder.buildProject(LifecycleModuleBuilder.java:84)
	at org.apache.maven.lifecycle.internal.LifecycleModuleBuilder.buildProject(LifecycleModuleBuilder.java:59)
	at org.apache.maven.lifecycle.internal.LifecycleStarter.singleThreadedBuild(LifecycleStarter.java:183)
	at org.apache.maven.lifecycle.internal.LifecycleStarter.execute(LifecycleStarter.java:161)
	at org.apache.maven.DefaultMaven.doExecute(DefaultMaven.java:319)
	at org.apache.maven.DefaultMaven.execute(DefaultMaven.java:156)
	at org.jvnet.hudson.maven3.launcher.Maven3Launcher.main(Maven3Launcher.java:79)
	at sun.reflect.NativeMethodAccessorImpl.invoke0(Native Method)
	at sun.reflect.NativeMethodAccessorImpl.invoke(NativeMethodAccessorImpl.java:39)
	at sun.reflect.DelegatingMethodAccessorImpl.invoke(DelegatingMethodAccessorImpl.java:25)
	at java.lang.reflect.Method.invoke(Method.java:592)
	at org.codehaus.plexus.classworlds.launcher.Launcher.launchStandard(Launcher.java:329)
	at org.codehaus.plexus.classworlds.launcher.Launcher.launch(Launcher.java:239)
	at org.jvnet.hudson.maven3.agent.Maven3Main.launch(Maven3Main.java:145)
	at hudson.maven.Maven3Builder.call(Maven3Builder.java:124)

	at hudson.maven.Maven3Builder.call(Maven3Builder.java:71)
[INFO] 	at hudson.remoting.UserRequest.perform(UserRequest.java:114)
	at hudson.remoting.UserRequest.perform(UserRequest.java:48)
	at hudson.remoting.Request$2.run(Request.java:270)
	at java.util.concurrent.Executors$RunnableAdapter.call(Executors.java:417)
--- maven-bundle-plugin:2.1.0:install (default-install) @ shared-asn1-ber ---
	at java.util.concurrent.FutureTask$Sync.innerRun(FutureTask.java:269)
	at java.util.concurrent.FutureTask.run(FutureTask.java:123)
	at java.util.concurrent.ThreadPoolExecutor$Worker.runTask(ThreadPoolExecutor.java:651)
	at java.util.concurrent.ThreadPoolExecutor$Worker.run(ThreadPoolExecutor.java:676)
	at java.lang.Thread.run(Thread.java:595)
Caused by: org.xmlpull.v1.XmlPullParserException: unexpected type (position:END_DOCUMENT null@3:1
in java.io.InputStreamReader@1117da8) 
	at org.kxml2.io.KXmlParser.exception(Unknown Source)
	at org.kxml2.io.KXmlParser.nextTag(Unknown Source)
	at org.apache.felix.bundlerepository.impl.PullParser.parseRepository(PullParser.java:43)
	at org.apache.felix.bundlerepository.impl.DataModelHelperImpl.repository(DataModelHelperImpl.java:147)
	at org.apache.felix.bundlerepository.impl.DataModelHelperImpl.repository(DataModelHelperImpl.java:118)
	at org.apache.felix.obrplugin.ObrUpdate.parseRepositoryXml(ObrUpdate.java:291)
	... 30 more
[INFO] Downloading: https://repository.apache.org/content/repositories/snapshots/org/apache/directory/shared/shared-asn1-ber/0.9.20-SNAPSHOT/maven-metadata.xml

[INFO] --- maven-deploy-plugin:2.5:deploy (default-deploy) @ shared-asn1-ber ---
Downloaded: https://repository.apache.org/content/repositories/snapshots/org/apache/directory/shared/shared-asn1-ber/0.9.20-SNAPSHOT/maven-metadata.xml
(798 B at 1.3 KB/sec)
Uploading: https://repository.apache.org/content/repositories/snapshots/org/apache/directory/shared/shared-asn1-ber/0.9.20-SNAPSHOT/shared-asn1-ber-0.9.20-20110129.033303-13.jar
Uploaded: https://repository.apache.org/content/repositories/snapshots/org/apache/directory/shared/shared-asn1-ber/0.9.20-SNAPSHOT/shared-asn1-ber-0.9.20-20110129.033303-13.jar
(42 KB at 40.7 KB/sec)
Uploading: https://repository.apache.org/content/repositories/snapshots/org/apache/directory/shared/shared-asn1-ber/0.9.20-SNAPSHOT/shared-asn1-ber-0.9.20-20110129.033303-13.pom
Uploaded: https://repository.apache.org/content/repositories/snapshots/org/apache/directory/shared/shared-asn1-ber/0.9.20-SNAPSHOT/shared-asn1-ber-0.9.20-20110129.033303-13.pom
(3 KB at 2.4 KB/sec)
Downloading: https://repository.apache.org/content/repositories/snapshots/org/apache/directory/shared/shared-asn1-ber/maven-metadata.xml
Downloaded: https://repository.apache.org/content/repositories/snapshots/org/apache/directory/shared/shared-asn1-ber/maven-metadata.xml
(303 B at 1.8 KB/sec)
Uploading: https://repository.apache.org/content/repositories/snapshots/org/apache/directory/shared/shared-asn1-ber/0.9.20-SNAPSHOT/maven-metadata.xml
Uploaded: https://repository.apache.org/content/repositories/snapshots/org/apache/directory/shared/shared-asn1-ber/0.9.20-SNAPSHOT/maven-metadata.xml
(798 B at 5.7 KB/sec)
Uploading: https://repository.apache.org/content/repositories/snapshots/org/apache/directory/shared/shared-asn1-ber/maven-metadata.xml
Uploaded: https://repository.apache.org/content/repositories/snapshots/org/apache/directory/shared/shared-asn1-ber/maven-metadata.xml
(303 B at 1.9 KB/sec)
[INFO] [INFO] Remote OBR update disabled (enable with -DremoteOBR)

[INFO] --- maven-bundle-plugin:2.1.0:deploy (default-deploy) @ shared-asn1-ber ---
projectSucceeded org.apache.directory.shared:shared-asn1-ber:0.9.20-SNAPSHOT
[HUDSON] Archiving <https://hudson.apache.org/hudson/job/dir-shared-jdk15-ubuntu-deploy/ws/trunk/asn1-ber/pom.xml>
to /home/hudson/hudson/jobs/dir-shared-jdk15-ubuntu-deploy/modules/org.apache.directory.shared$shared-asn1-ber/builds/2011-01-29_03-31-34/archive/org.apache.directory.shared/shared-asn1-ber/0.9.20-SNAPSHOT/pom.xml
[HUDSON] Archiving <https://hudson.apache.org/hudson/job/dir-shared-jdk15-ubuntu-deploy/ws/trunk/asn1-ber/target/shared-asn1-ber-0.9.20-SNAPSHOT.jar>
to /home/hudson/hudson/jobs/dir-shared-jdk15-ubuntu-deploy/modules/org.apache.directory.shared$shared-asn1-ber/builds/2011-01-29_03-31-34/archive/org.apache.directory.shared/shared-asn1-ber/0.9.20-20110129.033303-13/shared-asn1-ber-0.9.20-SNAPSHOT.jar
[INFO]                                                                         
[INFO] ------------------------------------------------------------------------
[INFO] Building Apache Directory Shared LDAP 0.9.20-SNAPSHOT
[INFO] ------------------------------------------------------------------------
[INFO] Deleting <https://hudson.apache.org/hudson/job/dir-shared-jdk15-ubuntu-deploy/ws/trunk/ldap/target>
[INFO] 
[INFO] --- maven-clean-plugin:2.4.1:clean (default-clean) @ shared-ldap ---
[INFO] 
[INFO] --- maven-antrun-plugin:1.5:run (default) @ shared-ldap ---
[INFO] No ant target defined - SKIPPED
[INFO] 
[INFO] --- antlr-maven-plugin:2.1:generate (default) @ shared-ldap ---
[INFO] Using Antlr grammar: <https://hudson.apache.org/hudson/job/dir-shared-jdk15-ubuntu-deploy/ws/trunk/ldap/src/main/antlr/distinguishedName.g>
ANTLR Parser Generator   Version 2.7.7 (20060906)   1989-2005

[INFO] Using Antlr grammar: <https://hudson.apache.org/hudson/job/dir-shared-jdk15-ubuntu-deploy/ws/trunk/ldap/src/main/antlr/schema.g>
ANTLR Parser Generator   Version 2.7.7 (20060906)   1989-2005

[INFO] Using Antlr grammar: <https://hudson.apache.org/hudson/job/dir-shared-jdk15-ubuntu-deploy/ws/trunk/ldap/src/main/antlr/SubtreeSpecificationChecker.g>
ANTLR Parser Generator   Version 2.7.7 (20060906)   1989-2005

[INFO] Using Antlr grammar: <https://hudson.apache.org/hudson/job/dir-shared-jdk15-ubuntu-deploy/ws/trunk/ldap/src/main/antlr/ACIItemChecker.g>
ANTLR Parser Generator   Version 2.7.7 (20060906)   1989-2005

[INFO] Using Antlr grammar: <https://hudson.apache.org/hudson/job/dir-shared-jdk15-ubuntu-deploy/ws/trunk/ldap/src/main/antlr/schema-qdstring.g>
ANTLR Parser Generator   Version 2.7.7 (20060906)   1989-2005

[INFO] Using Antlr grammar: <https://hudson.apache.org/hudson/job/dir-shared-jdk15-ubuntu-deploy/ws/trunk/ldap/src/main/antlr/schema-extension.g>
ANTLR Parser Generator   Version 2.7.7 (20060906)   1989-2005

[INFO] Using Antlr grammar: <https://hudson.apache.org/hudson/job/dir-shared-jdk15-ubuntu-deploy/ws/trunk/ldap/src/main/antlr/ACIItem.g>
ANTLR Parser Generator   Version 2.7.7 (20060906)   1989-2005

[INFO] Using Antlr grammar: <https://hudson.apache.org/hudson/job/dir-shared-jdk15-ubuntu-deploy/ws/trunk/ldap/src/main/antlr/subtree-specification.g>
ANTLR Parser Generator   Version 2.7.7 (20060906)   1989-2005

[INFO] Using Antlr grammar: <https://hudson.apache.org/hudson/job/dir-shared-jdk15-ubuntu-deploy/ws/trunk/ldap/src/main/antlr/TriggerSpecification.g>
ANTLR Parser Generator   Version 2.7.7 (20060906)   1989-2005

[INFO] Using Antlr grammar: <https://hudson.apache.org/hudson/job/dir-shared-jdk15-ubuntu-deploy/ws/trunk/ldap/src/main/antlr/schema-value.g>
ANTLR Parser Generator   Version 2.7.7 (20060906)   1989-2005

[INFO] 
[INFO] --- maven-remote-resources-plugin:1.1:process (default) @ shared-ldap ---
[INFO] [INFO] Using 'UTF-8' encoding to copy filtered resources.
[INFO] skip non existing resourceDirectory <https://hudson.apache.org/hudson/job/dir-shared-jdk15-ubuntu-deploy/ws/trunk/ldap/src/main/resources>
[INFO] Copying 10 resources
[INFO] Copying 3 resources

[INFO] --- maven-resources-plugin:2.4.3:resources (default-resources) @ shared-ldap ---
[INFO] 
[INFO] --- maven-compiler-plugin:2.3.2:compile (default-compile) @ shared-ldap ---
[INFO] Compiling 706 source files to <https://hudson.apache.org/hudson/job/dir-shared-jdk15-ubuntu-deploy/ws/trunk/ldap/target/classes>
[INFO] -------------------------------------------------------------
[ERROR] COMPILATION ERROR : 
[INFO] -------------------------------------------------------------
[ERROR] <https://hudson.apache.org/hudson/job/dir-shared-jdk15-ubuntu-deploy/ws/trunk/ldap/src/main/java/org/apache/directory/shared/ldap/codec/decorators/MessageDecorator.java>:[183,59]
cannot find symbol
symbol  : method getDecorator(org.apache.directory.shared.ldap.model.message.Control)
location: class org.apache.directory.shared.ldap.codec.controls.ControlDecorator
[ERROR] <https://hudson.apache.org/hudson/job/dir-shared-jdk15-ubuntu-deploy/ws/trunk/ldap/src/main/java/org/apache/directory/shared/ldap/codec/decorators/LdapResultDecorator.java>:[261,40]
computeReferralLength(org.apache.directory.shared.ldap.model.message.Referral) has private
access in org.apache.directory.shared.ldap.codec.LdapEncoder
[ERROR] <https://hudson.apache.org/hudson/job/dir-shared-jdk15-ubuntu-deploy/ws/trunk/ldap/src/main/java/org/apache/directory/shared/ldap/codec/decorators/LdapResultDecorator.java>:[309,23]
encodeReferral(java.nio.ByteBuffer,org.apache.directory.shared.ldap.model.message.Referral)
has private access in org.apache.directory.shared.ldap.codec.LdapEncoder
[ERROR] <https://hudson.apache.org/hudson/job/dir-shared-jdk15-ubuntu-deploy/ws/trunk/ldap/src/main/java/org/apache/directory/shared/ldap/codec/decorators/SearchResultReferenceDecorator.java>:[160,40]
computeReferralLength(org.apache.directory.shared.ldap.model.message.Referral) has private
access in org.apache.directory.shared.ldap.codec.LdapEncoder
[INFO] 4 errors 
[INFO] -------------------------------------------------------------
mojoFailed org.apache.maven.plugins:maven-compiler-plugin:2.3.2(default-compile)
projectFailed org.apache.directory.shared:shared-ldap:0.9.20-SNAPSHOT
[HUDSON] Archiving <https://hudson.apache.org/hudson/job/dir-shared-jdk15-ubuntu-deploy/ws/trunk/ldap/pom.xml>
to /home/hudson/hudson/jobs/dir-shared-jdk15-ubuntu-deploy/modules/org.apache.directory.shared$shared-ldap/builds/2011-01-29_03-31-34/archive/org.apache.directory.shared/shared-ldap/0.9.20-SNAPSHOT/pom.xml
sessionEnded
[INFO] ------------------------------------------------------------------------
[INFO] Reactor Summary:
[INFO] 
[INFO] Apache Directory Shared ........................... SUCCESS [15.779s]
[INFO] Apache Directory Shared I18n ...................... SUCCESS [9.500s]
[INFO] Apache Directory Shared Utilities ................. SUCCESS [20.052s]
[INFO] Apache Directory Shared ASN.1 API ................. SUCCESS [7.681s]
[INFO] Apache Directory Shared ASN.1 BER ................. SUCCESS [7.436s]
[INFO] Apache Directory Shared LDAP ...................... FAILURE [25.529s]
[INFO] Apache Directory Shared LDAP Schema ............... SKIPPED
[INFO] Apache Directory Shared Integration Tests ......... SKIPPED
[INFO] Apache Directory Shared All ....................... SKIPPED
[INFO] Apache Directory Shared LDAP Schema Converter ..... SKIPPED
[INFO] Apache Directory LDAP Client API .................. SKIPPED
[INFO] Apache Directory Shared DSML Parser ............... SKIPPED
[INFO] Apache Directory Shared DSML Engine ............... SKIPPED
[INFO] ------------------------------------------------------------------------
[INFO] BUILD FAILURE
[INFO] ------------------------------------------------------------------------
[INFO] Total time: 1:35.573s
[INFO] Finished at: Sat Jan 29 03:33:34 UTC 2011
[INFO] Final Memory: 19M/107M
[INFO] ------------------------------------------------------------------------
maven builder waiting
mavenExecutionResult exceptions not empty
org.apache.maven.lifecycle.LifecycleExecutionException: Failed to execute goal org.apache.maven.plugins:maven-compiler-plugin:2.3.2:compile
(default-compile) on project shared-ldap: Compilation failure
	at org.apache.maven.lifecycle.internal.MojoExecutor.execute(MojoExecutor.java:213)
	at org.apache.maven.lifecycle.internal.MojoExecutor.execute(MojoExecutor.java:153)
	at org.apache.maven.lifecycle.internal.MojoExecutor.execute(MojoExecutor.java:145)
	at org.apache.maven.lifecycle.internal.LifecycleModuleBuilder.buildProject(LifecycleModuleBuilder.java:84)
	at org.apache.maven.lifecycle.internal.LifecycleModuleBuilder.buildProject(LifecycleModuleBuilder.java:59)
	at org.apache.maven.lifecycle.internal.LifecycleStarter.singleThreadedBuild(LifecycleStarter.java:183)
	at org.apache.maven.lifecycle.internal.LifecycleStarter.execute(LifecycleStarter.java:161)
	at org.apache.maven.DefaultMaven.doExecute(DefaultMaven.java:319)
	at org.apache.maven.DefaultMaven.execute(DefaultMaven.java:156)
	at org.jvnet.hudson.maven3.launcher.Maven3Launcher.main(Maven3Launcher.java:79)
	at sun.reflect.NativeMethodAccessorImpl.invoke0(Native Method)
	at sun.reflect.NativeMethodAccessorImpl.invoke(NativeMethodAccessorImpl.java:39)
	at sun.reflect.DelegatingMethodAccessorImpl.invoke(DelegatingMethodAccessorImpl.java:25)
	at java.lang.reflect.Method.invoke(Method.java:592)
	at org.codehaus.plexus.classworlds.launcher.Launcher.launchStandard(Launcher.java:329)
	at org.codehaus.plexus.classworlds.launcher.Launcher.launch(Launcher.java:239)
	at org.jvnet.hudson.maven3.agent.Maven3Main.launch(Maven3Main.java:145)
	at hudson.maven.Maven3Builder.call(Maven3Builder.java:124)
	at hudson.maven.Maven3Builder.call(Maven3Builder.java:71)
	at hudson.remoting.UserRequest.perform(UserRequest.java:114)
	at hudson.remoting.UserRequest.perform(UserRequest.java:48)
	at hudson.remoting.Request$2.run(Request.java:270)
	at java.util.concurrent.Executors$RunnableAdapter.call(Executors.java:417)
	at java.util.concurrent.FutureTask$Sync.innerRun(FutureTask.java:269)
	at java.util.concurrent.FutureTask.run(FutureTask.java:123)
	at java.util.concurrent.ThreadPoolExecutor$Worker.runTask(ThreadPoolExecutor.java:651)
	at java.util.concurrent.ThreadPoolExecutor$Worker.run(ThreadPoolExecutor.java:676)
	at java.lang.Thread.run(Thread.java:595)
Caused by: org.apache.maven.plugin.CompilationFailureException: Compilation failure
	at org.apache.maven.plugin.AbstractCompilerMojo.execute(AbstractCompilerMojo.java:656)
	at org.apache.maven.plugin.CompilerMojo.execute(CompilerMojo.java:128)
	at org.apache.maven.plugin.DefaultBuildPluginManager.executeMojo(DefaultBuildPluginManager.java:107)
	at org.apache.maven.lifecycle.internal.MojoExecutor.execute(MojoExecutor.java:209)
	... 27 more
Sending e-mails to: notifications@directory.apache.org
channel stopped


Mime
View raw message